maven-notifications mailing list archives

Site index · List index
Message view « Date » · « Thread »
Top « Date » · « Thread »
From Continuum Build Server <contin...@ci.codehaus.org>
Subject [continuum] BUILD FAILURE: Maven Repository Application
Date Sat, 15 Jul 2006 17:06:59 GMT
Online report : http://ci.codehaus.org/continuum-maven/servlet/continuum/target/ProjectBuild.vm/view/ProjectBuild/id/107/buildId/6669
Build statistics:
  State: Failed
  Previous State: Failed
  Started at: Sat, 15 Jul 2006 10:06:48 -0700
  Finished at: Sat, 15 Jul 2006 10:06:59 -0700
  Total time: 10s
  Build Trigger: Forced
  Exit code: 1
  Building machine hostname: cheddar.simulalabs.com
  Operating system : Linux(unknown)
  Java version : 1.5.0_03(Sun Microsystems Inc.)

Changes
      No files changed
  
****************************************************************************
Output:
****************************************************************************
[INFO] Scanning for projects...
[INFO] ----------------------------------------------------------------------------
[INFO] Building Maven Repository Application
[INFO]    task-segment: [clean, install]
[INFO] ----------------------------------------------------------------------------
[INFO] artifact org.apache.maven.plugins:maven-clean-plugin: checking for updates from codehaus.snapshots
[INFO] snapshot org.apache.maven.plugins:maven-clean-plugin:2.1.1-SNAPSHOT: checking for updates
from codehaus.snapshots
[INFO] snapshot org.apache.maven.plugins:maven-plugins:2-SNAPSHOT: checking for updates from
codehaus.snapshots
[INFO] snapshot org.codehaus.plexus:plexus-maven-plugin:1.3-SNAPSHOT: checking for updates
from codehaus.snapshots
[INFO] snapshot org.codehaus.plexus:plexus-maven-plugin:1.3-SNAPSHOT: checking for updates
from apache.snapshots
[INFO] snapshot org.codehaus.plexus:plexus:1.0.8-SNAPSHOT: checking for updates from codehaus.snapshots
[INFO] snapshot org.codehaus.plexus:plexus:1.0.8-SNAPSHOT: checking for updates from apache.snapshots
[INFO] artifact org.codehaus.mojo:cobertura-maven-plugin: checking for updates from codehaus.snapshots
[INFO] snapshot org.codehaus.mojo:cobertura-maven-plugin:2.1-SNAPSHOT: checking for updates
from codehaus.snapshots
[INFO] [clean:clean]
[INFO] Deleting directory /home/continuum/continuum-maven/working-directory/107/target
[INFO] Deleting directory /home/continuum/continuum-maven/working-directory/107/target/classes
[INFO] Deleting directory /home/continuum/continuum-maven/working-directory/107/target/test-classes
[INFO] artifact org.apache.maven.plugins:maven-resources-plugin: checking for updates from
codehaus.snapshots
[INFO] snapshot org.apache.maven.plugins:maven-resources-plugin:2.3-SNAPSHOT: checking for
updates from codehaus.snapshots
[INFO] artifact org.apache.maven.plugins:maven-compiler-plugin: checking for updates from
codehaus.snapshots
[INFO] snapshot org.apache.maven.plugins:maven-compiler-plugin:2.1-SNAPSHOT: checking for
updates from codehaus.snapshots
[INFO] artifact org.apache.maven.plugins:maven-surefire-plugin: checking for updates from
codehaus.snapshots
[INFO] snapshot org.apache.maven.plugins:maven-surefire-plugin:2.3-SNAPSHOT: checking for
updates from codehaus.snapshots
[INFO] artifact org.apache.maven.plugins:maven-jar-plugin: checking for updates from codehaus.snapshots
[INFO] snapshot org.apache.maven.plugins:maven-jar-plugin:2.1-SNAPSHOT: checking for updates
from codehaus.snapshots
[INFO] artifact org.apache.maven.plugins:maven-install-plugin: checking for updates from codehaus.snapshots
[INFO] snapshot org.apache.maven.plugins:maven-install-plugin:2.2-SNAPSHOT: checking for updates
from codehaus.snapshots
[INFO] snapshot org.codehaus.plexus:plexus-cdc:1.0-alpha-5-SNAPSHOT: checking for updates
from codehaus.snapshots
[INFO] snapshot org.codehaus.plexus:plexus-cdc:1.0-alpha-5-SNAPSHOT: checking for updates
from apache-snapshots
[INFO] snapshot org.codehaus.plexus:plexus-cdc:1.0-alpha-5-SNAPSHOT: checking for updates
from codehaus-snapshots
[INFO] [plexus:descriptor {execution: default}]
[INFO] [resources:resources]
[INFO] Using default encoding to copy filtered resources.
[INFO] snapshot org.apache.maven.repository:maven-repository-discovery:1.0-SNAPSHOT: checking
for updates from apache.snapshots
[WARNING] 
	Artifact junit:junit:jar:3.8.1:test retains local scope 'test' overriding broader scope 'compile'
	given by a dependency. If this is not intended, modify or remove the local scope.

[INFO] snapshot org.apache.maven.repository:maven-repository-indexer:1.0-SNAPSHOT: checking
for updates from apache.snapshots
[INFO] snapshot org.codehaus.plexus:plexus-compiler-javac:1.6-SNAPSHOT: checking for updates
from codehaus.snapshots
[INFO] snapshot org.codehaus.plexus:plexus-compilers:1.6-SNAPSHOT: checking for updates from
codehaus.snapshots
[INFO] snapshot org.codehaus.plexus:plexus-compiler:1.6-SNAPSHOT: checking for updates from
codehaus.snapshots
[INFO] snapshot org.codehaus.plexus:plexus-compiler-api:1.6-SNAPSHOT: checking for updates
from codehaus.snapshots
[INFO] [compiler:compile]
Compiling 2 source files to /home/continuum/continuum-maven/working-directory/107/target/classes
[INFO] ------------------------------------------------------------------------
[ERROR] BUILD FAILURE
[INFO] ------------------------------------------------------------------------
[INFO] Compilation failure

/home/continuum/continuum-maven/working-directory/107/src/main/java/org/apache/maven/repository/manager/cli/IndexCli.java:[87,17]
cannot find symbol
symbol  : method close()
location: class org.apache.maven.repository.indexing.ArtifactRepositoryIndex

/home/continuum/continuum-maven/working-directory/107/src/main/java/org/apache/maven/repository/manager/cli/IndexSearcherCli.java:[78,17]
cannot find symbol
symbol  : method close()
location: class org.apache.maven.repository.indexing.ArtifactRepositoryIndex


[INFO] ------------------------------------------------------------------------
[INFO] For more information, run Maven with the -e switch
[INFO] ------------------------------------------------------------------------
[INFO] Total time: 9 seconds
[INFO] Finished at: Sat Jul 15 10:06:59 PDT 2006
[INFO] Final Memory: 10M/141M
[INFO] ------------------------------------------------------------------------

****************************************************************************



Mime
View raw message