maven-notifications mailing list archives

Site index · List index
Message view « Date » · « Thread »
Top « Date » · « Thread »
From "Continuum@maven.zones.apache.org" <contin...@maven.zones.apache.org>
Subject [continuum] BUILD FAILURE: Continuum Core
Date Thu, 01 Feb 2007 08:15:54 GMT
Online report : http://maven.zones.apache.org/continuum/buildResult.action?buildId=5172&projectId=102
Build statistics:
  State: Failed
  Previous State: Failed
  Started at: Thu, 1 Feb 2007 08:14:15 +0000
  Finished at: Thu, 1 Feb 2007 08:15:44 +0000
  Total time: 1m 29s
  Build Trigger: Schedule
  Build Number: 45
  Exit code: 1
  Building machine hostname: maven.zones.apache.org
  Operating system : SunOS(unknown)
  Java version : 1.5.0_10(Sun Microsystems Inc.)

****************************************************************************
SCM Changes:
****************************************************************************
No files changed

****************************************************************************
SCM Changes since last success:
****************************************************************************
****************************************************************************
Dependencies Changes:
****************************************************************************
org.apache.maven.continuum:continuum-release:1.1-SNAPSHOT

****************************************************************************
Test Summary:
****************************************************************************
Tests: 239
Failures: 31
Total time: 11349

****************************************************************************
Output:
****************************************************************************
[INFO] Scanning for projects...
[INFO] ----------------------------------------------------------------------------
[INFO] Building Continuum Core
[INFO]    task-segment: [clean, install]
[INFO] ----------------------------------------------------------------------------
[INFO] [clean:clean]
[INFO] Deleting directory /export/home/continuum/continuum_data/working-directory/102/target
[INFO] Deleting directory /export/home/continuum/continuum_data/working-directory/102/target/classes
[INFO] Deleting directory /export/home/continuum/continuum_data/working-directory/102/target/test-classes
[INFO] [plexus:descriptor {execution: generate}]
[WARNING] Component: MavenTwoContinuumProjectBuilder, field name: 'excludedPackagingTypes':
Currently configurable fields will not be written to the descriptor without a default value.
[INFO] [resources:resources]
[INFO] Using default encoding to copy filtered resources.
[INFO] Copying 6 resources
[INFO] Copying 1 resource
[INFO] [plexus:merge-descriptors {execution: merge}]
[WARNING] 
	Artifact junit:junit:jar:3.8.1:test retains local scope 'test' overriding broader scope 'compile'
	given by a dependency. If this is not intended, modify or remove the local scope.

[WARNING] 
	Artifact org.apache.maven.scm:maven-scm-provider-local:jar:1.0-beta-4:test retains local
scope 'test' overriding broader scope 'compile'
	given by a dependency. If this is not intended, modify or remove the local scope.

[INFO] [compiler:compile]
[INFO] Compiling 80 source files to /export/home/continuum/continuum_data/working-directory/102/target/classes
[INFO] [resources:testResources]
[INFO] Using default encoding to copy filtered resources.
[INFO] Copying 20 resources
[INFO] [compiler:testCompile]
[INFO] Compiling 16 source files to /export/home/continuum/continuum_data/working-directory/102/target/test-classes
[INFO] [surefire:test]
[INFO] Surefire report directory: /export/home/continuum/continuum_data/working-directory/102/target/surefire-reports

-------------------------------------------------------
 T E S T S
-------------------------------------------------------
Running org.apache.maven.continuum.project.builder.maven.MavenTwoContinuumProjectBuilderTest
Tests run: 5, Failures: 0, Errors: 5, Skipped: 0, Time elapsed: 2.433 sec <<< FAILURE!
Running org.apache.maven.continuum.TestAction
Tests run: 0, Failures: 0, Errors: 0, Skipped: 0, Time elapsed: 0.001 sec
Running org.apache.maven.continuum.project.builder.maven.MavenOneContinuumProjectBuilderTest
Tests run: 1, Failures: 0, Errors: 1, Skipped: 0, Time elapsed: 0.764 sec <<< FAILURE!
Running org.apache.maven.continuum.core.action.CreateProjectsFromMetadataTest
[INFO] checking for settings auth setup
Tests run: 1, Failures: 0, Errors: 0, Skipped: 0, Time elapsed: 0.299 sec
Running org.apache.maven.continuum.buildqueue.BuildQueueTest
Tests run: 3, Failures: 0, Errors: 3, Skipped: 0, Time elapsed: 1.55 sec <<< FAILURE!
Running org.apache.maven.continuum.configuration.ConfigurationServiceTest
Tests run: 1, Failures: 0, Errors: 1, Skipped: 0, Time elapsed: 0.076 sec <<< FAILURE!
Running org.apache.maven.continuum.notification.mail.FormatterToolTest
Tests run: 1, Failures: 0, Errors: 0, Skipped: 0, Time elapsed: 0.003 sec
Running org.apache.maven.continuum.notification.mail.MailContinuumNotifierTest
Tests run: 3, Failures: 0, Errors: 3, Skipped: 0, Time elapsed: 1.057 sec <<< FAILURE!
Running org.apache.maven.continuum.execution.manager.DefaultBuildExecutorManagerTest
Tests run: 1, Failures: 0, Errors: 1, Skipped: 0, Time elapsed: 0.635 sec <<< FAILURE!
Running org.apache.maven.continuum.scm.ContinuumScmTest
Tests run: 1, Failures: 0, Errors: 1, Skipped: 0, Time elapsed: 1.19 sec <<< FAILURE!
Running org.apache.maven.continuum.execution.maven.m1.MavenOneBuildExecutorTest
Tests run: 4, Failures: 0, Errors: 4, Skipped: 0, Time elapsed: 0.412 sec <<< FAILURE!
Running org.apache.maven.continuum.utils.ProjectSorterTest
Tests run: 2, Failures: 0, Errors: 0, Skipped: 0, Time elapsed: 0.047 sec
Running org.apache.maven.continuum.notification.ContinuumNotificationDispatcherTest
Tests run: 1, Failures: 0, Errors: 1, Skipped: 0, Time elapsed: 0.101 sec <<< FAILURE!
Running org.apache.maven.continuum.DefaultContinuumTest
Tests run: 8, Failures: 0, Errors: 8, Skipped: 0, Time elapsed: 2.524 sec <<< FAILURE!
Running org.apache.maven.continuum.buildcontroller.DefaultBuildControllerTest
Tests run: 3, Failures: 0, Errors: 3, Skipped: 0, Time elapsed: 0.254 sec <<< FAILURE!

Results :
Tests run: 35, Failures: 0, Errors: 31, Skipped: 0

[INFO] ------------------------------------------------------------------------
[ERROR] BUILD FAILURE
[INFO] ------------------------------------------------------------------------
[INFO] There are test failures.
[INFO] ------------------------------------------------------------------------
[INFO] For more information, run Maven with the -e switch
[INFO] ------------------------------------------------------------------------
[INFO] Total time: 1 minute 24 seconds
[INFO] Finished at: Thu Feb 01 08:15:44 GMT+00:00 2007
[INFO] Final Memory: 19M/80M
[INFO] ------------------------------------------------------------------------

****************************************************************************



Mime
View raw message