maven-notifications mailing list archives

Site index · List index
Message view « Date » · « Thread »
Top « Date » · « Thread »
From "Continuum@maven.zones.apache.org" <contin...@maven.zones.apache.org>
Subject [continuum] BUILD FAILURE: Maven Source Plug-In
Date Wed, 07 Feb 2007 16:42:18 GMT
Online report : http://maven.zones.apache.org/continuum/buildResult.action?buildId=6070&projectId=33
Build statistics:
  State: Failed
  Previous State: Failed
  Started at: Wed, 7 Feb 2007 16:40:26 +0000
  Finished at: Wed, 7 Feb 2007 16:42:17 +0000
  Total time: 1m 50s
  Build Trigger: Schedule
  Build Number: 34
  Exit code: 1
  Building machine hostname: maven.zones.apache.org
  Operating system : SunOS(unknown)
  Java version : 1.5.0_10(Sun Microsystems Inc.)

****************************************************************************
SCM Changes:
****************************************************************************
No files changed

****************************************************************************
SCM Changes since last success:
****************************************************************************
Changed: no author @ no date
Comment: no comment
Files changed:
  src/test/java/org/apache/maven/plugin/source/AbstractSourcePluginTestCase.java ( no revision
)
  src/test/java/org/apache/maven/plugin/source/SourceJarMojoTest.java ( no revision )
  src/test/java/org/apache/maven/plugin/source/TestSourceJarMojoTest.java ( no revision )
  src/test/resources/projects/project-001/src/main/java/foo/project001/App.java ( no revision
)
  src/test/resources/projects/project-001/src/main/resources/default-configuration.properties
( no revision )
  src/test/resources/projects/project-001/pom.xml ( no revision )
  src/test/resources/projects/project-002/src/test/java/foo/project002/AppTest.java ( no revision
)
  src/test/resources/projects/project-002/src/test/resources/test-default-configuration.properties
( no revision )
  src/test/resources/projects/project-002/src/main/java/foo/project002/App.java ( no revision
)
  src/test/resources/projects/project-002/src/main/resources/default-configuration.properties
( no revision )
  src/test/resources/projects/project-002/pom.xml ( no revision )
  src/test/resources/projects/project-003/src/main/java/foo/project003/App.java ( no revision
)
  src/test/resources/projects/project-003/src/main/resources/default-configuration.properties
( no revision )
  src/test/resources/projects/project-003/src/main/resources/excluded-file.txt ( no revision
)
  src/test/resources/projects/project-003/src/main/resources/.cvsignore ( no revision )
  src/test/resources/projects/project-003/pom.xml ( no revision )
  src/test/resources/projects/project-004/src/test/java/foo/project004/AppTest.java ( no revision
)
  src/test/resources/projects/project-004/src/test/resources/test-default-configuration.properties
( no revision )
  src/test/resources/projects/project-004/src/test/resources/excluded-file.txt ( no revision
)
  src/test/resources/projects/project-004/src/test/resources/.cvsignore ( no revision )
  src/test/resources/projects/project-004/src/main/java/foo/project004/App.java ( no revision
)
  src/test/resources/projects/project-004/src/main/resources/default-configuration.properties
( no revision )
  src/test/resources/projects/project-004/pom.xml ( no revision )
  src/test/resources/projects/project-005/pom.xml ( no revision )
  src/test/resources/projects/project-006/pom.xml ( no revision )
  src/test/resources/projects/project-007/src/main/java/foo/project007/App.java ( no revision
)
  src/test/resources/projects/project-007/src/main/resources/default-configuration.properties
( no revision )
  src/test/resources/projects/project-007/src/main/resources/templates/configuration-template.properties
( no revision )
  src/test/resources/projects/project-007/pom.xml ( no revision )
  src/main/java/org/apache/maven/plugin/source/AbstractSourceJarMojo.java ( no revision )
  pom.xml ( no revision )

****************************************************************************
Dependencies Changes:
****************************************************************************
org.apache.maven.plugins:maven-plugins:8-SNAPSHOT

****************************************************************************
Test Summary:
****************************************************************************
Tests: 9
Failures: 4
Total time: 82591

****************************************************************************
Output:
****************************************************************************
[INFO] Scanning for projects...
[INFO] ----------------------------------------------------------------------------
[INFO] Building Maven Source Plug-In
[INFO]    task-segment: [clean, install]
[INFO] ----------------------------------------------------------------------------
[INFO] [clean:clean]
[INFO] Deleting directory /export/home/continuum/continuum_data/working-directory/33/target
[INFO] Deleting directory /export/home/continuum/continuum_data/working-directory/33/target/classes
[INFO] Deleting directory /export/home/continuum/continuum_data/working-directory/33/target/test-classes
[INFO] [plugin:descriptor]
[INFO] Using 2 extractors.
[INFO] Applying extractor for language: java
[INFO] Extractor for language: java found 3 mojo descriptors.
[INFO] Applying extractor for language: bsh
[INFO] Extractor for language: bsh found 0 mojo descriptors.
[INFO] [resources:resources]
[INFO] Using default encoding to copy filtered resources.
[INFO] Copying 1 resource
[INFO] [compiler:compile]
[INFO] Compiling 4 source files to /export/home/continuum/continuum_data/working-directory/33/target/classes
[INFO] [resources:testResources]
[INFO] Using default encoding to copy filtered resources.
[INFO] Copying 24 resources
[INFO] [compiler:testCompile]
[INFO] Compiling 3 source files to /export/home/continuum/continuum_data/working-directory/33/target/test-classes
[INFO] [surefire:test]
[INFO] Surefire report directory: /export/home/continuum/continuum_data/working-directory/33/target/surefire-reports

-------------------------------------------------------
 T E S T S
-------------------------------------------------------
Running org.apache.maven.plugin.source.SourceJarMojoTest
Tests run: 4, Failures: 2, Errors: 0, Skipped: 0, Time elapsed: 41.964 sec <<< FAILURE!
Running org.apache.maven.plugin.source.TestSourceJarMojoTest
Tests run: 3, Failures: 2, Errors: 0, Skipped: 0, Time elapsed: 40.602 sec <<< FAILURE!

Results :

Failed tests: 
  testProject003(org.apache.maven.plugin.source.SourceJarMojoTest)
  testProject005(org.apache.maven.plugin.source.SourceJarMojoTest)
  testProject004(org.apache.maven.plugin.source.TestSourceJarMojoTest)
  testProject006(org.apache.maven.plugin.source.TestSourceJarMojoTest)

Tests run: 7, Failures: 4, Errors: 0, Skipped: 0

[INFO] ------------------------------------------------------------------------
[ERROR] BUILD FAILURE
[INFO] ------------------------------------------------------------------------
[INFO] There are test failures.
[INFO] ------------------------------------------------------------------------
[INFO] For more information, run Maven with the -e switch
[INFO] ------------------------------------------------------------------------
[INFO] Total time: 1 minute 46 seconds
[INFO] Finished at: Wed Feb 07 16:42:16 GMT+00:00 2007
[INFO] Final Memory: 9M/69M
[INFO] ------------------------------------------------------------------------

****************************************************************************



Mime
View raw message