maven-notifications mailing list archives

Site index · List index
Message view « Date » · « Thread »
Top « Date » · « Thread »
From "Continuum@maven.zones.apache.org" <contin...@maven.zones.apache.org>
Subject [continuum] BUILD FAILURE: Maven Wagon WebDav Provider
Date Tue, 06 Feb 2007 17:23:29 GMT
Online report : http://maven.zones.apache.org/continuum/buildResult.action?buildId=5871&projectId=232
Build statistics:
  State: Failed
  Previous State: Ok
  Started at: Tue, 6 Feb 2007 17:23:17 +0000
  Finished at: Tue, 6 Feb 2007 17:23:28 +0000
  Total time: 11s
  Build Trigger: Schedule
  Build Number: 5
  Exit code: 1
  Building machine hostname: maven.zones.apache.org
  Operating system : SunOS(unknown)
  Java version : 1.5.0_10(Sun Microsystems Inc.)

****************************************************************************
SCM Changes:
****************************************************************************
Changed: no author @ no date
Comment: no comment
Files changed:
  src/main/java/org/apache/maven/wagon/providers/webdav/WebDavWagon.java ( no revision )
  pom.xml ( no revision )

****************************************************************************
SCM Changes since last success:
****************************************************************************
****************************************************************************
Dependencies Changes:
****************************************************************************
No dependencies changed

****************************************************************************
Test Summary:
****************************************************************************
Tests: 21
Failures: 19
Total time: 2969

****************************************************************************
Output:
****************************************************************************
[INFO] Scanning for projects...
[INFO] ----------------------------------------------------------------------------
[INFO] Building Maven Wagon WebDav Provider
[INFO]    task-segment: [clean, install]
[INFO] ----------------------------------------------------------------------------
[INFO] [clean:clean]
[INFO] Deleting directory /export/home/continuum/continuum_data/working-directory/232/target
[INFO] Deleting directory /export/home/continuum/continuum_data/working-directory/232/target/classes
[INFO] Deleting directory /export/home/continuum/continuum_data/working-directory/232/target/test-classes
[INFO] [resources:resources]
[INFO] Using default encoding to copy filtered resources.
[INFO] Copying 0 resource
[WARNING] 
	Artifact commons-logging:commons-logging:jar:1.0.4:runtime retains local scope 'runtime'
overriding broader scope 'compile'
	given by a dependency. If this is not intended, modify or remove the local scope.

Downloading: http://repo.mergere.com/maven2/org/mortbay/jetty/jetty/4.2.12/jetty-4.2.12.pom
[WARNING] Unable to get resource from repository central (http://repo1.maven.org/maven2)
[INFO] [compiler:compile]
[INFO] Compiling 3 source files to /export/home/continuum/continuum_data/working-directory/232/target/classes
[INFO] [resources:testResources]
[INFO] Using default encoding to copy filtered resources.
[INFO] Copying 2 resources
[INFO] [compiler:testCompile]
[INFO] Compiling 7 source files to /export/home/continuum/continuum_data/working-directory/232/target/test-classes
[INFO] [surefire:test]
[INFO] Surefire report directory: /export/home/continuum/continuum_data/working-directory/232/target/surefire-reports

-------------------------------------------------------
 T E S T S
-------------------------------------------------------
Running org.apache.maven.wagon.providers.webdav.PutInputStreamTest
Tests run: 1, Failures: 0, Errors: 0, Skipped: 0, Time elapsed: 0.672 sec
Running org.apache.maven.wagon.providers.webdav.WebDavWagonGzipTest
17:23:25.446 EVENT  Checking Resource aliases
17:23:25.504 EVENT  Starting Jetty/4.2.12
17:23:25.507 EVENT  Started HttpContext[/]
17:23:25.575 EVENT  Started SocketListener on 0.0.0.0:10008
17:23:25.576 EVENT  Started org.mortbay.http.HttpServer@10a3b24
17:23:26.240 EVENT  Stopping Acceptor ServerSocket[addr=0.0.0.0/0.0.0.0,port=0,localport=10008]
17:23:26.245 EVENT  Stopped SocketListener on 0.0.0.0:10008
17:23:26.246 EVENT  Stopped HttpContext[/]
17:23:26.247 EVENT  Stopped org.mortbay.http.HttpServer@10a3b24
Tests run: 1, Failures: 0, Errors: 0, Skipped: 0, Time elapsed: 0.899 sec
Running org.apache.maven.wagon.providers.webdav.WebDavWagonTest
Local repository: file:///export/home/continuum/continuum_data/working-directory/232/target/test-output/local-repository
17:23:26.751 EVENT  Starting Jetty/4.2.12
17:23:26.759 EVENT  Started ServletHttpContext[/dav]
17:23:26.760 EVENT  Started SocketListener on 0.0.0.0:10007
Putting test artifact: test-resource into test repository dav:http://localhost:10007
17:23:26.760 EVENT  Started org.mortbay.jetty.Server@1b1fbf4
17:23:26.763 EVENT  Stopping Acceptor ServerSocket[addr=0.0.0.0/0.0.0.0,port=0,localport=10007]
17:23:26.764 EVENT  Stopped SocketListener on 0.0.0.0:10007
17:23:26.765 EVENT  Stopped ServletHttpContext[/dav]
17:23:26.765 EVENT  Stopped org.mortbay.jetty.Server@1b1fbf4
17:23:26.918 EVENT  Starting Jetty/4.2.12
17:23:26.919 EVENT  Started ServletHttpContext[/dav]
17:23:26.920 EVENT  Started SocketListener on 0.0.0.0:10007
17:23:26.920 EVENT  Started org.mortbay.jetty.Server@1d53f5b
17:23:26.921 EVENT  Stopping Acceptor ServerSocket[addr=0.0.0.0/0.0.0.0,port=0,localport=10007]
17:23:26.922 EVENT  Stopped SocketListener on 0.0.0.0:10007
17:23:26.923 EVENT  Stopped ServletHttpContext[/dav]
17:23:26.923 EVENT  Stopped org.mortbay.jetty.Server@1d53f5b
17:23:26.962 EVENT  Starting Jetty/4.2.12
17:23:26.963 EVENT  Started ServletHttpContext[/dav]
17:23:26.964 EVENT  Started SocketListener on 0.0.0.0:10007
17:23:26.964 EVENT  Started org.mortbay.jetty.Server@4ee70b
17:23:26.965 EVENT  Stopping Acceptor ServerSocket[addr=0.0.0.0/0.0.0.0,port=0,localport=10007]
17:23:26.965 EVENT  Stopped SocketListener on 0.0.0.0:10007
17:23:26.966 EVENT  Stopped ServletHttpContext[/dav]
17:23:26.966 EVENT  Stopped org.mortbay.jetty.Server@4ee70b
17:23:27.026 EVENT  Starting Jetty/4.2.12
17:23:27.027 EVENT  Started ServletHttpContext[/dav]
17:23:27.028 EVENT  Started SocketListener on 0.0.0.0:10007
17:23:27.028 EVENT  Started org.mortbay.jetty.Server@1bde4
17:23:27.029 EVENT  Stopping Acceptor ServerSocket[addr=0.0.0.0/0.0.0.0,port=0,localport=10007]
17:23:27.029 EVENT  Stopped SocketListener on 0.0.0.0:10007
17:23:27.030 EVENT  Stopped ServletHttpContext[/dav]
17:23:27.030 EVENT  Stopped org.mortbay.jetty.Server@1bde4
17:23:27.067 EVENT  Starting Jetty/4.2.12
17:23:27.068 EVENT  Started ServletHttpContext[/dav]
17:23:27.069 EVENT  Started SocketListener on 0.0.0.0:10007
17:23:27.069 EVENT  Started org.mortbay.jetty.Server@81b1fb
17:23:27.132 EVENT  Stopping Acceptor ServerSocket[addr=0.0.0.0/0.0.0.0,port=0,localport=10007]
17:23:27.132 EVENT  Stopped SocketListener on 0.0.0.0:10007
17:23:27.133 EVENT  Stopped ServletHttpContext[/dav]
17:23:27.133 EVENT  Stopped org.mortbay.jetty.Server@81b1fb
[ERROR] Nonexistent component: org.apache.maven.wagon.Wagondav
Local repository: file:///export/home/continuum/continuum_data/working-directory/232/target/test-output/local-repository
File round trip testing ...
Putting test artifact: test-resource into test repository dav:http://localhost:10007/dav/newfolder/folder2
[ERROR] Nonexistent component: org.apache.maven.wagon.Wagondav
Local repository: file:///export/home/continuum/continuum_data/working-directory/232/target/test-output/local-repository
[ERROR] Nonexistent component: org.apache.maven.wagon.Wagondav
Local repository: file:///export/home/continuum/continuum_data/working-directory/232/target/test-output/local-repository
[ERROR] Nonexistent component: org.apache.maven.wagon.Wagondav
Local repository: file:///export/home/continuum/continuum_data/working-directory/232/target/test-output/local-repository
[ERROR] Nonexistent component: org.apache.maven.wagon.Wagondav
Local repository: file:///export/home/continuum/continuum_data/working-directory/232/target/test-output/local-repository
17:23:27.181 EVENT  Starting Jetty/4.2.12
17:23:27.182 EVENT  Started ServletHttpContext[/dav]
17:23:27.183 EVENT  Started SocketListener on 0.0.0.0:10007
17:23:27.183 EVENT  Started org.mortbay.jetty.Server@f18e8e
Getting test artifact from test repository dav:http://localhost:10007/dav/newfolder/folder2
[ERROR] Nonexistent component: org.apache.maven.wagon.Wagondav
17:23:27.222 EVENT  Stopping Acceptor ServerSocket[addr=0.0.0.0/0.0.0.0,port=0,localport=10007]
17:23:27.223 EVENT  Stopped SocketListener on 0.0.0.0:10007
17:23:27.224 EVENT  Stopped ServletHttpContext[/dav]
17:23:27.224 EVENT  Stopped org.mortbay.jetty.Server@f18e8e
Local repository: file:///export/home/continuum/continuum_data/working-directory/232/target/test-output/local-repository
17:23:27.259 EVENT  Starting Jetty/4.2.12
17:23:27.260 EVENT  Started ServletHttpContext[/dav]
17:23:27.262 EVENT  Started SocketListener on 0.0.0.0:10007
17:23:27.263 EVENT  Started org.mortbay.jetty.Server@1dc423f
Putting test artifact: file-list/test-resource.txt into test repository dav:http://localhost:10007/dav/newfolder/folder2
[ERROR] Nonexistent component: org.apache.maven.wagon.Wagondav
17:23:27.264 EVENT  Stopping Acceptor ServerSocket[addr=0.0.0.0/0.0.0.0,port=0,localport=10007]
17:23:27.265 EVENT  Stopped SocketListener on 0.0.0.0:10007
17:23:27.265 EVENT  Stopped ServletHttpContext[/dav]
17:23:27.266 EVENT  Stopped org.mortbay.jetty.Server@1dc423f
Local repository: file:///export/home/continuum/continuum_data/working-directory/232/target/test-output/local-repository
17:23:27.308 EVENT  Starting Jetty/4.2.12
17:23:27.309 EVENT  Started ServletHttpContext[/dav]
17:23:27.310 EVENT  Started SocketListener on 0.0.0.0:10007
17:23:27.310 EVENT  Started org.mortbay.jetty.Server@1b0bdc8
[ERROR] Nonexistent component: org.apache.maven.wagon.Wagondav
17:23:27.311 EVENT  Stopping Acceptor ServerSocket[addr=0.0.0.0/0.0.0.0,port=0,localport=10007]
17:23:27.311 EVENT  Stopped SocketListener on 0.0.0.0:10007
17:23:27.312 EVENT  Stopped ServletHttpContext[/dav]
17:23:27.313 EVENT  Stopped org.mortbay.jetty.Server@1b0bdc8
Local repository: file:///export/home/continuum/continuum_data/working-directory/232/target/test-output/local-repository
17:23:27.356 EVENT  Starting Jetty/4.2.12
17:23:27.356 EVENT  Started ServletHttpContext[/dav]
17:23:27.357 EVENT  Started SocketListener on 0.0.0.0:10007
17:23:27.357 EVENT  Started org.mortbay.jetty.Server@ab444
[ERROR] Nonexistent component: org.apache.maven.wagon.Wagondav
17:23:27.365 EVENT  Stopping Acceptor ServerSocket[addr=0.0.0.0/0.0.0.0,port=0,localport=10007]
17:23:27.366 EVENT  Stopped SocketListener on 0.0.0.0:10007
17:23:27.368 EVENT  Stopped ServletHttpContext[/dav]
17:23:27.368 EVENT  Stopped org.mortbay.jetty.Server@ab444
Local repository: file:///export/home/continuum/continuum_data/working-directory/232/target/test-output/local-repository
17:23:27.385 EVENT  Starting Jetty/4.2.12
17:23:27.386 EVENT  Started ServletHttpContext[/dav]
17:23:27.387 EVENT  Started SocketListener on 0.0.0.0:10007
17:23:27.387 EVENT  Started org.mortbay.jetty.Server@15aed57
[ERROR] Nonexistent component: org.apache.maven.wagon.Wagondav
17:23:27.389 EVENT  Stopping Acceptor ServerSocket[addr=0.0.0.0/0.0.0.0,port=0,localport=10007]
17:23:27.389 EVENT  Stopped SocketListener on 0.0.0.0:10007
17:23:27.390 EVENT  Stopped ServletHttpContext[/dav]
17:23:27.391 EVENT  Stopped org.mortbay.jetty.Server@15aed57
Tests run: 10, Failures: 0, Errors: 10, Skipped: 0, Time elapsed: 1.161 sec <<< FAILURE!
Running org.apache.maven.wagon.providers.webdav.AuthenticatedWebDavWagonTest
Local repository: file:///export/home/continuum/continuum_data/working-directory/232/target/test-output/local-repository
17:23:27.458 EVENT  Starting Jetty/4.2.12
17:23:27.459 EVENT  Started ServletHttpContext[/authdav]
17:23:27.460 EVENT  Started SocketListener on 0.0.0.0:10007
17:23:27.461 EVENT  Started org.mortbay.jetty.Server@1724a9d
File round trip testing ...
Putting test artifact: test-resource into test repository dav:http://localhost:10007/authdav/newfolder/folder2
[ERROR] Nonexistent component: org.apache.maven.wagon.Wagondav
17:23:27.462 EVENT  Stopping Acceptor ServerSocket[addr=0.0.0.0/0.0.0.0,port=0,localport=10007]
17:23:27.463 EVENT  Stopped SocketListener on 0.0.0.0:10007
17:23:27.463 EVENT  Stopped ServletHttpContext[/authdav]
17:23:27.463 EVENT  Stopped org.mortbay.jetty.Server@1724a9d
Local repository: file:///export/home/continuum/continuum_data/working-directory/232/target/test-output/local-repository
17:23:27.483 EVENT  Starting Jetty/4.2.12
17:23:27.483 EVENT  Started ServletHttpContext[/authdav]
17:23:27.484 EVENT  Started SocketListener on 0.0.0.0:10007
17:23:27.485 EVENT  Started org.mortbay.jetty.Server@269997
[ERROR] Nonexistent component: org.apache.maven.wagon.Wagondav
17:23:27.485 EVENT  Stopping Acceptor ServerSocket[addr=0.0.0.0/0.0.0.0,port=0,localport=10007]
17:23:27.486 EVENT  Stopped SocketListener on 0.0.0.0:10007
17:23:27.486 EVENT  Stopped ServletHttpContext[/authdav]
17:23:27.487 EVENT  Stopped org.mortbay.jetty.Server@269997
Local repository: file:///export/home/continuum/continuum_data/working-directory/232/target/test-output/local-repository
17:23:27.502 EVENT  Starting Jetty/4.2.12
17:23:27.503 EVENT  Started ServletHttpContext[/authdav]
17:23:27.504 EVENT  Started SocketListener on 0.0.0.0:10007
17:23:27.504 EVENT  Started org.mortbay.jetty.Server@4865ce
[ERROR] Nonexistent component: org.apache.maven.wagon.Wagondav
17:23:27.507 EVENT  Stopping Acceptor ServerSocket[addr=0.0.0.0/0.0.0.0,port=0,localport=10007]
17:23:27.508 EVENT  Stopped SocketListener on 0.0.0.0:10007
17:23:27.508 EVENT  Stopped ServletHttpContext[/authdav]
17:23:27.508 EVENT  Stopped org.mortbay.jetty.Server@4865ce
Local repository: file:///export/home/continuum/continuum_data/working-directory/232/target/test-output/local-repository
17:23:27.529 EVENT  Starting Jetty/4.2.12
17:23:27.529 EVENT  Started ServletHttpContext[/authdav]
17:23:27.530 EVENT  Started SocketListener on 0.0.0.0:10007
17:23:27.531 EVENT  Started org.mortbay.jetty.Server@af72d8
[ERROR] Nonexistent component: org.apache.maven.wagon.Wagondav
17:23:27.532 EVENT  Stopping Acceptor ServerSocket[addr=0.0.0.0/0.0.0.0,port=0,localport=10007]
17:23:27.536 EVENT  Stopped SocketListener on 0.0.0.0:10007
17:23:27.538 EVENT  Stopped ServletHttpContext[/authdav]
17:23:27.540 EVENT  Stopped org.mortbay.jetty.Server@af72d8
Local repository: file:///export/home/continuum/continuum_data/working-directory/232/target/test-output/local-repository
17:23:27.586 EVENT  Starting Jetty/4.2.12
17:23:27.587 EVENT  Started ServletHttpContext[/authdav]
17:23:27.588 EVENT  Started SocketListener on 0.0.0.0:10007
17:23:27.588 EVENT  Started org.mortbay.jetty.Server@16d2702
Getting test artifact from test repository dav:http://localhost:10007/authdav/newfolder/folder2
[ERROR] Nonexistent component: org.apache.maven.wagon.Wagondav
17:23:27.590 EVENT  Stopping Acceptor ServerSocket[addr=0.0.0.0/0.0.0.0,port=0,localport=10007]
17:23:27.590 EVENT  Stopped SocketListener on 0.0.0.0:10007
17:23:27.592 EVENT  Stopped ServletHttpContext[/authdav]
17:23:27.592 EVENT  Stopped org.mortbay.jetty.Server@16d2702
Local repository: file:///export/home/continuum/continuum_data/working-directory/232/target/test-output/local-repository
17:23:27.639 EVENT  Starting Jetty/4.2.12
17:23:27.641 EVENT  Started ServletHttpContext[/authdav]
17:23:27.643 EVENT  Started SocketListener on 0.0.0.0:10007
17:23:27.643 EVENT  Started org.mortbay.jetty.Server@12b6c89
Putting test artifact: file-list/test-resource.txt into test repository dav:http://localhost:10007/authdav/newfolder/folder2
[ERROR] Nonexistent component: org.apache.maven.wagon.Wagondav
17:23:27.645 EVENT  Stopping Acceptor ServerSocket[addr=0.0.0.0/0.0.0.0,port=0,localport=10007]
17:23:27.645 EVENT  Stopped SocketListener on 0.0.0.0:10007
17:23:27.646 EVENT  Stopped ServletHttpContext[/authdav]
17:23:27.647 EVENT  Stopped org.mortbay.jetty.Server@12b6c89
Local repository: file:///export/home/continuum/continuum_data/working-directory/232/target/test-output/local-repository
17:23:27.677 EVENT  Starting Jetty/4.2.12
17:23:27.678 EVENT  Started ServletHttpContext[/authdav]
17:23:27.679 EVENT  Started SocketListener on 0.0.0.0:10007
17:23:27.680 EVENT  Started org.mortbay.jetty.Server@b7b3f9
[ERROR] Nonexistent component: org.apache.maven.wagon.Wagondav
17:23:27.681 EVENT  Stopping Acceptor ServerSocket[addr=0.0.0.0/0.0.0.0,port=0,localport=10007]
17:23:27.682 EVENT  Stopped SocketListener on 0.0.0.0:10007
17:23:27.683 EVENT  Stopped ServletHttpContext[/authdav]
17:23:27.683 EVENT  Stopped org.mortbay.jetty.Server@b7b3f9
Local repository: file:///export/home/continuum/continuum_data/working-directory/232/target/test-output/local-repository
17:23:27.701 EVENT  Starting Jetty/4.2.12
17:23:27.702 EVENT  Started ServletHttpContext[/authdav]
17:23:27.706 EVENT  Started SocketListener on 0.0.0.0:10007
17:23:27.706 EVENT  Started org.mortbay.jetty.Server@1490eb5
[ERROR] Nonexistent component: org.apache.maven.wagon.Wagondav
17:23:27.707 EVENT  Stopping Acceptor ServerSocket[addr=0.0.0.0/0.0.0.0,port=0,localport=10007]
17:23:27.708 EVENT  Stopped SocketListener on 0.0.0.0:10007
17:23:27.708 EVENT  Stopped ServletHttpContext[/authdav]
17:23:27.709 EVENT  Stopped org.mortbay.jetty.Server@1490eb5
Local repository: file:///export/home/continuum/continuum_data/working-directory/232/target/test-output/local-repository
17:23:27.728 EVENT  Starting Jetty/4.2.12
17:23:27.728 EVENT  Started ServletHttpContext[/authdav]
17:23:27.729 EVENT  Started SocketListener on 0.0.0.0:10007
17:23:27.730 EVENT  Started org.mortbay.jetty.Server@eaf40c
[ERROR] Nonexistent component: org.apache.maven.wagon.Wagondav
17:23:27.731 EVENT  Stopping Acceptor ServerSocket[addr=0.0.0.0/0.0.0.0,port=0,localport=10007]
17:23:27.731 EVENT  Stopped SocketListener on 0.0.0.0:10007
17:23:27.732 EVENT  Stopped ServletHttpContext[/authdav]
17:23:27.732 EVENT  Stopped org.mortbay.jetty.Server@eaf40c
Tests run: 9, Failures: 0, Errors: 9, Skipped: 0, Time elapsed: 0.327 sec <<< FAILURE!

Results :

Tests in error: 
  testWagonPutToNonWebdav(org.apache.maven.wagon.providers.webdav.WebDavWagonTest)
  testWagon(org.apache.maven.wagon.providers.webdav.WebDavWagonTest)
  testWagonPutDirectory(org.apache.maven.wagon.providers.webdav.WebDavWagonTest)
  testWagonPutDirectoryDeepDestination(org.apache.maven.wagon.providers.webdav.WebDavWagonTest)
  testWagonPutDirectoryWhenDirectoryAlreadyExists(org.apache.maven.wagon.providers.webdav.WebDavWagonTest)
  testFailedGet(org.apache.maven.wagon.providers.webdav.WebDavWagonTest)
  testWagonGetFileList(org.apache.maven.wagon.providers.webdav.WebDavWagonTest)
  testWagonGetFileListWhenDirectoryDoesNotExist(org.apache.maven.wagon.providers.webdav.WebDavWagonTest)
  testWagonResourceExists(org.apache.maven.wagon.providers.webdav.WebDavWagonTest)
  testWagonResourceNotExists(org.apache.maven.wagon.providers.webdav.WebDavWagonTest)
  testWagon(org.apache.maven.wagon.providers.webdav.AuthenticatedWebDavWagonTest)
  testWagonPutDirectory(org.apache.maven.wagon.providers.webdav.AuthenticatedWebDavWagonTest)
  testWagonPutDirectoryDeepDestination(org.apache.maven.wagon.providers.webdav.AuthenticatedWebDavWagonTest)
  testWagonPutDirectoryWhenDirectoryAlreadyExists(org.apache.maven.wagon.providers.webdav.AuthenticatedWebDavWagonTest)
  testFailedGet(org.apache.maven.wagon.providers.webdav.AuthenticatedWebDavWagonTest)
  testWagonGetFileList(org.apache.maven.wagon.providers.webdav.AuthenticatedWebDavWagonTest)
  testWagonGetFileListWhenDirectoryDoesNotExist(org.apache.maven.wagon.providers.webdav.AuthenticatedWebDavWagonTest)
  testWagonResourceExists(org.apache.maven.wagon.providers.webdav.AuthenticatedWebDavWagonTest)
  testWagonResourceNotExists(org.apache.maven.wagon.providers.webdav.AuthenticatedWebDavWagonTest)

Tests run: 21, Failures: 0, Errors: 19, Skipped: 0

[INFO] ------------------------------------------------------------------------
[ERROR] BUILD FAILURE
[INFO] ------------------------------------------------------------------------
[INFO] There are test failures.
[INFO] ------------------------------------------------------------------------
[INFO] For more information, run Maven with the -e switch
[INFO] ------------------------------------------------------------------------
[INFO] Total time: 9 seconds
[INFO] Finished at: Tue Feb 06 17:23:27 GMT+00:00 2007
[INFO] Final Memory: 7M/58M
[INFO] ------------------------------------------------------------------------

****************************************************************************



Mime
View raw message