maven-notifications mailing list archives

Site index · List index
Message view « Date » · « Thread »
Top « Date » · « Thread »
From "Continuum@maven.zones.apache.org" <contin...@maven.zones.apache.org>
Subject [continuum] BUILD FAILURE: Maven Wagon Lightweight HTTP Provider
Date Tue, 06 Feb 2007 17:14:03 GMT
Online report : http://maven.zones.apache.org/continuum/buildResult.action?buildId=5863&projectId=224
Build statistics:
  State: Failed
  Previous State: Error
  Started at: Tue, 6 Feb 2007 17:13:48 +0000
  Finished at: Tue, 6 Feb 2007 17:14:01 +0000
  Total time: 13s
  Build Trigger: Schedule
  Build Number: 5
  Exit code: 1
  Building machine hostname: maven.zones.apache.org
  Operating system : SunOS(unknown)
  Java version : 1.5.0_10(Sun Microsystems Inc.)

****************************************************************************
SCM Changes:
****************************************************************************
Changed: no author @ no date
Comment: no comment
Files changed:
  src/main/java/org/apache/maven/wagon/providers/http/LightweightHttpWagon.java ( no revision
)
  src/main/java/org/apache/maven/wagon/providers/http/LightweightHttpsWagon.java ( no revision
)

****************************************************************************
SCM Changes since last success:
****************************************************************************
****************************************************************************
Dependencies Changes:
****************************************************************************
No dependencies changed

****************************************************************************
Test Summary:
****************************************************************************
Tests: 10
Failures: 9
Total time: 1431

****************************************************************************
Output:
****************************************************************************
[INFO] Scanning for projects...
[INFO] ----------------------------------------------------------------------------
[INFO] Building Maven Wagon Lightweight HTTP Provider
[INFO]    task-segment: [clean, install]
[INFO] ----------------------------------------------------------------------------
[INFO] [clean:clean]
[INFO] Deleting directory /export/home/continuum/continuum_data/working-directory/224/target
[INFO] Deleting directory /export/home/continuum/continuum_data/working-directory/224/target/classes
[INFO] Deleting directory /export/home/continuum/continuum_data/working-directory/224/target/test-classes
[INFO] [resources:resources]
[INFO] Using default encoding to copy filtered resources.
[INFO] Copying 0 resource
[INFO] snapshot org.apache.maven.wagon:wagon-http-shared:1.0-beta-3-SNAPSHOT: checking for
updates from apache.snapshots
[INFO] [compiler:compile]
[INFO] Compiling 2 source files to /export/home/continuum/continuum_data/working-directory/224/target/classes
[INFO] [resources:testResources]
[INFO] Using default encoding to copy filtered resources.
[INFO] Copying 1 resource
[INFO] [compiler:testCompile]
[INFO] Compiling 2 source files to /export/home/continuum/continuum_data/working-directory/224/target/test-classes
[INFO] [surefire:test]
[INFO] Surefire report directory: /export/home/continuum/continuum_data/working-directory/224/target/surefire-reports

-------------------------------------------------------
 T E S T S
-------------------------------------------------------
Running org.apache.maven.wagon.providers.http.LightweightHttpWagonTest
Local repository: file:///export/home/continuum/continuum_data/working-directory/224/target/test-output/local-repository
17:14:00.431 EVENT  Checking Resource aliases
17:14:00.458 EVENT  Starting Jetty/4.2.10
17:14:00.463 EVENT  Started HttpContext[/]
17:14:00.473 EVENT  Started SocketListener on 0.0.0.0:10007
17:14:00.473 EVENT  Started org.mortbay.http.HttpServer@128f6ee
Putting test artifact: file-list/test-resource.txt into test repository http://localhost:10007
[ERROR] Nonexistent component: org.apache.maven.wagon.Wagonhttp
17:14:00.478 EVENT  Stopping Acceptor ServerSocket[addr=0.0.0.0/0.0.0.0,port=0,localport=10007]
17:14:00.478 EVENT  Stopped SocketListener on 0.0.0.0:10007
17:14:00.479 EVENT  Stopped HttpContext[/]
17:14:00.479 EVENT  Stopped org.mortbay.http.HttpServer@128f6ee
Local repository: file:///export/home/continuum/continuum_data/working-directory/224/target/test-output/local-repository
17:14:00.527 EVENT  Starting Jetty/4.2.10
17:14:00.528 EVENT  Started HttpContext[/]
17:14:00.529 EVENT  Started SocketListener on 0.0.0.0:10007
17:14:00.529 EVENT  Started org.mortbay.http.HttpServer@1ffc686
File round trip testing ...
Putting test artifact: test-resource into test repository http://localhost:10007
[ERROR] Nonexistent component: org.apache.maven.wagon.Wagonhttp
17:14:00.530 EVENT  Stopping Acceptor ServerSocket[addr=0.0.0.0/0.0.0.0,port=0,localport=10007]
17:14:00.531 EVENT  Stopped SocketListener on 0.0.0.0:10007
17:14:00.531 EVENT  Stopped HttpContext[/]
17:14:00.532 EVENT  Stopped org.mortbay.http.HttpServer@1ffc686
17:14:00.592 EVENT  Starting Jetty/4.2.10
17:14:00.593 EVENT  Started HttpContext[/]
17:14:00.594 EVENT  Started SocketListener on 0.0.0.0:10007
17:14:00.594 EVENT  Started org.mortbay.http.HttpServer@11563ff
Local repository: file:///export/home/continuum/continuum_data/working-directory/224/target/test-output/local-repository
[ERROR] Nonexistent component: org.apache.maven.wagon.Wagonhttp
17:14:00.602 EVENT  Stopping Acceptor ServerSocket[addr=0.0.0.0/0.0.0.0,port=0,localport=10007]
17:14:00.603 EVENT  Stopped SocketListener on 0.0.0.0:10007
17:14:00.604 EVENT  Stopped HttpContext[/]
17:14:00.604 EVENT  Stopped org.mortbay.http.HttpServer@11563ff
Local repository: file:///export/home/continuum/continuum_data/working-directory/224/target/test-output/local-repository
17:14:00.664 EVENT  Starting Jetty/4.2.10
17:14:00.665 EVENT  Started HttpContext[/]
17:14:00.667 EVENT  Started SocketListener on 0.0.0.0:10007
17:14:00.667 EVENT  Started org.mortbay.http.HttpServer@186df0f
[ERROR] Nonexistent component: org.apache.maven.wagon.Wagonhttp
17:14:00.668 EVENT  Stopping Acceptor ServerSocket[addr=0.0.0.0/0.0.0.0,port=0,localport=10007]
17:14:00.669 EVENT  Stopped SocketListener on 0.0.0.0:10007
17:14:00.670 EVENT  Stopped HttpContext[/]
17:14:00.670 EVENT  Stopped org.mortbay.http.HttpServer@186df0f
Local repository: file:///export/home/continuum/continuum_data/working-directory/224/target/test-output/local-repository
17:14:00.709 EVENT  Starting Jetty/4.2.10
17:14:00.710 EVENT  Started HttpContext[/]
17:14:00.711 EVENT  Started SocketListener on 0.0.0.0:10007
17:14:00.711 EVENT  Started org.mortbay.http.HttpServer@14e3f41
[ERROR] Nonexistent component: org.apache.maven.wagon.Wagonhttp
17:14:00.712 EVENT  Stopping Acceptor ServerSocket[addr=0.0.0.0/0.0.0.0,port=0,localport=10007]
17:14:00.713 EVENT  Stopped SocketListener on 0.0.0.0:10007
17:14:00.713 EVENT  Stopped HttpContext[/]
17:14:00.713 EVENT  Stopped org.mortbay.http.HttpServer@14e3f41
17:14:00.757 EVENT  Starting Jetty/4.2.10
17:14:00.757 EVENT  Started HttpContext[/]
17:14:00.758 EVENT  Started SocketListener on 0.0.0.0:10007
17:14:00.758 EVENT  Started org.mortbay.http.HttpServer@e0cc23
Local repository: file:///export/home/continuum/continuum_data/working-directory/224/target/test-output/local-repository
17:14:00.759 EVENT  Stopping Acceptor ServerSocket[addr=0.0.0.0/0.0.0.0,port=0,localport=10007]
17:14:00.760 EVENT  Stopped SocketListener on 0.0.0.0:10007
17:14:00.760 EVENT  Stopped HttpContext[/]
17:14:00.761 EVENT  Stopped org.mortbay.http.HttpServer@e0cc23
Getting test artifact from test repository http://localhost:10007
[ERROR] Nonexistent component: org.apache.maven.wagon.Wagonhttp
17:14:00.794 EVENT  Starting Jetty/4.2.10
17:14:00.794 EVENT  Started HttpContext[/]
17:14:00.795 EVENT  Started SocketListener on 0.0.0.0:10007
17:14:00.796 EVENT  Started org.mortbay.http.HttpServer@79e304
17:14:00.796 EVENT  Stopping Acceptor ServerSocket[addr=0.0.0.0/0.0.0.0,port=0,localport=10007]
17:14:00.797 EVENT  Stopped SocketListener on 0.0.0.0:10007
17:14:00.798 EVENT  Stopped HttpContext[/]
17:14:00.798 EVENT  Stopped org.mortbay.http.HttpServer@79e304
Local repository: file:///export/home/continuum/continuum_data/working-directory/224/target/test-output/local-repository
[ERROR] Nonexistent component: org.apache.maven.wagon.Wagonhttp
17:14:00.842 EVENT  Starting Jetty/4.2.10
17:14:00.842 EVENT  Started HttpContext[/]
17:14:00.844 EVENT  Started SocketListener on 0.0.0.0:10007
17:14:00.867 EVENT  Started org.mortbay.http.HttpServer@bad8a8
Local repository: file:///export/home/continuum/continuum_data/working-directory/224/target/test-output/local-repository
[ERROR] Nonexistent component: org.apache.maven.wagon.Wagonhttp
17:14:00.868 EVENT  Stopping Acceptor ServerSocket[addr=0.0.0.0/0.0.0.0,port=0,localport=10007]
17:14:00.869 EVENT  Stopped SocketListener on 0.0.0.0:10007
17:14:00.869 EVENT  Stopped HttpContext[/]
17:14:00.870 EVENT  Stopped org.mortbay.http.HttpServer@bad8a8
17:14:00.931 EVENT  Starting Jetty/4.2.10
Local repository: file:///export/home/continuum/continuum_data/working-directory/224/target/test-output/local-repository
17:14:00.932 EVENT  Started HttpContext[/]
17:14:00.933 EVENT  Started SocketListener on 0.0.0.0:10007
17:14:00.934 EVENT  Started org.mortbay.http.HttpServer@da3a1e
[ERROR] Nonexistent component: org.apache.maven.wagon.Wagonhttp
17:14:00.934 EVENT  Stopping Acceptor ServerSocket[addr=0.0.0.0/0.0.0.0,port=0,localport=10007]
17:14:00.936 EVENT  Stopped SocketListener on 0.0.0.0:10007
17:14:00.937 EVENT  Stopped HttpContext[/]
17:14:00.937 EVENT  Stopped org.mortbay.http.HttpServer@da3a1e
Tests run: 9, Failures: 0, Errors: 9, Skipped: 0, Time elapsed: 1.259 sec <<< FAILURE!
Running org.apache.maven.wagon.providers.http.LightweightHttpWagonGzipTest
17:14:01.030 EVENT  Starting Jetty/4.2.10
17:14:01.030 EVENT  Started HttpContext[/]
17:14:01.060 EVENT  Started SocketListener on 0.0.0.0:10008
17:14:01.060 EVENT  Started org.mortbay.http.HttpServer@1f82982
17:14:01.188 EVENT  Stopping Acceptor ServerSocket[addr=0.0.0.0/0.0.0.0,port=0,localport=10008]
17:14:01.189 EVENT  Stopped SocketListener on 0.0.0.0:10008
17:14:01.189 EVENT  Stopped HttpContext[/]
17:14:01.189 EVENT  Stopped org.mortbay.http.HttpServer@1f82982
Tests run: 1, Failures: 0, Errors: 0, Skipped: 0, Time elapsed: 0.213 sec

Results :

Tests in error: 
  testWagonGetFileList(org.apache.maven.wagon.providers.http.LightweightHttpWagonTest)
  testWagon(org.apache.maven.wagon.providers.http.LightweightHttpWagonTest)
  testWagonPutDirectory(org.apache.maven.wagon.providers.http.LightweightHttpWagonTest)
  testWagonPutDirectoryDeepDestination(org.apache.maven.wagon.providers.http.LightweightHttpWagonTest)
  testWagonPutDirectoryWhenDirectoryAlreadyExists(org.apache.maven.wagon.providers.http.LightweightHttpWagonTest)
  testFailedGet(org.apache.maven.wagon.providers.http.LightweightHttpWagonTest)
  testWagonGetFileListWhenDirectoryDoesNotExist(org.apache.maven.wagon.providers.http.LightweightHttpWagonTest)
  testWagonResourceExists(org.apache.maven.wagon.providers.http.LightweightHttpWagonTest)
  testWagonResourceNotExists(org.apache.maven.wagon.providers.http.LightweightHttpWagonTest)

Tests run: 10, Failures: 0, Errors: 9, Skipped: 0

[INFO] ------------------------------------------------------------------------
[ERROR] BUILD FAILURE
[INFO] ------------------------------------------------------------------------
[INFO] There are test failures.
[INFO] ------------------------------------------------------------------------
[INFO] For more information, run Maven with the -e switch
[INFO] ------------------------------------------------------------------------
[INFO] Total time: 11 seconds
[INFO] Finished at: Tue Feb 06 17:14:01 GMT+00:00 2007
[INFO] Final Memory: 7M/61M
[INFO] ------------------------------------------------------------------------

****************************************************************************



Mime
View raw message