maven-notifications mailing list archives

Site index · List index
Message view « Date » · « Thread »
Top « Date » · « Thread »
From "Continuum@maven.zones.apache.org" <contin...@maven.zones.apache.org>
Subject [continuum] BUILD FAILURE: Continuum Web APP
Date Mon, 12 Feb 2007 17:26:44 GMT
Online report : http://maven.zones.apache.org/continuum/buildResult.action?buildId=6718&projectId=115
Build statistics:
  State: Failed
  Previous State: Ok
  Started at: Mon, 12 Feb 2007 17:26:19 +0000
  Finished at: Mon, 12 Feb 2007 17:26:41 +0000
  Total time: 22s
  Build Trigger: Schedule
  Build Number: 59
  Exit code: 1
  Building machine hostname: maven.zones.apache.org
  Operating system : SunOS(unknown)
  Java version : 1.5.0_10(Sun Microsystems Inc.)

****************************************************************************
SCM Changes:
****************************************************************************
Changed: no author @ no date
Comment: no comment
Files changed:
  src/main/java/org/apache/maven/continuum/web/action/SummaryAction.java ( no revision )
  src/main/java/org/apache/maven/continuum/web/action/admin/ConfigureAppearanceAction.java
( no revision )
  src/main/java/org/apache/maven/continuum/web/action/admin/EditPomAction.java ( no revision
)
  src/main/java/org/apache/maven/continuum/web/action/admin/ConfigurationAction.java ( no
revision )
  src/main/java/org/apache/maven/continuum/web/action/ProjectGroupAction.java ( no revision
)
  src/main/java/org/apache/maven/continuum/web/action/component/CompanyInfoAction.java ( no
revision )
  src/main/java/org/apache/maven/continuum/web/action/component/BuildDefinitionSummaryAction.java
( no revision )
  src/main/java/org/apache/maven/continuum/web/action/component/NotifierSummaryAction.java
( no revision )
  src/main/resources/META-INF/plexus/application.xml ( no revision )
  src/main/webapp/WEB-INF/jsp/navigations/DefaultTop.jsp ( no revision )
  pom.xml ( no revision )

****************************************************************************
SCM Changes since last success:
****************************************************************************
****************************************************************************
Dependencies Changes:
****************************************************************************
org.apache.maven.continuum:continuum-core:1.1-SNAPSHOT

org.apache.maven.continuum:continuum-notifier-wagon:1.1-SNAPSHOT

org.apache.maven.continuum:continuum-notifier-msn:1.1-SNAPSHOT

org.apache.maven.continuum:continuum-notifier-irc:1.1-SNAPSHOT

org.apache.maven.continuum:continuum-xmlrpc:1.1-SNAPSHOT

org.apache.maven.continuum:continuum-security:1.1-SNAPSHOT

org.apache.maven.continuum:continuum-configuration:1.1-SNAPSHOT

org.apache.maven.continuum:continuum-notifier-jabber:1.1-SNAPSHOT

org.apache.maven.continuum:continuum-parent:1.1-SNAPSHOT

****************************************************************************
Test Summary:
****************************************************************************
Tests: 0
Failures: 0
Total time: 0

****************************************************************************
Output:
****************************************************************************
[INFO] Scanning for projects...
[INFO] ----------------------------------------------------------------------------
[INFO] Building Continuum Web APP
[INFO]    task-segment: [clean, install]
[INFO] ----------------------------------------------------------------------------
[INFO] [clean:clean]
[INFO] Deleting directory /export/home/continuum/continuum_data/working-directory/115/target
[INFO] Deleting directory /export/home/continuum/continuum_data/working-directory/115/target/classes
[INFO] Deleting directory /export/home/continuum/continuum_data/working-directory/115/target/test-classes
[INFO] Deleting directory /export/home/continuum/continuum_data/working-directory/115/target/site
[INFO] Deleting file-set: /export/home/continuum/continuum_data/working-directory/115/src/main/webapp
(included: [META-INF, images/pss, template/pss, WEB-INF/classes, WEB-INF/lib, WEB-INF/database,
WEB-INF/logs, pss, css/pss, WEB-INF/jsp/pss, WEB-INF/template/pss, WEB-INF/build-output-directory,
WEB-INF/working-directory, WEB-INF/logs, WEB-INF/temp], excluded: [])
[INFO] [modello:java {execution: web summary model classes}]
[INFO] outputDirectory: /export/home/continuum/continuum_data/working-directory/115/target/generated-sources/modello
[INFO] Generating current version: 1.0.0
[INFO] [modello:java {execution: session model classes}]
[INFO] outputDirectory: /export/home/continuum/continuum_data/working-directory/115/target/generated-sources/modello
[INFO] Generating current version: 1.0.0
[INFO] [plexus:descriptor {execution: generate}]
[INFO] [resources:resources]
[INFO] Using default encoding to copy filtered resources.
[INFO] Copying 32 resources
[INFO] Copying 65 resources
[INFO] Copying 1 resource
[WARNING] 
	Artifact org.apache.maven.wagon:wagon-provider-api:jar:1.0-beta-2:runtime retains local scope
'runtime' overriding broader scope 'compile'
	given by a dependency. If this is not intended, modify or remove the local scope.

[WARNING] 
	Artifact javax.mail:mail:jar:1.4:provided retains local scope 'provided' overriding broader
scope 'compile'
	given by a dependency. If this is not intended, modify or remove the local scope.

[WARNING] 
	Artifact junit:junit:jar:3.8.1:test retains local scope 'test' overriding broader scope 'compile'
	given by a dependency. If this is not intended, modify or remove the local scope.

[WARNING] 
	Artifact geronimo-spec:geronimo-spec-jta:jar:1.0.1B-rc2:provided retains local scope 'provided'
overriding broader scope 'compile'
	given by a dependency. If this is not intended, modify or remove the local scope.

[WARNING] 
	Artifact javax.servlet:servlet-api:jar:2.5:provided retains local scope 'provided' overriding
broader scope 'compile'
	given by a dependency. If this is not intended, modify or remove the local scope.

[INFO] [compiler:compile]
[INFO] Compiling 84 source files to /export/home/continuum/continuum_data/working-directory/115/target/classes
[INFO] ------------------------------------------------------------------------
[ERROR] BUILD FAILURE
[INFO] ------------------------------------------------------------------------
[INFO] Compilation failure

/export/home/continuum/continuum_data/working-directory/115/src/main/java/org/apache/maven/continuum/web/action/admin/ConfigureAppearanceAction.java:[32,49]
cannot find symbol
symbol  : class MavenAppConfiguration
location: package org.apache.maven.shared.app.configuration

/export/home/continuum/continuum_data/working-directory/115/src/main/java/org/apache/maven/continuum/web/action/admin/ConfigureAppearanceAction.java:[33,36]
package org.codehaus.plexus.registry does not exist

/export/home/continuum/continuum_data/working-directory/115/src/main/java/org/apache/maven/continuum/web/action/admin/ConfigureAppearanceAction.java:[54,12]
cannot find symbol
symbol  : class MavenAppConfiguration
location: class org.apache.maven.continuum.web.action.admin.ConfigureAppearanceAction

/export/home/continuum/continuum_data/working-directory/115/src/main/java/org/apache/maven/continuum/web/action/admin/ConfigureAppearanceAction.java:[74,28]
cannot find symbol
symbol  : class RegistryException
location: class org.apache.maven.continuum.web.action.admin.ConfigureAppearanceAction

/export/home/continuum/continuum_data/working-directory/115/src/main/java/org/apache/maven/continuum/web/action/component/CompanyInfoAction.java:[26,49]
cannot find symbol
symbol  : class MavenAppConfiguration
location: package org.apache.maven.shared.app.configuration

/export/home/continuum/continuum_data/working-directory/115/src/main/java/org/apache/maven/continuum/web/action/component/CompanyInfoAction.java:[50,12]
cannot find symbol
symbol  : class MavenAppConfiguration
location: class org.apache.maven.continuum.web.action.component.CompanyInfoAction

/export/home/continuum/continuum_data/working-directory/115/src/main/java/org/apache/maven/continuum/web/action/admin/EditPomAction.java:[34,49]
cannot find symbol
symbol  : class MavenAppConfiguration
location: package org.apache.maven.shared.app.configuration

/export/home/continuum/continuum_data/working-directory/115/src/main/java/org/apache/maven/continuum/web/action/admin/EditPomAction.java:[55,12]
cannot find symbol
symbol  : class MavenAppConfiguration
location: class org.apache.maven.continuum.web.action.admin.EditPomAction


[INFO] ------------------------------------------------------------------------
[INFO] For more information, run Maven with the -e switch
[INFO] ------------------------------------------------------------------------
[INFO] Total time: 20 seconds
[INFO] Finished at: Mon Feb 12 17:26:41 GMT+00:00 2007
[INFO] Final Memory: 25M/88M
[INFO] ------------------------------------------------------------------------

****************************************************************************



Mime
View raw message