maven-notifications mailing list archives

Site index · List index
Message view « Date » · « Thread »
Top « Date » · « Thread »
From "Continuum@maven.zones.apache.org" <contin...@maven.zones.apache.org>
Subject [continuum] BUILD FAILURE: Maven Wagon SSH Provider
Date Tue, 06 Feb 2007 19:48:04 GMT
Online report : http://maven.zones.apache.org/continuum/buildResult.action?buildId=5893&projectId=230
Build statistics:
  State: Failed
  Previous State: Failed
  Started at: Tue, 6 Feb 2007 19:47:54 +0000
  Finished at: Tue, 6 Feb 2007 19:48:02 +0000
  Total time: 7s
  Build Trigger: Schedule
  Build Number: 5
  Exit code: 1
  Building machine hostname: maven.zones.apache.org
  Operating system : SunOS(unknown)
  Java version : 1.5.0_10(Sun Microsystems Inc.)

****************************************************************************
SCM Changes:
****************************************************************************
No files changed

****************************************************************************
SCM Changes since last success:
****************************************************************************
Changed: no author @ no date
Comment: no comment
Files changed:
  src/main/java/org/apache/maven/wagon/providers/ssh/jsch/ScpWagon.java ( no revision )
  src/main/java/org/apache/maven/wagon/providers/ssh/jsch/ScpCommandExecutor.java ( no revision
)
  src/main/java/org/apache/maven/wagon/providers/ssh/jsch/WagonUserInfo.java ( no revision
)
  src/main/java/org/apache/maven/wagon/providers/ssh/jsch/AbstractJschWagon.java ( no revision
)
  src/main/java/org/apache/maven/wagon/providers/ssh/jsch/SftpWagon.java ( no revision )
  src/main/java/org/apache/maven/wagon/providers/ssh/jsch/interactive/PrompterUIKeyboardInteractive.java
( no revision )
  src/main/java/org/apache/maven/wagon/providers/ssh/jsch/interactive/TraditionalUIKeyboardInteractive.java
( no revision )
  src/main/java/org/apache/maven/wagon/providers/ssh/jsch/interactive/UserInfoUIKeyboardInteractiveProxy.java
( no revision )

****************************************************************************
Dependencies Changes:
****************************************************************************
org.apache.maven.wagon:wagon-providers:1.0-beta-3-SNAPSHOT

****************************************************************************
Test Summary:
****************************************************************************
Tests: 0
Failures: 0
Total time: 0

****************************************************************************
Output:
****************************************************************************
[INFO] Scanning for projects...
[INFO] ----------------------------------------------------------------------------
[INFO] Building Maven Wagon SSH Provider
[INFO]    task-segment: [clean, install]
[INFO] ----------------------------------------------------------------------------
[INFO] [clean:clean]
[INFO] Deleting directory /export/home/continuum/continuum_data/working-directory/230/target
[INFO] Deleting directory /export/home/continuum/continuum_data/working-directory/230/target/classes
[INFO] Deleting directory /export/home/continuum/continuum_data/working-directory/230/target/test-classes
[INFO] [plexus:descriptor {execution: generate}]
[INFO] [resources:resources]
[INFO] Using default encoding to copy filtered resources.
[INFO] Copying 0 resource
[INFO] Copying 1 resource
[WARNING] 
	Artifact junit:junit:jar:3.8.1:test retains local scope 'test' overriding broader scope 'compile'
	given by a dependency. If this is not intended, modify or remove the local scope.

[INFO] [compiler:compile]
[INFO] Compiling 8 source files to /export/home/continuum/continuum_data/working-directory/230/target/classes
[INFO] ------------------------------------------------------------------------
[ERROR] BUILD FAILURE
[INFO] ------------------------------------------------------------------------
[INFO] Compilation failure

/export/home/continuum/continuum_data/working-directory/230/src/main/java/org/apache/maven/wagon/providers/ssh/jsch/AbstractJschWagon.java:[294,30]
getKnownHostsProvider() in org.apache.maven.wagon.providers.ssh.jsch.AbstractJschWagon cannot
override getKnownHostsProvider() in org.apache.maven.wagon.providers.ssh.AbstractSshWagon;
overridden method is final

/export/home/continuum/continuum_data/working-directory/230/src/main/java/org/apache/maven/wagon/providers/ssh/jsch/AbstractJschWagon.java:[304,16]
setKnownHostsProvider(org.apache.maven.wagon.providers.ssh.knownhost.KnownHostsProvider) in
org.apache.maven.wagon.providers.ssh.jsch.AbstractJschWagon cannot override setKnownHostsProvider(org.apache.maven.wagon.providers.ssh.knownhost.KnownHostsProvider)
in org.apache.maven.wagon.providers.ssh.AbstractSshWagon; overridden method is final


[INFO] ------------------------------------------------------------------------
[INFO] For more information, run Maven with the -e switch
[INFO] ------------------------------------------------------------------------
[INFO] Total time: 6 seconds
[INFO] Finished at: Tue Feb 06 19:48:02 GMT+00:00 2007
[INFO] Final Memory: 7M/59M
[INFO] ------------------------------------------------------------------------

****************************************************************************



Mime
View raw message