maven-notifications mailing list archives

Site index · List index
Message view « Date » · « Thread »
Top « Date » · « Thread »
From "Continuum@maven.zones.apache.org" <contin...@maven.zones.apache.org>
Subject [continuum] BUILD FAILURE: Continuum Core
Date Wed, 13 Jun 2007 18:21:02 GMT
Online report : http://maven.zones.apache.org/continuum/buildResult.action?buildId=8053&projectId=102
Build statistics:
  State: Failed
  Previous State: Failed
  Started at: Wed 13 Jun 2007 18:20:11 +0000
  Finished at: Wed 13 Jun 2007 18:20:59 +0000
  Total time: 48s
  Build Trigger: Schedule
  Build Number: 75
  Exit code: 1
  Building machine hostname: maven.zones.apache.org
  Operating system : SunOS(unknown)
  Java version : 1.5.0_11(Sun Microsystems Inc.)

****************************************************************************
SCM Changes:
****************************************************************************
Changed: no author @ no date
Comment: no comment
Files changed:
  102/classes.png ( no revision )
  102/src/test/repository/console-notifier/pom.xml ( no revision )
  102/src/test/repository/maven-builder-helper-1.xml ( no revision )
  102/src/test/repository/maven-builder-helper-2.xml ( no revision )
  102/src/test/repository/maven-builder-helper-3.xml ( no revision )
  102/src/test/java/org/apache/maven/continuum/utils/ProjectSorterTest.java ( no revision
)
  102/src/test/java/org/apache/maven/continuum/scm/ContinuumScmTest.java ( no revision )
  102/src/test/java/org/apache/maven/continuum/buildcontroller/BuildProjectTaskExecutorTest.java
( no revision )
  102/src/test/java/org/apache/maven/continuum/buildcontroller/DefaultBuildControllerTest.java
( no revision )
  102/src/test/java/org/apache/maven/continuum/execution/maven/m1/MavenOneBuildExecutorTest.java
( no revision )
  102/src/test/java/org/apache/maven/continuum/execution/manager/DefaultBuildExecutorManagerTest.java
( no revision )
  102/src/test/java/org/apache/maven/continuum/buildqueue/BuildQueueTest.java ( no revision
)
  102/src/test/java/org/apache/maven/continuum/DefaultContinuumTest.java ( no revision )
  102/src/test/java/org/apache/maven/continuum/notification/ContinuumNotificationDispatcherTest.java
( no revision )
  102/src/test/java/org/apache/maven/continuum/notification/mail/FormatterToolTest.java (
no revision )
  102/src/test/java/org/apache/maven/continuum/notification/mail/MailContinuumNotifierTest.java
( no revision )
  102/src/test/java/org/apache/maven/continuum/project/builder/maven/MavenTwoContinuumProjectBuilderTest.java
( no revision )
  102/src/test/java/org/apache/maven/continuum/project/builder/maven/MavenOneContinuumProjectBuilderTest.java
( no revision )
  102/src/test/java/org/apache/maven/continuum/configuration/ConfigurationServiceTest.java
( no revision )
  102/src/test/java/org/apache/maven/continuum/core/action/CreateProjectsFromMetadataTest.java
( no revision )
  102/src/test/java/org/apache/maven/continuum/TestAction.java ( no revision )
  102/src/test/resources/configuration.xml ( no revision )
  102/src/test/resources/org/apache/maven/continuum/buildcontroller/BuildProjectTaskExecutorTest.xml
( no revision )
  102/src/test/resources/org/apache/maven/continuum/buildcontroller/DefaultBuildControllerTest.xml
( no revision )
  102/src/test/resources/org/apache/maven/continuum/buildqueue/BuildQueueTest.xml ( no revision
)
  102/src/test/resources/org/apache/maven/continuum/DefaultContinuumTest.xml ( no revision
)
  102/src/test/resources/org/apache/maven/continuum/notification/mail/MailContinuumNotifierTest.xml
( no revision )
  102/src/test/resources/org/apache/maven/continuum/notification/ContinuumNotificationDispatcherTest.xml
( no revision )
  102/src/test/resources/org/apache/maven/continuum/configuration/ConfigurationServiceTest.xml
( no revision )
  102/src/test/resources/org/apache/maven/continuum/network/SimpleServerSocketConnectionFactoryTest.xml
( no revision )
  102/src/test/resources/projects/continuum/continuum-model/pom.xml ( no revision )
  102/src/test/resources/projects/continuum/continuum-plexus-application/pom.xml ( no revision
)
  102/src/test/resources/projects/continuum/continuum-notifiers/continuum-notifier-jabber/pom.xml
( no revision )
  102/src/test/resources/projects/continuum/continuum-notifiers/continuum-notifier-irc/pom.xml
( no revision )
  102/src/test/resources/projects/continuum/continuum-notifiers/pom.xml ( no revision )
  102/src/test/resources/projects/continuum/continuum-xmlrpc/pom.xml ( no revision )
  102/src/test/resources/projects/continuum/pom_ci.xml ( no revision )
  102/src/test/resources/projects/continuum/continuum-core/pom.xml ( no revision )
  102/src/test/resources/projects/continuum/pom.xml ( no revision )
  102/src/test/resources/projects/continuum/continuum-web/pom.xml ( no revision )
  102/src/test/resources/projects/maven-1.pom.xml ( no revision )
  102/src/test/resources/log4j.properties ( no revision )
  102/src/main/java/org/apache/maven/continuum/build/settings/DefaultSchedulesActivator.java
( no revision )
  102/src/main/java/org/apache/maven/continuum/utils/ProjectSorter.java ( no revision )
  102/src/main/java/org/apache/maven/continuum/utils/WorkingDirectoryService.java ( no revision
)
  102/src/main/java/org/apache/maven/continuum/utils/shell/ExecutionResult.java ( no revision
)
  102/src/main/java/org/apache/maven/continuum/utils/shell/ShellCommandHelper.java ( no revision
)
  102/src/main/java/org/apache/maven/continuum/utils/shell/DefaultShellCommandHelper.java
( no revision )
  102/src/main/java/org/apache/maven/continuum/utils/DefaultWorkingDirectoryService.java (
no revision )
  102/src/main/java/org/apache/maven/continuum/utils/PlexusContainerManager.java ( no revision
)
  102/src/main/java/org/apache/maven/continuum/scm/ContinuumScmException.java ( no revision
)
  102/src/main/java/org/apache/maven/continuum/scm/ContinuumScm.java ( no revision )
  102/src/main/java/org/apache/maven/continuum/scm/queue/CheckOutTaskExecutor.java ( no revision
)
  102/src/main/java/org/apache/maven/continuum/scm/queue/CheckOutTask.java ( no revision )
  102/src/main/java/org/apache/maven/continuum/scm/DefaultContinuumScm.java ( no revision
)
  102/src/main/java/org/apache/maven/continuum/buildcontroller/BuildController.java ( no revision
)
  102/src/main/java/org/apache/maven/continuum/buildcontroller/BuildContext.java ( no revision
)
  102/src/main/java/org/apache/maven/continuum/buildcontroller/BuildProjectTaskExecutor.java
( no revision )
  102/src/main/java/org/apache/maven/continuum/buildcontroller/DefaultBuildController.java
( no revision )
  102/src/main/java/org/apache/maven/continuum/execution/AbstractBuildExecutor.java ( no revision
)
  102/src/main/java/org/apache/maven/continuum/execution/ant/AntBuildExecutor.java ( no revision
)
  102/src/main/java/org/apache/maven/continuum/execution/maven/m1/MavenOneBuildExecutor.java
( no revision )
  102/src/main/java/org/apache/maven/continuum/execution/maven/m1/MavenOneMetadataHelperException.java
( no revision )
  102/src/main/java/org/apache/maven/continuum/execution/maven/m1/MavenOneMetadataHelper.java
( no revision )
  102/src/main/java/org/apache/maven/continuum/execution/maven/m1/DefaultMavenOneMetadataHelper.java
( no revision )
  102/src/main/java/org/apache/maven/continuum/execution/maven/m2/MavenTwoBuildExecutor.java
( no revision )
  102/src/main/java/org/apache/maven/continuum/execution/maven/m2/DefaultMavenBuilderHelper.java
( no revision )
  102/src/main/java/org/apache/maven/continuum/execution/maven/m2/SettingsConfigurationException.java
( no revision )
  102/src/main/java/org/apache/maven/continuum/execution/maven/m2/MavenBuilderHelperException.java
( no revision )
  102/src/main/java/org/apache/maven/continuum/execution/maven/m2/MavenBuilderHelper.java
( no revision )
  102/src/main/java/org/apache/maven/continuum/execution/shell/ShellBuildExecutor.java ( no
revision )
  102/src/main/java/org/apache/maven/continuum/execution/manager/BuildExecutorManager.java
( no revision )
  102/src/main/java/org/apache/maven/continuum/execution/manager/BuildExecutorNotFoundException.java
( no revision )
  102/src/main/java/org/apache/maven/continuum/execution/manager/DefaultBuildExecutorManager.java
( no revision )
  102/src/main/java/org/apache/maven/continuum/trigger/quartz/ContinuumBuildTrigger.java (
no revision )
  102/src/main/java/org/apache/maven/continuum/buildqueue/evaluator/BuildProjectTaskViabilityEvaluator.java
( no revision )
  102/src/main/java/org/apache/maven/continuum/buildqueue/BuildProjectTask.java ( no revision
)
  102/src/main/java/org/apache/maven/continuum/DefaultContinuum.java ( no revision )
  102/src/main/java/org/apache/maven/continuum/notification/console/ConsoleNotifier.java (
no revision )
  102/src/main/java/org/apache/maven/continuum/notification/mail/FormatterTool.java ( no revision
)
  102/src/main/java/org/apache/maven/continuum/notification/mail/MailContinuumNotifier.java
( no revision )
  102/src/main/java/org/apache/maven/continuum/notification/DefaultContinuumNotificationDispatcher.java
( no revision )
  102/src/main/java/org/apache/maven/continuum/notification/ContinuumRecipientSource.java
( no revision )
  102/src/main/java/org/apache/maven/continuum/project/builder/maven/MavenTwoContinuumProjectBuilder.java
( no revision )
  102/src/main/java/org/apache/maven/continuum/project/builder/maven/MavenOneContinuumProjectBuilder.java
( no revision )
  102/src/main/java/org/apache/maven/continuum/project/builder/manager/DefaultContinuumProjectBuilderManager.java
( no revision )
  102/src/main/java/org/apache/maven/continuum/project/builder/manager/ContinuumProjectBuilderManagerException.java
( no revision )
  102/src/main/java/org/apache/maven/continuum/project/builder/manager/ContinuumProjectBuilderManager.java
( no revision )
  102/src/main/java/org/apache/maven/continuum/configuration/DefaultConfigurationService.java
( no revision )
  102/src/main/java/org/apache/maven/continuum/initialization/ContinuumInitializer.java (
no revision )
  102/src/main/java/org/apache/maven/continuum/initialization/ContinuumInitializationException.java
( no revision )
  102/src/main/java/org/apache/maven/continuum/initialization/DefaultContinuumInitializer.java
( no revision )
  102/src/main/java/org/apache/maven/continuum/core/action/RemoveBuildDefinitionFromProjectAction.java
( no revision )
  102/src/main/java/org/apache/maven/continuum/core/action/UpdateWorkingDirectoryFromScmContinuumAction.java
( no revision )
  102/src/main/java/org/apache/maven/continuum/core/action/CreateProjectsFromMetadataAction.java
( no revision )
  102/src/main/java/org/apache/maven/continuum/core/action/CheckWorkingDirectoryAction.java
( no revision )
  102/src/main/java/org/apache/maven/continuum/core/action/UpdateBuildDefinitionFromProjectGroupAction.java
( no revision )
  102/src/main/java/org/apache/maven/continuum/core/action/AbstractContinuumAction.java (
no revision )
  102/src/main/java/org/apache/maven/continuum/core/action/CleanWorkingDirectoryAction.java
( no revision )
  102/src/main/java/org/apache/maven/continuum/core/action/ExecuteBuilderContinuumAction.java
( no revision )
  102/src/main/java/org/apache/maven/continuum/core/action/AddBuildDefinitionToProjectAction.java
( no revision )
  102/src/main/java/org/apache/maven/continuum/core/action/DeployArtifactContinuumAction.java
( no revision )
  102/src/main/java/org/apache/maven/continuum/core/action/AddProjectToCheckOutQueueAction.java
( no revision )
  102/src/main/java/org/apache/maven/continuum/core/action/RemoveBuildDefinitionFromProjectGroupAction.java
( no revision )
  102/src/main/java/org/apache/maven/continuum/core/action/AbstractValidationContinuumAction.java
( no revision )
  102/src/main/java/org/apache/maven/continuum/core/action/ValidateProject.java ( no revision
)
  102/src/main/java/org/apache/maven/continuum/core/action/StoreProjectAction.java ( no revision
)
  102/src/main/java/org/apache/maven/continuum/core/action/StoreCheckOutScmResultAction.java
( no revision )
  102/src/main/java/org/apache/maven/continuum/core/action/UpdateProjectFromWorkingDirectoryContinuumAction.java
( no revision )
  102/src/main/java/org/apache/maven/continuum/core/action/AddAssignableRolesAction.java (
no revision )
  102/src/main/java/org/apache/maven/continuum/core/action/UpdateBuildDefinitionFromProjectAction.java
( no revision )
  102/src/main/java/org/apache/maven/continuum/core/action/AddBuildDefinitionToProjectGroupAction.java
( no revision )
  102/src/main/java/org/apache/maven/continuum/core/action/RemoveAssignableRolesAction.java
( no revision )
  102/src/main/java/org/apache/maven/continuum/core/action/CheckoutProjectContinuumAction.java
( no revision )
  102/src/main/java/org/apache/maven/continuum/core/action/AbstractBuildDefinitionContinuumAction.java
( no revision )
  102/src/main/java/org/apache/maven/continuum/core/action/ValidateProjectGroup.java ( no
revision )
  102/src/main/java/org/apache/maven/continuum/core/action/StoreProjectGroupAction.java (
no revision )
  102/src/main/java/org/apache/maven/continuum/scheduler/ContinuumSchedulerException.java
( no revision )
  102/src/main/java/org/apache/maven/continuum/scheduler/ContinuumScheduler.java ( no revision
)
  102/src/main/java/org/apache/maven/continuum/scheduler/DefaultContinuumScheduler.java (
no revision )
  102/src/main/java/org/apache/maven/continuum/scheduler/ContinuumBuildJob.java ( no revision
)
  102/src/main/java/org/apache/maven/continuum/scheduler/ContinuumSchedulerConstants.java
( no revision )
  102/src/main/resources/META-INF/plexus/components.xml ( no revision )
  102/src/main/resources/org/apache/maven/continuum/notification/mail/templates/ant/BuildComplete.vm
( no revision )
  102/src/main/resources/org/apache/maven/continuum/notification/mail/templates/maven-1/BuildComplete.vm
( no revision )
  102/src/main/resources/org/apache/maven/continuum/notification/mail/templates/shell/BuildComplete.vm
( no revision )
  102/src/main/resources/org/apache/maven/continuum/notification/mail/templates/maven2/BuildComplete.vm
( no revision )
  102/src/main/resources/org/apache/maven/continuum/notification/mail/templates/common.vm
( no revision )
  102/src/test-projects/timeout/src/test/java/org/apache/maven/continuum/testprojects/timeout/TimeoutTest.java
( no revision )
  102/src/test-projects/timeout/pom.xml ( no revision )
  102/src/test-projects/project1/src/main/java/org/codehaus/continuum/project1/App.java (
no revision )
  102/src/test-projects/project1/pom.xml ( no revision )
  102/src/test-projects/project1/.cvsignore ( no revision )
  102/src/test-projects/project2/src/main/java/org/codehaus/continuum/project2/App.java (
no revision )
  102/src/test-projects/project2/pom.xml ( no revision )
  102/src/test-projects/project2/.cvsignore ( no revision )
  102/src/test-input/project.xml ( no revision )
  102/src/test-input/src/main/java/Person.java ( no revision )
  102/src/test-file-storage/plexus/bayesian.pom ( no revision )
  102/src/test-file-storage/plexus/i18b.pom ( no revision )
  102/src/test-file-storage/inamo/accountmanager.pom ( no revision )
  102/classes.dia ( no revision )
  102/pom.xml ( no revision )
  102/design.apt ( no revision )

****************************************************************************
SCM Changes since last success:
****************************************************************************
****************************************************************************
Dependencies Changes:
****************************************************************************
org.apache.maven.continuum:continuum-security:1.1-SNAPSHOT

org.apache.maven.continuum:continuum-configuration:1.1-SNAPSHOT

org.apache.maven.continuum:continuum-parent:1.1-SNAPSHOT

****************************************************************************
Test Summary:
****************************************************************************
Tests: 0
Failures: 0
Total time: 0

****************************************************************************
Output:
****************************************************************************
[INFO] Scanning for projects...
[INFO] ----------------------------------------------------------------------------
[INFO] Building Continuum Core
[INFO]    task-segment: [clean, install]
[INFO] ----------------------------------------------------------------------------
[INFO] [clean:clean]
[INFO] Deleting directory /export/home/build/data/continuum/checkouts/102/target
[INFO] Deleting directory /export/home/build/data/continuum/checkouts/102/target/classes
[INFO] Deleting directory /export/home/build/data/continuum/checkouts/102/target/test-classes
[INFO] Deleting directory /export/home/build/data/continuum/checkouts/102/target/site
[INFO] [plexus:descriptor {execution: generate}]
[WARNING] Component: MavenTwoContinuumProjectBuilder, field name: 'excludedPackagingTypes':
Currently configurable fields will not be written to the descriptor without a default value.
[INFO] [resources:resources]
[INFO] Using default encoding to copy filtered resources.
[INFO] [plexus:merge-descriptors {execution: merge}]
Downloading: http://repo1.maven.org/maven2/org/apache/derby/derby/10.1.3.1/derby-10.1.3.1.pom
1K downloaded
Downloading: http://repo1.maven.org/maven2/org/codehaus/plexus/plexus-mail-sender-test/1.0-alpha-6/plexus-mail-sender-test-1.0-alpha-6.pom
609b downloaded
Downloading: http://repo1.maven.org/maven2/org/codehaus/plexus/plexus-mail-senders/1.0-alpha-6/plexus-mail-senders-1.0-alpha-6.pom
939b downloaded
Downloading: http://repo1.maven.org/maven2/org/codehaus/plexus/plexus-mail-sender/1.0-alpha-6/plexus-mail-sender-1.0-alpha-6.pom
1K downloaded
Downloading: http://repo1.maven.org/maven2/org/codehaus/plexus/plexus-mail-sender-api/1.0-alpha-6/plexus-mail-sender-api-1.0-alpha-6.pom
433b downloaded
Downloading: http://repo1.maven.org/maven2/dumbster/dumbster/1.5/dumbster-1.5.pom
190b downloaded
Downloading: http://repo1.maven.org/maven2/org/codehaus/plexus/plexus-quartz/1.0-alpha-3/plexus-quartz-1.0-alpha-3.pom
995b downloaded
Downloading: http://repo1.maven.org/maven2/quartz/quartz/1.4.5/quartz-1.4.5.pom
146b downloaded
Downloading: http://repo1.maven.org/maven2/commons-logging/commons-logging/1.0.2/commons-logging-1.0.2.pom
810b downloaded
Downloading: http://snapshots.repository.codehaus.org//org/apache/maven/continuum/continuum-test/1.1-SNAPSHOT/continuum-test-1.1-SNAPSHOT.pom
Downloading: http://people.apache.org/repo/m2-snapshot-repository/org/apache/maven/continuum/continuum-test/1.1-SNAPSHOT/continuum-test-1.1-SNAPSHOT.pom
[INFO] snapshot org.apache.maven.continuum:continuum-security:1.1-SNAPSHOT: checking for updates
from codehaus.org
[INFO] snapshot org.apache.maven.continuum:continuum-security:1.1-SNAPSHOT: checking for updates
from apache.snapshots
Downloading: http://repo1.maven.org/maven2/org/codehaus/plexus/redback/redback-xwork-integration/1.0-alpha-1/redback-xwork-integration-1.0-alpha-1.pom
6K downloaded
Downloading: http://repo1.maven.org/maven2/org/codehaus/plexus/redback/redback-xwork/1.0-alpha-1/redback-xwork-1.0-alpha-1.pom
2K downloaded
Downloading: http://repo1.maven.org/maven2/org/codehaus/plexus/redback/redback-integrations/1.0-alpha-1/redback-integrations-1.0-alpha-1.pom
1K downloaded
Downloading: http://repo1.maven.org/maven2/org/codehaus/plexus/redback/redback/1.0-alpha-1/redback-1.0-alpha-1.pom
14K downloaded
Downloading: http://repo1.maven.org/maven2/org/codehaus/plexus/redback/redback-system/1.0-alpha-1/redback-system-1.0-alpha-1.pom
3K downloaded
Downloading: http://repo1.maven.org/maven2/org/codehaus/plexus/redback/redback-configuration/1.0-alpha-1/redback-configuration-1.0-alpha-1.pom
2K downloaded
Downloading: http://repo1.maven.org/maven2/org/codehaus/plexus/plexus-expression-evaluator/1.0-alpha-1/plexus-expression-evaluator-1.0-alpha-1.pom
1K downloaded
Downloading: http://repo1.maven.org/maven2/org/codehaus/plexus/registry/plexus-registry-commons/1.0-alpha-1/plexus-registry-commons-1.0-alpha-1.pom
2K downloaded
Downloading: http://repo1.maven.org/maven2/org/codehaus/plexus/registry/plexus-registry-providers/1.0-alpha-1/plexus-registry-providers-1.0-alpha-1.pom
1K downloaded
Downloading: http://repo1.maven.org/maven2/org/codehaus/plexus/registry/plexus-registry/1.0-alpha-1/plexus-registry-1.0-alpha-1.pom
3K downloaded
Downloading: http://repo1.maven.org/maven2/org/codehaus/plexus/registry/plexus-registry-api/1.0-alpha-1/plexus-registry-api-1.0-alpha-1.pom
1K downloaded
Downloading: http://repo1.maven.org/maven2/org/codehaus/plexus/registry/plexus-registry-test/1.0-alpha-1/plexus-registry-test-1.0-alpha-1.pom
1K downloaded
Downloading: http://repo1.maven.org/maven2/org/codehaus/plexus/plexus-container-default/1.0-alpha-16/plexus-container-default-1.0-alpha-16.pom
1K downloaded
Downloading: http://repo1.maven.org/maven2/commons-collections/commons-collections/3.1/commons-collections-3.1.pom
5K downloaded
Downloading: http://repo1.maven.org/maven2/commons-logging/commons-logging/1.0/commons-logging-1.0.pom
163b downloaded
Downloading: http://repo1.maven.org/maven2/commons-collections/commons-collections/2.1/commons-collections-2.1.pom
3K downloaded
Downloading: http://repo1.maven.org/maven2/jdom/jdom/b9/jdom-b9.pom
139b downloaded
Downloading: http://repo1.maven.org/maven2/commons-logging/commons-logging/1.0.3/commons-logging-1.0.3.pom
866b downloaded
Downloading: http://repo1.maven.org/maven2/org/codehaus/plexus/redback/redback-authentication-api/1.0-alpha-1/redback-authentication-api-1.0-alpha-1.pom
2K downloaded
Downloading: http://repo1.maven.org/maven2/org/codehaus/plexus/redback/redback-authentication/1.0-alpha-1/redback-authentication-1.0-alpha-1.pom
1K downloaded
Downloading: http://repo1.maven.org/maven2/org/codehaus/plexus/redback/redback-users-api/1.0-alpha-1/redback-users-api-1.0-alpha-1.pom
1K downloaded
Downloading: http://repo1.maven.org/maven2/org/codehaus/plexus/redback/redback-users/1.0-alpha-1/redback-users-1.0-alpha-1.pom
1K downloaded
Downloading: http://repo1.maven.org/maven2/org/codehaus/plexus/redback/redback-policy/1.0-alpha-1/redback-policy-1.0-alpha-1.pom
2K downloaded
Downloading: http://repo1.maven.org/maven2/org/codehaus/plexus/redback/redback-authorization-api/1.0-alpha-1/redback-authorization-api-1.0-alpha-1.pom
1K downloaded
Downloading: http://repo1.maven.org/maven2/org/codehaus/plexus/redback/redback-authorization/1.0-alpha-1/redback-authorization-1.0-alpha-1.pom
1K downloaded
Downloading: http://repo1.maven.org/maven2/org/codehaus/plexus/redback/redback-users-cached/1.0-alpha-1/redback-users-cached-1.0-alpha-1.pom
2K downloaded
Downloading: http://repo1.maven.org/maven2/org/codehaus/plexus/redback/redback-users-providers/1.0-alpha-1/redback-users-providers-1.0-alpha-1.pom
1K downloaded
Downloading: http://repo1.maven.org/maven2/org/codehaus/plexus/plexus-ehcache/1.0-alpha-2/plexus-ehcache-1.0-alpha-2.pom
1K downloaded
Downloading: http://repo1.maven.org/maven2/net/sf/ehcache/ehcache/1.2.4/ehcache-1.2.4.pom
21K downloaded
Downloading: http://repo1.maven.org/maven2/org/codehaus/plexus/redback/redback-users-jdo/1.0-alpha-1/redback-users-jdo-1.0-alpha-1.pom
4K downloaded
Downloading: http://repo1.maven.org/maven2/org/codehaus/plexus/redback/redback-common-jdo/1.0-alpha-1/redback-common-jdo-1.0-alpha-1.pom
2K downloaded
Downloading: http://repo1.maven.org/maven2/org/codehaus/plexus/redback/redback-common/1.0-alpha-1/redback-common-1.0-alpha-1.pom
1K downloaded
Downloading: http://repo1.maven.org/maven2/org/codehaus/plexus/redback/redback-keys-api/1.0-alpha-1/redback-keys-api-1.0-alpha-1.pom
1K downloaded
Downloading: http://repo1.maven.org/maven2/org/codehaus/plexus/redback/redback-keys/1.0-alpha-1/redback-keys-1.0-alpha-1.pom
1K downloaded
Downloading: http://repo1.maven.org/maven2/org/codehaus/plexus/redback/redback-keys-cached/1.0-alpha-1/redback-keys-cached-1.0-alpha-1.pom
2K downloaded
Downloading: http://repo1.maven.org/maven2/org/codehaus/plexus/redback/redback-keys-providers/1.0-alpha-1/redback-keys-providers-1.0-alpha-1.pom
1K downloaded
Downloading: http://repo1.maven.org/maven2/org/codehaus/plexus/redback/redback-keys-jdo/1.0-alpha-1/redback-keys-jdo-1.0-alpha-1.pom
4K downloaded
Downloading: http://repo1.maven.org/maven2/org/codehaus/plexus/redback/redback-authentication-users/1.0-alpha-1/redback-authentication-users-1.0-alpha-1.pom
2K downloaded
Downloading: http://repo1.maven.org/maven2/org/codehaus/plexus/redback/redback-authentication-providers/1.0-alpha-1/redback-authentication-providers-1.0-alpha-1.pom
1K downloaded
Downloading: http://repo1.maven.org/maven2/org/codehaus/plexus/redback/redback-authentication-keys/1.0-alpha-1/redback-authentication-keys-1.0-alpha-1.pom
2K downloaded
Downloading: http://repo1.maven.org/maven2/org/codehaus/plexus/redback/redback-authorization-rbac/1.0-alpha-1/redback-authorization-rbac-1.0-alpha-1.pom
2K downloaded
Downloading: http://repo1.maven.org/maven2/org/codehaus/plexus/redback/redback-authorization-providers/1.0-alpha-1/redback-authorization-providers-1.0-alpha-1.pom
1K downloaded
Downloading: http://repo1.maven.org/maven2/org/codehaus/plexus/redback/redback-rbac-cached/1.0-alpha-1/redback-rbac-cached-1.0-alpha-1.pom
3K downloaded
Downloading: http://repo1.maven.org/maven2/org/codehaus/plexus/redback/redback-rbac-providers/1.0-alpha-1/redback-rbac-providers-1.0-alpha-1.pom
1K downloaded
Downloading: http://repo1.maven.org/maven2/org/codehaus/plexus/redback/redback-rbac/1.0-alpha-1/redback-rbac-1.0-alpha-1.pom
1K downloaded
Downloading: http://repo1.maven.org/maven2/org/codehaus/plexus/redback/redback-rbac-model/1.0-alpha-1/redback-rbac-model-1.0-alpha-1.pom
1K downloaded
Downloading: http://repo1.maven.org/maven2/org/codehaus/plexus/redback/redback-rbac-jdo/1.0-alpha-1/redback-rbac-jdo-1.0-alpha-1.pom
4K downloaded
Downloading: http://repo1.maven.org/maven2/org/codehaus/plexus/redback/redback-rbac-role-manager/1.0-alpha-1/redback-rbac-role-manager-1.0-alpha-1.pom
4K downloaded
Downloading: http://repo1.maven.org/maven2/org/codehaus/woodstox/wstx-asl/3.2.1/wstx-asl-3.2.1.pom
1K downloaded
[WARNING] *** CHECKSUM FAILED - Error retrieving checksum file for org/codehaus/woodstox/wstx-asl/3.2.1/wstx-asl-3.2.1.pom
- IGNORING
Downloading: http://repo1.maven.org/maven2/org/codehaus/plexus/plexus-xwork-integration/1.0-alpha-6/plexus-xwork-integration-1.0-alpha-6.pom
2K downloaded
Downloading: http://repo1.maven.org/maven2/opensymphony/xwork/1.2.1/xwork-1.2.1.pom
8K downloaded
Downloading: http://repo1.maven.org/maven2/org/rifers/rife-continuations/0.0.2/rife-continuations-0.0.2.pom
2K downloaded
Downloading: http://repo1.maven.org/maven2/opensymphony/oscore/2.2.4/oscore-2.2.4.pom
152b downloaded
Downloading: http://repo1.maven.org/maven2/opensymphony/webwork/2.2.4/webwork-2.2.4.pom
15K downloaded
Downloading: http://repo1.maven.org/maven2/freemarker/freemarker/2.3.4/freemarker-2.3.4.pom
154b downloaded
Downloading: http://repo1.maven.org/maven2/org/codehaus/plexus/plexus-mail-sender-javamail/1.0-alpha-6/plexus-mail-sender-javamail-1.0-alpha-6.pom
1K downloaded
Downloading: http://repo1.maven.org/maven2/javax/mail/mail/1.4/mail-1.4.pom
993b downloaded
Downloading: http://repo1.maven.org/maven2/javax/activation/activation/1.1/activation-1.1.pom
1K downloaded
Downloading: http://repo1.maven.org/maven2/org/extremecomponents/extremecomponents/1.0.1/extremecomponents-1.0.1.pom
3K downloaded
Downloading: http://repo1.maven.org/maven2/commons-collections/commons-collections/3.0/commons-collections-3.0.pom
5K downloaded
Downloading: http://repo1.maven.org/maven2/commons-lang/commons-lang/2.0/commons-lang-2.0.pom
2K downloaded
Downloading: http://repo1.maven.org/maven2/taglibs/standard/1.0.2/standard-1.0.2.pom
149b downloaded
Downloading: http://repo1.maven.org/maven2/commons-beanutils/commons-beanutils-bean-collections/1.7.0/commons-beanutils-bean-collections-1.7.0.pom
185b downloaded
Downloading: http://repo1.maven.org/maven2/org/codehaus/plexus/plexus-component-api/1.0-alpha-15/plexus-component-api-1.0-alpha-15.pom
948b downloaded
Downloading: http://repo1.maven.org/maven2/taglibs/standard/1.1.2/standard-1.1.2.pom
149b downloaded
Downloading: http://repo1.maven.org/maven2/javax/servlet/jstl/1.1.2/jstl-1.1.2.pom
358b downloaded
Downloading: http://repo1.maven.org/maven2/opensymphony/sitemesh/2.2.1/sitemesh-2.2.1.pom
154b downloaded
[INFO] snapshot org.apache.maven.continuum:continuum-notifier-api:1.1-SNAPSHOT: checking for
updates from codehaus.org
[INFO] snapshot org.apache.maven.continuum:continuum-notifier-api:1.1-SNAPSHOT: checking for
updates from apache.snapshots
Downloading: http://snapshots.repository.codehaus.org//org/apache/maven/continuum/continuum-notifier-api/1.1-SNAPSHOT/continuum-notifier-api-1.1-SNAPSHOT.pom
Downloading: http://people.apache.org/repo/m2-snapshot-repository/org/apache/maven/continuum/continuum-notifier-api/1.1-SNAPSHOT/continuum-notifier-api-1.1-SNAPSHOT.pom
Downloading: http://snapshots.repository.codehaus.org//org/apache/maven/continuum/continuum-model/1.1-SNAPSHOT/continuum-model-1.1-SNAPSHOT.pom
Downloading: http://people.apache.org/repo/m2-snapshot-repository/org/apache/maven/continuum/continuum-model/1.1-SNAPSHOT/continuum-model-1.1-SNAPSHOT.pom
[INFO] snapshot org.apache.maven.continuum:continuum-configuration:1.1-SNAPSHOT: checking
for updates from codehaus.org
[INFO] snapshot org.apache.maven.continuum:continuum-configuration:1.1-SNAPSHOT: checking
for updates from apache.snapshots
Downloading: http://repo1.maven.org/maven2/org/codehaus/plexus/plexus-command-line/1.0-alpha-2/plexus-command-line-1.0-alpha-2.pom
599b downloaded
Downloading: http://repo1.maven.org/maven2/xerces/xercesImpl/2.6.2/xercesImpl-2.6.2.pom
150b downloaded
Downloading: http://repo1.maven.org/maven2/org/codehaus/plexus/plexus-action/1.0-alpha-6/plexus-action-1.0-alpha-6.pom
766b downloaded
[INFO] snapshot org.apache.maven.continuum:continuum-release:1.1-SNAPSHOT: checking for updates
from codehaus.org
[INFO] snapshot org.apache.maven.continuum:continuum-release:1.1-SNAPSHOT: checking for updates
from apache.snapshots
Downloading: http://snapshots.repository.codehaus.org//org/apache/maven/continuum/continuum-release/1.1-SNAPSHOT/continuum-release-1.1-SNAPSHOT.pom
Downloading: http://people.apache.org/repo/m2-snapshot-repository/org/apache/maven/continuum/continuum-release/1.1-SNAPSHOT/continuum-release-1.1-SNAPSHOT.pom
[INFO] snapshot org.apache.maven.continuum:continuum-store:1.1-SNAPSHOT: checking for updates
from codehaus.org
[INFO] snapshot org.apache.maven.continuum:continuum-store:1.1-SNAPSHOT: checking for updates
from apache.snapshots
Downloading: http://snapshots.repository.codehaus.org//org/apache/maven/continuum/continuum-store/1.1-SNAPSHOT/continuum-store-1.1-SNAPSHOT.pom
Downloading: http://people.apache.org/repo/m2-snapshot-repository/org/apache/maven/continuum/continuum-store/1.1-SNAPSHOT/continuum-store-1.1-SNAPSHOT.pom
Downloading: http://repo1.maven.org/maven2/org/codehaus/plexus/redback/redback-rbac-memory/1.0-alpha-1/redback-rbac-memory-1.0-alpha-1.pom
1K downloaded
Downloading: http://repo1.maven.org/maven2/org/codehaus/plexus/plexus-mail-sender-simple/1.0-alpha-6/plexus-mail-sender-simple-1.0-alpha-6.pom
837b downloaded
Downloading: http://repo1.maven.org/maven2/org/codehaus/plexus/plexus-expression-evaluator/1.0-alpha-1/plexus-expression-evaluator-1.0-alpha-1.jar
8K downloaded
Downloading: http://repo1.maven.org/maven2/org/codehaus/plexus/redback/redback-configuration/1.0-alpha-1/redback-configuration-1.0-alpha-1.jar
7K downloaded
Downloading: http://repo1.maven.org/maven2/org/codehaus/plexus/plexus-interactivity-api/1.0-alpha-4/plexus-interactivity-api-1.0-alpha-4.jar
13K downloaded
Downloading: http://repo1.maven.org/maven2/org/codehaus/plexus/registry/plexus-registry-api/1.0-alpha-1/plexus-registry-api-1.0-alpha-1.jar
17K downloaded
Downloading: http://repo1.maven.org/maven2/jdom/jdom/b9/jdom-b9.jar
132K downloaded
Downloading: http://repo1.maven.org/maven2/org/codehaus/plexus/redback/redback-rbac-role-manager/1.0-alpha-1/redback-rbac-role-manager-1.0-alpha-1.jar
53K downloaded
Downloading: http://repo1.maven.org/maven2/org/codehaus/plexus/plexus-command-line/1.0-alpha-2/plexus-command-line-1.0-alpha-2.jar
6K downloaded
Downloading: http://repo1.maven.org/maven2/org/codehaus/plexus/redback/redback-common-jdo/1.0-alpha-1/redback-common-jdo-1.0-alpha-1.jar
4K downloaded
Downloading: http://snapshots.repository.codehaus.org//org/apache/maven/continuum/continuum-store/1.1-SNAPSHOT/continuum-store-1.1-SNAPSHOT.jar
Downloading: http://people.apache.org/repo/m2-snapshot-repository/org/apache/maven/continuum/continuum-store/1.1-SNAPSHOT/continuum-store-1.1-SNAPSHOT.jar
Downloading: http://repo1.maven.org/maven2/org/codehaus/plexus/plexus-quartz/1.0-alpha-3/plexus-quartz-1.0-alpha-3.jar
13K downloaded
Downloading: http://snapshots.repository.codehaus.org//org/apache/maven/continuum/continuum-release/1.1-SNAPSHOT/continuum-release-1.1-SNAPSHOT.jar
Downloading: http://people.apache.org/repo/m2-snapshot-repository/org/apache/maven/continuum/continuum-release/1.1-SNAPSHOT/continuum-release-1.1-SNAPSHOT.jar
Downloading: http://repo1.maven.org/maven2/javax/transaction/jta/1.0.1B/jta-1.0.1B.jar
Downloading: http://repo1.maven.org/maven2/quartz/quartz/1.4.5/quartz-1.4.5.jar
315K downloaded
Downloading: http://repo1.maven.org/maven2/org/codehaus/plexus/registry/plexus-registry-commons/1.0-alpha-1/plexus-registry-commons-1.0-alpha-1.jar
8K downloaded
Downloading: http://repo1.maven.org/maven2/org/apache/maven/maven-error-diagnostics/2.0.5/maven-error-diagnostics-2.0.5.jar
13K downloaded
Downloading: http://repo1.maven.org/maven2/org/apache/maven/maven-plugin-descriptor/2.0.5/maven-plugin-descriptor-2.0.5.jar
36K downloaded
Downloading: http://snapshots.repository.codehaus.org//org/apache/maven/continuum/continuum-notifier-api/1.1-SNAPSHOT/continuum-notifier-api-1.1-SNAPSHOT.jar
Downloading: http://people.apache.org/repo/m2-snapshot-repository/org/apache/maven/continuum/continuum-notifier-api/1.1-SNAPSHOT/continuum-notifier-api-1.1-SNAPSHOT.jar
Downloading: http://repo1.maven.org/maven2/org/apache/maven/maven-plugin-parameter-documenter/2.0.5/maven-plugin-parameter-documenter-2.0.5.jar
20K downloaded
Downloading: http://repo1.maven.org/maven2/org/apache/maven/doxia/doxia-sink-api/1.0-alpha-7/doxia-sink-api-1.0-alpha-7.jar
5K downloaded
Downloading: http://repo1.maven.org/maven2/org/apache/maven/maven-monitor/2.0.5/maven-monitor-2.0.5.jar
10K downloaded
Downloading: http://repo1.maven.org/maven2/org/codehaus/plexus/plexus-mail-sender-api/1.0-alpha-6/plexus-mail-sender-api-1.0-alpha-6.jar
9K downloaded
Downloading: http://repo1.maven.org/maven2/org/codehaus/plexus/plexus-action/1.0-alpha-6/plexus-action-1.0-alpha-6.jar
9K downloaded
Downloading: http://repo1.maven.org/maven2/org/apache/maven/maven-plugin-registry/2.0.5/maven-plugin-registry-2.0.5.jar
28K downloaded
Downloading: http://repo1.maven.org/maven2/org/codehaus/plexus/registry/plexus-registry-test/1.0-alpha-1/plexus-registry-test-1.0-alpha-1.jar
4K downloaded
Downloading: http://repo1.maven.org/maven2/javax/resource/connector/1.0/connector-1.0.jar
Downloading: http://repo1.maven.org/maven2/org/apache/maven/reporting/maven-reporting-api/2.0.5/maven-reporting-api-2.0.5.jar
9K downloaded
Downloading: http://repo1.maven.org/maven2/commons-logging/commons-logging/1.0.2/commons-logging-1.0.2.jar
25K downloaded
Downloading: http://repo1.maven.org/maven2/org/apache/maven/maven-plugin-api/2.0.5/maven-plugin-api-2.0.5.jar
12K downloaded
Downloading: http://snapshots.repository.codehaus.org//org/apache/maven/continuum/continuum-model/1.1-SNAPSHOT/continuum-model-1.1-SNAPSHOT.jar
Downloading: http://people.apache.org/repo/m2-snapshot-repository/org/apache/maven/continuum/continuum-model/1.1-SNAPSHOT/continuum-model-1.1-SNAPSHOT.jar
Downloading: http://repo1.maven.org/maven2/org/codehaus/plexus/redback/redback-rbac-model/1.0-alpha-1/redback-rbac-model-1.0-alpha-1.jar
22K downloaded
Downloading: http://repo1.maven.org/maven2/org/apache/maven/maven-core/2.0.5/maven-core-2.0.5.jar
146K downloaded
Downloading: http://repo1.maven.org/maven2/org/codehaus/woodstox/wstx-asl/3.2.1/wstx-asl-3.2.1.jar
493K downloaded
[WARNING] *** CHECKSUM FAILED - Error retrieving checksum file for org/codehaus/woodstox/wstx-asl/3.2.1/wstx-asl-3.2.1.jar
- IGNORING
[INFO] ------------------------------------------------------------------------
[ERROR] BUILD ERROR
[INFO] ------------------------------------------------------------------------
[INFO] Failed to resolve artifact.

Missing:
----------
1) org.apache.maven.continuum:continuum-store:jar:1.1-SNAPSHOT

  Try downloading the file manually from the project website.

  Then, install it using the command: 
      mvn install:install-file -DgroupId=org.apache.maven.continuum -DartifactId=continuum-store
\
          -Dversion=1.1-SNAPSHOT -Dpackaging=jar -Dfile=/path/to/file

  Path to dependency: 
  	1) org.apache.maven.continuum:continuum-core:jar:1.1-SNAPSHOT
  	2) org.apache.maven.continuum:continuum-store:jar:1.1-SNAPSHOT

2) org.apache.maven.continuum:continuum-release:jar:1.1-SNAPSHOT

  Try downloading the file manually from the project website.

  Then, install it using the command: 
      mvn install:install-file -DgroupId=org.apache.maven.continuum -DartifactId=continuum-release
\
          -Dversion=1.1-SNAPSHOT -Dpackaging=jar -Dfile=/path/to/file

  Path to dependency: 
  	1) org.apache.maven.continuum:continuum-core:jar:1.1-SNAPSHOT
  	2) org.apache.maven.continuum:continuum-release:jar:1.1-SNAPSHOT

3) javax.transaction:jta:jar:1.0.1B

  Try downloading the file manually from: 
      http://java.sun.com/products/jta

  Then, install it using the command: 
      mvn install:install-file -DgroupId=javax.transaction -DartifactId=jta \
          -Dversion=1.0.1B -Dpackaging=jar -Dfile=/path/to/file

  Path to dependency: 
  	1) org.apache.maven.continuum:continuum-core:jar:1.1-SNAPSHOT
  	2) jpox:jpox:jar:1.1.7
  	3) javax.transaction:jta:jar:1.0.1B

4) org.apache.maven.continuum:continuum-notifier-api:jar:1.1-SNAPSHOT

  Try downloading the file manually from the project website.

  Then, install it using the command: 
      mvn install:install-file -DgroupId=org.apache.maven.continuum -DartifactId=continuum-notifier-api
\
          -Dversion=1.1-SNAPSHOT -Dpackaging=jar -Dfile=/path/to/file

  Path to dependency: 
  	1) org.apache.maven.continuum:continuum-core:jar:1.1-SNAPSHOT
  	2) org.apache.maven.continuum:continuum-notifier-api:jar:1.1-SNAPSHOT

5) javax.resource:connector:jar:1.0

  Try downloading the file manually from: 
      http://java.sun.com/j2ee/connector/download.html

  Then, install it using the command: 
      mvn install:install-file -DgroupId=javax.resource -DartifactId=connector \
          -Dversion=1.0 -Dpackaging=jar -Dfile=/path/to/file

  Path to dependency: 
  	1) org.apache.maven.continuum:continuum-core:jar:1.1-SNAPSHOT
  	2) jpox:jpox:jar:1.1.7
  	3) javax.resource:connector:jar:1.0

6) org.apache.maven.continuum:continuum-model:jar:1.1-SNAPSHOT

  Try downloading the file manually from the project website.

  Then, install it using the command: 
      mvn install:install-file -DgroupId=org.apache.maven.continuum -DartifactId=continuum-model
\
          -Dversion=1.1-SNAPSHOT -Dpackaging=jar -Dfile=/path/to/file

  Path to dependency: 
  	1) org.apache.maven.continuum:continuum-core:jar:1.1-SNAPSHOT
  	2) org.apache.maven.continuum:continuum-api:jar:1.1-SNAPSHOT
  	3) org.apache.maven.continuum:continuum-model:jar:1.1-SNAPSHOT

----------
6 required artifacts are missing.

for artifact: 
  org.apache.maven.continuum:continuum-core:jar:1.1-SNAPSHOT

from the specified remote repositories:
  codehaus.org (http://snapshots.repository.codehaus.org/),
  central (http://repo1.maven.org/maven2),
  apache.snapshots (http://people.apache.org/repo/m2-snapshot-repository)


[INFO] ------------------------------------------------------------------------
[INFO] For more information, run Maven with the -e switch
[INFO] ------------------------------------------------------------------------
[INFO] Total time: 46 seconds
[INFO] Finished at: Wed Jun 13 18:20:59 GMT 2007
[INFO] Final Memory: 18M/329M
[INFO] ------------------------------------------------------------------------

****************************************************************************



Mime
View raw message