maven-notifications mailing list archives

Site index · List index
Message view « Date » · « Thread »
Top « Date » · « Thread »
From "Continuum@maven.zones.apache.org" <contin...@maven.zones.apache.org>
Subject [continuum] BUILD SUCCESSFUL: Maven ANTLR Plugin
Date Sat, 14 Jul 2007 15:07:11 GMT
Online report : http://maven.zones.apache.org/continuum/buildResult.action?buildId=12163&projectId=3
Build statistics:
  State: Ok
  Previous State: Failed
  Started at: Sat 14 Jul 2007 15:05:53 +0000
  Finished at: Sat 14 Jul 2007 15:07:10 +0000
  Total time: 1m 17s
  Build Trigger: Schedule
  Build Number: 44
  Exit code: 0
  Building machine hostname: maven.zones.apache.org
  Operating system : SunOS(unknown)
  Java version : 1.5.0_12(Sun Microsystems Inc.)

****************************************************************************
SCM Changes:
****************************************************************************
Changed: no author @ no date
Comment: no comment
Files changed:
  src/it/java-grammar-report-test/pom.xml ( no revision )
  pom.xml ( no revision )

****************************************************************************
SCM Changes since last success:
****************************************************************************
Changed: no author @ no date
Comment: no comment
Files changed:
  src/it/java-grammar-report-test/pom.xml ( no revision )
  pom.xml ( no revision )

****************************************************************************
Dependencies Changes:
****************************************************************************
No dependencies changed

****************************************************************************
Test Summary:
****************************************************************************
Tests: 2
Failures: 0
Total time: 4960

****************************************************************************
Output:
****************************************************************************
[INFO] Scanning for projects...
[INFO] ----------------------------------------------------------------------------
[INFO] Building Maven ANTLR Plugin
[INFO]    task-segment: [clean, install]
[INFO] ----------------------------------------------------------------------------
[INFO] [clean:clean]
[INFO] Deleting directory /export/home/build/data/continuum/checkouts/3/target
[INFO] Deleting file-set: src/it (included: [**/target], excluded: [])
[INFO] Setting property: classpath.resource.loader.class => 'org.codehaus.plexus.velocity.ContextClassLoaderResourceLoader'.
[INFO] Setting property: velocimacro.messages.on => 'false'.
[INFO] Setting property: resource.loader => 'classpath'.
[INFO] Setting property: resource.manager.logwhenfound => 'false'.
[INFO] ************************************************************** 
[INFO] Starting Jakarta Velocity v1.4
[INFO] RuntimeInstance initializing.
[INFO] Default Properties File: org/apache/velocity/runtime/defaults/velocity.properties
[INFO] Default ResourceManager initializing. (class org.apache.velocity.runtime.resource.ResourceManagerImpl)
[INFO] Resource Loader Instantiated: org.codehaus.plexus.velocity.ContextClassLoaderResourceLoader
[INFO] ClasspathResourceLoader : initialization starting.
[INFO] ClasspathResourceLoader : initialization complete.
[INFO] ResourceCache : initialized. (class org.apache.velocity.runtime.resource.ResourceCacheImpl)
[INFO] Default ResourceManager initialization complete.
[INFO] Loaded System Directive: org.apache.velocity.runtime.directive.Literal
[INFO] Loaded System Directive: org.apache.velocity.runtime.directive.Macro
[INFO] Loaded System Directive: org.apache.velocity.runtime.directive.Parse
[INFO] Loaded System Directive: org.apache.velocity.runtime.directive.Include
[INFO] Loaded System Directive: org.apache.velocity.runtime.directive.Foreach
[INFO] Created: 20 parsers.
[INFO] Velocimacro : initialization starting.
[INFO] Velocimacro : adding VMs from VM library template : VM_global_library.vm
[ERROR] ResourceManager : unable to find resource 'VM_global_library.vm' in any resource loader.
[INFO] Velocimacro : error using  VM library template VM_global_library.vm : org.apache.velocity.exception.ResourceNotFoundException: Unable to find resource 'VM_global_library.vm'
[INFO] Velocimacro :  VM library template macro registration complete.
[INFO] Velocimacro : allowInline = true : VMs can be defined inline in templates
[INFO] Velocimacro : allowInlineToOverride = false : VMs defined inline may NOT replace previous VM definitions
[INFO] Velocimacro : allowInlineLocal = false : VMs defined inline will be  global in scope if allowed.
[INFO] Velocimacro : initialization complete.
[INFO] Velocity successfully started.
[INFO] [modello:java {execution: default}]
[INFO] outputDirectory: /export/home/build/data/continuum/checkouts/3/target/generated-sources/modello
[INFO] [plugin:descriptor]
[INFO] Using 2 extractors.
[INFO] Applying extractor for language: java
[INFO] Extractor for language: java found 2 mojo descriptors.
[INFO] Applying extractor for language: bsh
[INFO] Extractor for language: bsh found 0 mojo descriptors.
[INFO] [resources:resources]
[INFO] Using default encoding to copy filtered resources.
[INFO] Copying 2 resources
[INFO] [compiler:compile]
[INFO] Compiling 5 source files to /export/home/build/data/continuum/checkouts/3/target/classes
[INFO] [resources:testResources]
[INFO] Using default encoding to copy filtered resources.
[INFO] Copying 8 resources
[INFO] [compiler:testCompile]
[INFO] Compiling 3 source files to /export/home/build/data/continuum/checkouts/3/target/test-classes
[INFO] [surefire:test]
[INFO] Surefire report directory: /export/home/build/data/continuum/checkouts/3/target/surefire-reports

-------------------------------------------------------
 T E S T S
-------------------------------------------------------
Running org.apache.maven.plugin.antlr.AntlrPluginTest
[INFO] Using Antlr grammar: /export/home/build/data/continuum/checkouts/3/src/test/resources/unit/java-grammar-test/src/main/antlr/java15.g
ANTLR Parser Generator   Version 2.7.7 (20060906)   1989-2005
/export/home/build/data/continuum/checkouts/3/src/test/resources/unit/java-grammar-test/src/main/antlr/java15.g:937: warning:Syntactic predicate superfluous for single alternative
/export/home/build/data/continuum/checkouts/3/src/test/resources/unit/java-grammar-test/src/main/antlr/java15.g:1393: warning:empty alternative makes no sense in (...)* or (...)+

[INFO] Using Antlr grammar: /export/home/build/data/continuum/checkouts/3/src/test/resources/unit/java-grammar-inheritance-test/src/main/antlr/StdCParser.g
ANTLR Parser Generator   Version 2.7.7 (20060906)   1989-2005
/export/home/build/data/continuum/checkouts/3/src/test/resources/unit/java-grammar-inheritance-test/src/main/antlr/StdCParser.g:230: warning:nondeterminism between alts 1 and 4 of block upon
/export/home/build/data/continuum/checkouts/3/src/test/resources/unit/java-grammar-inheritance-test/src/main/antlr/StdCParser.g:230:     k==1:"struct"
/export/home/build/data/continuum/checkouts/3/src/test/resources/unit/java-grammar-inheritance-test/src/main/antlr/StdCParser.g:230:     k==2:
/export/home/build/data/continuum/checkouts/3/src/test/resources/unit/java-grammar-inheritance-test/src/main/antlr/StdCParser.g:230: warning:nondeterminism between alts 2 and 4 of block upon
/export/home/build/data/continuum/checkouts/3/src/test/resources/unit/java-grammar-inheritance-test/src/main/antlr/StdCParser.g:230:     k==1:"union"
[INFO] Using Antlr grammar: /export/home/build/data/continuum/checkouts/3/src/test/resources/unit/java-grammar-inheritance-test/src/main/antlr/GnuCParser.g
/export/home/build/data/continuum/checkouts/3/src/test/resources/unit/java-grammar-inheritance-test/src/main/antlr/StdCParser.g:230:     k==2:
/export/home/build/data/continuum/checkouts/3/src/test/resources/unit/java-grammar-inheritance-test/src/main/antlr/StdCParser.g:230: warning:nondeterminism between alts 3 and 4 of block upon
/export/home/build/data/continuum/checkouts/3/src/test/resources/unit/java-grammar-inheritance-test/src/main/antlr/StdCParser.g:230:     k==1:"enum"
/export/home/build/data/continuum/checkouts/3/src/test/resources/unit/java-grammar-inheritance-test/src/main/antlr/StdCParser.g:230:     k==2:
/export/home/build/data/continuum/checkouts/3/src/test/resources/unit/java-grammar-inheritance-test/src/main/antlr/StdCParser.g:329: warning:nondeterminism between alts 1 and 4 of block upon
/export/home/build/data/continuum/checkouts/3/src/test/resources/unit/java-grammar-inheritance-test/src/main/antlr/StdCParser.g:329:     k==1:"struct"
/export/home/build/data/continuum/checkouts/3/src/test/resources/unit/java-grammar-inheritance-test/src/main/antlr/StdCParser.g:329:     k==2:
/export/home/build/data/continuum/checkouts/3/src/test/resources/unit/java-grammar-inheritance-test/src/main/antlr/StdCParser.g:329: warning:nondeterminism between alts 2 and 4 of block upon
/export/home/build/data/continuum/checkouts/3/src/test/resources/unit/java-grammar-inheritance-test/src/main/antlr/StdCParser.g:329:     k==1:"union"
/export/home/build/data/continuum/checkouts/3/src/test/resources/unit/java-grammar-inheritance-test/src/main/antlr/StdCParser.g:329:     k==2:
/export/home/build/data/continuum/checkouts/3/src/test/resources/unit/java-grammar-inheritance-test/src/main/antlr/StdCParser.g:329: warning:nondeterminism between alts 3 and 4 of block upon
/export/home/build/data/continuum/checkouts/3/src/test/resources/unit/java-grammar-inheritance-test/src/main/antlr/StdCParser.g:329:     k==1:"enum"
/export/home/build/data/continuum/checkouts/3/src/test/resources/unit/java-grammar-inheritance-test/src/main/antlr/StdCParser.g:329:     k==2:
/export/home/build/data/continuum/checkouts/3/src/test/resources/unit/java-grammar-inheritance-test/src/main/antlr/StdCParser.g:344:17: warning:Rule 'declarator' returns a value
/export/home/build/data/continuum/checkouts/3/src/test/resources/unit/java-grammar-inheritance-test/src/main/antlr/StdCParser.g:524: warning:nondeterminism between alts 1 and 4 of block upon
/export/home/build/data/continuum/checkouts/3/src/test/resources/unit/java-grammar-inheritance-test/src/main/antlr/StdCParser.g:524:     k==1:"struct"
/export/home/build/data/continuum/checkouts/3/src/test/resources/unit/java-grammar-inheritance-test/src/main/antlr/StdCParser.g:524:     k==2:
/export/home/build/data/continuum/checkouts/3/src/test/resources/unit/java-grammar-inheritance-test/src/main/antlr/StdCParser.g:524: warning:nondeterminism between alts 2 and 4 of block upon
/export/home/build/data/continuum/checkouts/3/src/test/resources/unit/java-grammar-inheritance-test/src/main/antlr/StdCParser.g:524:     k==1:"union"
/export/home/build/data/continuum/checkouts/3/src/test/resources/unit/java-grammar-inheritance-test/src/main/antlr/StdCParser.g:524:     k==2:
/export/home/build/data/continuum/checkouts/3/src/test/resources/unit/java-grammar-inheritance-test/src/main/antlr/StdCParser.g:524: warning:nondeterminism between alts 3 and 4 of block upon
/export/home/build/data/continuum/checkouts/3/src/test/resources/unit/java-grammar-inheritance-test/src/main/antlr/StdCParser.g:524:     k==1:"enum"
/export/home/build/data/continuum/checkouts/3/src/test/resources/unit/java-grammar-inheritance-test/src/main/antlr/StdCParser.g:524:     k==2:
/export/home/build/data/continuum/checkouts/3/src/test/resources/unit/java-grammar-inheritance-test/src/main/antlr/StdCParser.g:534: warning:Syntactic predicate superfluous for single alternative
/export/home/build/data/continuum/checkouts/3/src/test/resources/unit/java-grammar-inheritance-test/src/main/antlr/StdCParser.g:1080: warning:lexical nondeterminism between alts 2 and 3 of block upon
/export/home/build/data/continuum/checkouts/3/src/test/resources/unit/java-grammar-inheritance-test/src/main/antlr/StdCParser.g:1080:     k==1:'\r'
/export/home/build/data/continuum/checkouts/3/src/test/resources/unit/java-grammar-inheritance-test/src/main/antlr/StdCParser.g:1080:     k==2:'\n'
/export/home/build/data/continuum/checkouts/3/src/test/resources/unit/java-grammar-inheritance-test/src/main/antlr/StdCParser.g:1080:     k==3:'\u0000'..'\u00ff'
/export/home/build/data/continuum/checkouts/3/src/test/resources/unit/java-grammar-inheritance-test/src/main/antlr/StdCParser.g:1130: warning:lexical nondeterminism upon
/export/home/build/data/continuum/checkouts/3/src/test/resources/unit/java-grammar-inheritance-test/src/main/antlr/StdCParser.g:1130:     k==1:'\t','\u000c',' '
/export/home/build/data/continuum/checkouts/3/src/test/resources/unit/java-grammar-inheritance-test/src/main/antlr/StdCParser.g:1130:     k==2:'\u0000'..'\u00ff'
/export/home/build/data/continuum/checkouts/3/src/test/resources/unit/java-grammar-inheritance-test/src/main/antlr/StdCParser.g:1130:     k==3:<end-of-token>,'\u0000'..'\u00ff'
/export/home/build/data/continuum/checkouts/3/src/test/resources/unit/java-grammar-inheritance-test/src/main/antlr/StdCParser.g:1130:     between alt 1 and exit branch of block
/export/home/build/data/continuum/checkouts/3/src/test/resources/unit/java-grammar-inheritance-test/src/main/antlr/StdCParser.g:1131:9: warning:lexical nondeterminism between alts 1 and 3 of block upon
/export/home/build/data/continuum/checkouts/3/src/test/resources/unit/java-grammar-inheritance-test/src/main/antlr/StdCParser.g:1131:9:     k==1:'"'
/export/home/build/data/continuum/checkouts/3/src/test/resources/unit/java-grammar-inheritance-test/src/main/antlr/StdCParser.g:1131:9:     k==2:'\u0000'..'\u00ff'
/export/home/build/data/continuum/checkouts/3/src/test/resources/unit/java-grammar-inheritance-test/src/main/antlr/StdCParser.g:1131:9:     k==3:'\u0000'..'\u00ff'
/export/home/build/data/continuum/checkouts/3/src/test/resources/unit/java-grammar-inheritance-test/src/main/antlr/StdCParser.g:1131:9: warning:lexical nondeterminism between alts 2 and 3 of block upon
/export/home/build/data/continuum/checkouts/3/src/test/resources/unit/java-grammar-inheritance-test/src/main/antlr/StdCParser.g:1131:9:     k==1:'A'..'Z','_','a'..'z'
/export/home/build/data/continuum/checkouts/3/src/test/resources/unit/java-grammar-inheritance-test/src/main/antlr/StdCParser.g:1131:9:     k==2:'\u0000'..'\u00ff'
/export/home/build/data/continuum/checkouts/3/src/test/resources/unit/java-grammar-inheritance-test/src/main/antlr/StdCParser.g:1131:9:     k==3:<end-of-token>,'\u0000'..'\u00ff'
/export/home/build/data/continuum/checkouts/3/src/test/resources/unit/java-grammar-inheritance-test/src/main/antlr/StdCParser.g:1138: warning:lexical nondeterminism upon
/export/home/build/data/continuum/checkouts/3/src/test/resources/unit/java-grammar-inheritance-test/src/main/antlr/StdCParser.g:1138:     k==1:'\t','\u000c',' '
/export/home/build/data/continuum/checkouts/3/src/test/resources/unit/java-grammar-inheritance-test/src/main/antlr/StdCParser.g:1138:     k==2:'\u0000'..'\u00ff'
/export/home/build/data/continuum/checkouts/3/src/test/resources/unit/java-grammar-inheritance-test/src/main/antlr/StdCParser.g:1138:     k==3:<end-of-token>,'\u0000'..'\u00ff'
/export/home/build/data/continuum/checkouts/3/src/test/resources/unit/java-grammar-inheritance-test/src/main/antlr/StdCParser.g:1138:     between alt 1 and exit branch of block
/export/home/build/data/continuum/checkouts/3/src/test/resources/unit/java-grammar-inheritance-test/src/main/antlr/StdCParser.g:1139:9: warning:lexical nondeterminism between alts 1 and 2 of block upon
/export/home/build/data/continuum/checkouts/3/src/test/resources/unit/java-grammar-inheritance-test/src/main/antlr/StdCParser.g:1139:9:     k==1:'1'
/export/home/build/data/continuum/checkouts/3/src/test/resources/unit/java-grammar-inheritance-test/src/main/antlr/StdCParser.g:1139:9:     k==2:'\u0000'..'\u00ff'
/export/home/build/data/continuum/checkouts/3/src/test/resources/unit/java-grammar-inheritance-test/src/main/antlr/StdCParser.g:1139:9:     k==3:<end-of-token>,'\u0000'..'\u00ff'
/export/home/build/data/continuum/checkouts/3/src/test/resources/unit/java-grammar-inheritance-test/src/main/antlr/StdCParser.g:1140: warning:lexical nondeterminism upon
/export/home/build/data/continuum/checkouts/3/src/test/resources/unit/java-grammar-inheritance-test/src/main/antlr/StdCParser.g:1140:     k==1:'\t','\u000c',' '
/export/home/build/data/continuum/checkouts/3/src/test/resources/unit/java-grammar-inheritance-test/src/main/antlr/StdCParser.g:1140:     k==2:'\u0000'..'\u00ff'
/export/home/build/data/continuum/checkouts/3/src/test/resources/unit/java-grammar-inheritance-test/src/main/antlr/StdCParser.g:1140:     k==3:<end-of-token>,'\u0000'..'\u00ff'
/export/home/build/data/continuum/checkouts/3/src/test/resources/unit/java-grammar-inheritance-test/src/main/antlr/StdCParser.g:1140:     between alt 1 and exit branch of block
/export/home/build/data/continuum/checkouts/3/src/test/resources/unit/java-grammar-inheritance-test/src/main/antlr/StdCParser.g:1141:9: warning:lexical nondeterminism between alts 1 and 2 of block upon
/export/home/build/data/continuum/checkouts/3/src/test/resources/unit/java-grammar-inheritance-test/src/main/antlr/StdCParser.g:1141:9:     k==1:'2'
/export/home/build/data/continuum/checkouts/3/src/test/resources/unit/java-grammar-inheritance-test/src/main/antlr/StdCParser.g:1141:9:     k==2:'\u0000'..'\u00ff'
/export/home/build/data/continuum/checkouts/3/src/test/resources/unit/java-grammar-inheritance-test/src/main/antlr/StdCParser.g:1141:9:     k==3:<end-of-token>,'\u0000'..'\u00ff'
/export/home/build/data/continuum/checkouts/3/src/test/resources/unit/java-grammar-inheritance-test/src/main/antlr/StdCParser.g:1142: warning:lexical nondeterminism upon
/export/home/build/data/continuum/checkouts/3/src/test/resources/unit/java-grammar-inheritance-test/src/main/antlr/StdCParser.g:1142:     k==1:'\t','\u000c',' '
/export/home/build/data/continuum/checkouts/3/src/test/resources/unit/java-grammar-inheritance-test/src/main/antlr/StdCParser.g:1142:     k==2:'\u0000'..'\u00ff'
/export/home/build/data/continuum/checkouts/3/src/test/resources/unit/java-grammar-inheritance-test/src/main/antlr/StdCParser.g:1142:     k==3:<end-of-token>,'\u0000'..'\u00ff'
/export/home/build/data/continuum/checkouts/3/src/test/resources/unit/java-grammar-inheritance-test/src/main/antlr/StdCParser.g:1142:     between alt 1 and exit branch of block
/export/home/build/data/continuum/checkouts/3/src/test/resources/unit/java-grammar-inheritance-test/src/main/antlr/StdCParser.g:1143:9: warning:lexical nondeterminism between alts 1 and 2 of block upon
/export/home/build/data/continuum/checkouts/3/src/test/resources/unit/java-grammar-inheritance-test/src/main/antlr/StdCParser.g:1143:9:     k==1:'3'
/export/home/build/data/continuum/checkouts/3/src/test/resources/unit/java-grammar-inheritance-test/src/main/antlr/StdCParser.g:1143:9:     k==2:'\u0000'..'\u00ff'
/export/home/build/data/continuum/checkouts/3/src/test/resources/unit/java-grammar-inheritance-test/src/main/antlr/StdCParser.g:1143:9:     k==3:<end-of-token>,'\u0000'..'\u00ff'
/export/home/build/data/continuum/checkouts/3/src/test/resources/unit/java-grammar-inheritance-test/src/main/antlr/StdCParser.g:1144: warning:lexical nondeterminism upon
/export/home/build/data/continuum/checkouts/3/src/test/resources/unit/java-grammar-inheritance-test/src/main/antlr/StdCParser.g:1144:     k==1:'\t','\u000c',' '
/export/home/build/data/continuum/checkouts/3/src/test/resources/unit/java-grammar-inheritance-test/src/main/antlr/StdCParser.g:1144:     k==2:'\u0000'..'\u00ff'
/export/home/build/data/continuum/checkouts/3/src/test/resources/unit/java-grammar-inheritance-test/src/main/antlr/StdCParser.g:1144:     k==3:<end-of-token>,'\u0000'..'\u00ff'
/export/home/build/data/continuum/checkouts/3/src/test/resources/unit/java-grammar-inheritance-test/src/main/antlr/StdCParser.g:1144:     between alt 1 and exit branch of block
/export/home/build/data/continuum/checkouts/3/src/test/resources/unit/java-grammar-inheritance-test/src/main/antlr/StdCParser.g:1145:9: warning:lexical nondeterminism between alts 1 and 2 of block upon
/export/home/build/data/continuum/checkouts/3/src/test/resources/unit/java-grammar-inheritance-test/src/main/antlr/StdCParser.g:1145:9:     k==1:'4'
/export/home/build/data/continuum/checkouts/3/src/test/resources/unit/java-grammar-inheritance-test/src/main/antlr/StdCParser.g:1145:9:     k==2:'\u0000'..'\u00ff'
/export/home/build/data/continuum/checkouts/3/src/test/resources/unit/java-grammar-inheritance-test/src/main/antlr/StdCParser.g:1145:9:     k==3:<end-of-token>,'\u0000'..'\u00ff'
/export/home/build/data/continuum/checkouts/3/src/test/resources/unit/java-grammar-inheritance-test/src/main/antlr/StdCParser.g:1179: warning:lexical nondeterminism between alts 1 and 2 of block upon
/export/home/build/data/continuum/checkouts/3/src/test/resources/unit/java-grammar-inheritance-test/src/main/antlr/StdCParser.g:1179:     k==1:'\\'
/export/home/build/data/continuum/checkouts/3/src/test/resources/unit/java-grammar-inheritance-test/src/main/antlr/StdCParser.g:1179:     k==2:'"','\'','0'..'7','?','\\','a','b','f','n','r','t','v','x'
/export/home/build/data/continuum/checkouts/3/src/test/resources/unit/java-grammar-inheritance-test/src/main/antlr/StdCParser.g:1179:     k==3:'\u0000'..'\u00ff'
/export/home/build/data/continuum/checkouts/3/src/test/resources/unit/java-grammar-inheritance-test/src/main/antlr/StdCParser.g:1354: warning:lexical nondeterminism upon
/export/home/build/data/continuum/checkouts/3/src/test/resources/unit/java-grammar-inheritance-test/src/main/antlr/StdCParser.g:1354:     k==1:'a'..'z'
/export/home/build/data/continuum/checkouts/3/src/test/resources/unit/java-grammar-inheritance-test/src/main/antlr/StdCParser.g:1354:     k==2:<end-of-token>,'\u0000'..'\u00ff'
/export/home/build/data/continuum/checkouts/3/src/test/resources/unit/java-grammar-inheritance-test/src/main/antlr/StdCParser.g:1354:     k==3:<end-of-token>,'\u0000'..'\u00ff'
/export/home/build/data/continuum/checkouts/3/src/test/resources/unit/java-grammar-inheritance-test/src/main/antlr/StdCParser.g:1354:     between alt 1 and exit branch of block
/export/home/build/data/continuum/checkouts/3/src/test/resources/unit/java-grammar-inheritance-test/src/main/antlr/StdCParser.g:1354: warning:lexical nondeterminism upon
/export/home/build/data/continuum/checkouts/3/src/test/resources/unit/java-grammar-inheritance-test/src/main/antlr/StdCParser.g:1354:     k==1:'A'..'Z'
/export/home/build/data/continuum/checkouts/3/src/test/resources/unit/java-grammar-inheritance-test/src/main/antlr/StdCParser.g:1354:     k==2:<end-of-token>,'\u0000'..'\u00ff'
/export/home/build/data/continuum/checkouts/3/src/test/resources/unit/java-grammar-inheritance-test/src/main/antlr/StdCParser.g:1354:     k==3:<end-of-token>,'\u0000'..'\u00ff'
/export/home/build/data/continuum/checkouts/3/src/test/resources/unit/java-grammar-inheritance-test/src/main/antlr/StdCParser.g:1354:     between alt 2 and exit branch of block
/export/home/build/data/continuum/checkouts/3/src/test/resources/unit/java-grammar-inheritance-test/src/main/antlr/StdCParser.g:1354: warning:lexical nondeterminism upon
/export/home/build/data/continuum/checkouts/3/src/test/resources/unit/java-grammar-inheritance-test/src/main/antlr/StdCParser.g:1354:     k==1:'_'
/export/home/build/data/continuum/checkouts/3/src/test/resources/unit/java-grammar-inheritance-test/src/main/antlr/StdCParser.g:1354:     k==2:<end-of-token>,'\u0000'..'\u00ff'
/export/home/build/data/continuum/checkouts/3/src/test/resources/unit/java-grammar-inheritance-test/src/main/antlr/StdCParser.g:1354:     k==3:<end-of-token>,'\u0000'..'\u00ff'
/export/home/build/data/continuum/checkouts/3/src/test/resources/unit/java-grammar-inheritance-test/src/main/antlr/StdCParser.g:1354:     between alt 3 and exit branch of block
/export/home/build/data/continuum/checkouts/3/src/test/resources/unit/java-grammar-inheritance-test/src/main/antlr/StdCParser.g:1354: warning:lexical nondeterminism upon
/export/home/build/data/continuum/checkouts/3/src/test/resources/unit/java-grammar-inheritance-test/src/main/antlr/StdCParser.g:1354:     k==1:'0'..'9'
/export/home/build/data/continuum/checkouts/3/src/test/resources/unit/java-grammar-inheritance-test/src/main/antlr/StdCParser.g:1354:     k==2:<end-of-token>,'\u0000'..'\u00ff'
/export/home/build/data/continuum/checkouts/3/src/test/resources/unit/java-grammar-inheritance-test/src/main/antlr/StdCParser.g:1354:     k==3:<end-of-token>,'\u0000'..'\u00ff'
/export/home/build/data/continuum/checkouts/3/src/test/resources/unit/java-grammar-inheritance-test/src/main/antlr/StdCParser.g:1354:     between alt 4 and exit branch of block

ANTLR Parser Generator   Version 2.7.7 (20060906)   1989-2005
[INFO] Using Antlr grammar: /export/home/build/data/continuum/checkouts/3/src/test/resources/unit/java-grammar-inheritance-test/src/main/antlr/GnuCTreeParser.g
error: cannot find/copy importVocab file /export/home/build/data/continuum/checkouts/3/src/test/resources/unit/java-grammar-inheritance-test/src/main/antlr/STDCTokenTypes.txt
/export/home/build/data/continuum/checkouts/3/target/test/unit/java-grammar-inheritance-test/target/generated-sources/antlr/expandedGnuCParser.g:1020: warning:lexical nondeterminism upon
/export/home/build/data/continuum/checkouts/3/target/test/unit/java-grammar-inheritance-test/target/generated-sources/antlr/expandedGnuCParser.g:1020:     k==1:'a'..'z'
/export/home/build/data/continuum/checkouts/3/target/test/unit/java-grammar-inheritance-test/target/generated-sources/antlr/expandedGnuCParser.g:1020:     k==2:<end-of-token>,'\u0000'..'\u00ff'
/export/home/build/data/continuum/checkouts/3/target/test/unit/java-grammar-inheritance-test/target/generated-sources/antlr/expandedGnuCParser.g:1020:     k==3:<end-of-token>,'\u0000'..'\u00ff'
/export/home/build/data/continuum/checkouts/3/target/test/unit/java-grammar-inheritance-test/target/generated-sources/antlr/expandedGnuCParser.g:1020:     between alt 1 and exit branch of block
/export/home/build/data/continuum/checkouts/3/target/test/unit/java-grammar-inheritance-test/target/generated-sources/antlr/expandedGnuCParser.g:1020: warning:lexical nondeterminism upon
/export/home/build/data/continuum/checkouts/3/target/test/unit/java-grammar-inheritance-test/target/generated-sources/antlr/expandedGnuCParser.g:1020:     k==1:'A'..'Z'
/export/home/build/data/continuum/checkouts/3/target/test/unit/java-grammar-inheritance-test/target/generated-sources/antlr/expandedGnuCParser.g:1020:     k==2:<end-of-token>,'\u0000'..'\u00ff'
/export/home/build/data/continuum/checkouts/3/target/test/unit/java-grammar-inheritance-test/target/generated-sources/antlr/expandedGnuCParser.g:1020:     k==3:<end-of-token>,'\u0000'..'\u00ff'
/export/home/build/data/continuum/checkouts/3/target/test/unit/java-grammar-inheritance-test/target/generated-sources/antlr/expandedGnuCParser.g:1020:     between alt 2 and exit branch of block
/export/home/build/data/continuum/checkouts/3/target/test/unit/java-grammar-inheritance-test/target/generated-sources/antlr/expandedGnuCParser.g:1020: warning:lexical nondeterminism upon
/export/home/build/data/continuum/checkouts/3/target/test/unit/java-grammar-inheritance-test/target/generated-sources/antlr/expandedGnuCParser.g:1020:     k==1:'_'
/export/home/build/data/continuum/checkouts/3/target/test/unit/java-grammar-inheritance-test/target/generated-sources/antlr/expandedGnuCParser.g:1020:     k==2:<end-of-token>,'\u0000'..'\u00ff'
/export/home/build/data/continuum/checkouts/3/target/test/unit/java-grammar-inheritance-test/target/generated-sources/antlr/expandedGnuCParser.g:1020:     k==3:<end-of-token>,'\u0000'..'\u00ff'
/export/home/build/data/continuum/checkouts/3/target/test/unit/java-grammar-inheritance-test/target/generated-sources/antlr/expandedGnuCParser.g:1020:     between alt 3 and exit branch of block
/export/home/build/data/continuum/checkouts/3/target/test/unit/java-grammar-inheritance-test/target/generated-sources/antlr/expandedGnuCParser.g:1020: warning:lexical nondeterminism upon
/export/home/build/data/continuum/checkouts/3/target/test/unit/java-grammar-inheritance-test/target/generated-sources/antlr/expandedGnuCParser.g:1020:     k==1:'$'
/export/home/build/data/continuum/checkouts/3/target/test/unit/java-grammar-inheritance-test/target/generated-sources/antlr/expandedGnuCParser.g:1020:     k==2:<end-of-token>,'\u0000'..'\u00ff'
/export/home/build/data/continuum/checkouts/3/target/test/unit/java-grammar-inheritance-test/target/generated-sources/antlr/expandedGnuCParser.g:1020:     k==3:<end-of-token>,'\u0000'..'\u00ff'
/export/home/build/data/continuum/checkouts/3/target/test/unit/java-grammar-inheritance-test/target/generated-sources/antlr/expandedGnuCParser.g:1020:     between alt 4 and exit branch of block
/export/home/build/data/continuum/checkouts/3/target/test/unit/java-grammar-inheritance-test/target/generated-sources/antlr/expandedGnuCParser.g:1020: warning:lexical nondeterminism upon
/export/home/build/data/continuum/checkouts/3/target/test/unit/java-grammar-inheritance-test/target/generated-sources/antlr/expandedGnuCParser.g:1020:     k==1:'0'..'9'
/export/home/build/data/continuum/checkouts/3/target/test/unit/java-grammar-inheritance-test/target/generated-sources/antlr/expandedGnuCParser.g:1020:     k==2:<end-of-token>,'\u0000'..'\u00ff'
/export/home/build/data/continuum/checkouts/3/target/test/unit/java-grammar-inheritance-test/target/generated-sources/antlr/expandedGnuCParser.g:1020:     k==3:<end-of-token>,'\u0000'..'\u00ff'
/export/home/build/data/continuum/checkouts/3/target/test/unit/java-grammar-inheritance-test/target/generated-sources/antlr/expandedGnuCParser.g:1020:     between alt 5 and exit branch of block
/export/home/build/data/continuum/checkouts/3/target/test/unit/java-grammar-inheritance-test/target/generated-sources/antlr/expandedGnuCParser.g:1190: warning:lexical nondeterminism between alts 2 and 3 of block upon
/export/home/build/data/continuum/checkouts/3/target/test/unit/java-grammar-inheritance-test/target/generated-sources/antlr/expandedGnuCParser.g:1190:     k==1:'\r'
/export/home/build/data/continuum/checkouts/3/target/test/unit/java-grammar-inheritance-test/target/generated-sources/antlr/expandedGnuCParser.g:1190:     k==2:'\n'
/export/home/build/data/continuum/checkouts/3/target/test/unit/java-grammar-inheritance-test/target/generated-sources/antlr/expandedGnuCParser.g:1190:     k==3:'\u0000'..'\u00ff'
/export/home/build/data/continuum/checkouts/3/target/test/unit/java-grammar-inheritance-test/target/generated-sources/antlr/expandedGnuCParser.g:1236: warning:lexical nondeterminism upon
/export/home/build/data/continuum/checkouts/3/target/test/unit/java-grammar-inheritance-test/target/generated-sources/antlr/expandedGnuCParser.g:1236:     k==1:'\t','\u000c',' '
/export/home/build/data/continuum/checkouts/3/target/test/unit/java-grammar-inheritance-test/target/generated-sources/antlr/expandedGnuCParser.g:1236:     k==2:'\u0000'..'\u00ff'
/export/home/build/data/continuum/checkouts/3/target/test/unit/java-grammar-inheritance-test/target/generated-sources/antlr/expandedGnuCParser.g:1236:     k==3:<end-of-token>,'\u0000'..'\u00ff'
/export/home/build/data/continuum/checkouts/3/target/test/unit/java-grammar-inheritance-test/target/generated-sources/antlr/expandedGnuCParser.g:1236:     between alt 1 and exit branch of block
/export/home/build/data/continuum/checkouts/3/target/test/unit/java-grammar-inheritance-test/target/generated-sources/antlr/expandedGnuCParser.g:1237:9: warning:lexical nondeterminism between alts 1 and 3 of block upon
/export/home/build/data/continuum/checkouts/3/target/test/unit/java-grammar-inheritance-test/target/generated-sources/antlr/expandedGnuCParser.g:1237:9:     k==1:'"'
/export/home/build/data/continuum/checkouts/3/target/test/unit/java-grammar-inheritance-test/target/generated-sources/antlr/expandedGnuCParser.g:1237:9:     k==2:'\u0000'..'\u00ff'
/export/home/build/data/continuum/checkouts/3/target/test/unit/java-grammar-inheritance-test/target/generated-sources/antlr/expandedGnuCParser.g:1237:9:     k==3:'\u0000'..'\u00ff'
/export/home/build/data/continuum/checkouts/3/target/test/unit/java-grammar-inheritance-test/target/generated-sources/antlr/expandedGnuCParser.g:1237:9: warning:lexical nondeterminism between alts 2 and 3 of block upon
/export/home/build/data/continuum/checkouts/3/target/test/unit/java-grammar-inheritance-test/target/generated-sources/antlr/expandedGnuCParser.g:1237:9:     k==1:'$','A'..'Z','_','a'..'z'
/export/home/build/data/continuum/checkouts/3/target/test/unit/java-grammar-inheritance-test/target/generated-sources/antlr/expandedGnuCParser.g:1237:9:     k==2:'\u0000'..'\u00ff'
/export/home/build/data/continuum/checkouts/3/target/test/unit/java-grammar-inheritance-test/target/generated-sources/antlr/expandedGnuCParser.g:1237:9:     k==3:<end-of-token>,'\u0000'..'\u00ff'
/export/home/build/data/continuum/checkouts/3/target/test/unit/java-grammar-inheritance-test/target/generated-sources/antlr/expandedGnuCParser.g:1244: warning:lexical nondeterminism upon
/export/home/build/data/continuum/checkouts/3/target/test/unit/java-grammar-inheritance-test/target/generated-sources/antlr/expandedGnuCParser.g:1244:     k==1:'\t','\u000c',' '
/export/home/build/data/continuum/checkouts/3/target/test/unit/java-grammar-inheritance-test/target/generated-sources/antlr/expandedGnuCParser.g:1244:     k==2:'\u0000'..'\u00ff'
/export/home/build/data/continuum/checkouts/3/target/test/unit/java-grammar-inheritance-test/target/generated-sources/antlr/expandedGnuCParser.g:1244:     k==3:<end-of-token>,'\u0000'..'\u00ff'
/export/home/build/data/continuum/checkouts/3/target/test/unit/java-grammar-inheritance-test/target/generated-sources/antlr/expandedGnuCParser.g:1244:     between alt 1 and exit branch of block
/export/home/build/data/continuum/checkouts/3/target/test/unit/java-grammar-inheritance-test/target/generated-sources/antlr/expandedGnuCParser.g:1245:9: warning:lexical nondeterminism between alts 1 and 2 of block upon
/export/home/build/data/continuum/checkouts/3/target/test/unit/java-grammar-inheritance-test/target/generated-sources/antlr/expandedGnuCParser.g:1245:9:     k==1:'1'
/export/home/build/data/continuum/checkouts/3/target/test/unit/java-grammar-inheritance-test/target/generated-sources/antlr/expandedGnuCParser.g:1245:9:     k==2:'\u0000'..'\u00ff'
/export/home/build/data/continuum/checkouts/3/target/test/unit/java-grammar-inheritance-test/target/generated-sources/antlr/expandedGnuCParser.g:1245:9:     k==3:<end-of-token>,'\u0000'..'\u00ff'
/export/home/build/data/continuum/checkouts/3/target/test/unit/java-grammar-inheritance-test/target/generated-sources/antlr/expandedGnuCParser.g:1246: warning:lexical nondeterminism upon
/export/home/build/data/continuum/checkouts/3/target/test/unit/java-grammar-inheritance-test/target/generated-sources/antlr/expandedGnuCParser.g:1246:     k==1:'\t','\u000c',' '
/export/home/build/data/continuum/checkouts/3/target/test/unit/java-grammar-inheritance-test/target/generated-sources/antlr/expandedGnuCParser.g:1246:     k==2:'\u0000'..'\u00ff'
/export/home/build/data/continuum/checkouts/3/target/test/unit/java-grammar-inheritance-test/target/generated-sources/antlr/expandedGnuCParser.g:1246:     k==3:<end-of-token>,'\u0000'..'\u00ff'
/export/home/build/data/continuum/checkouts/3/target/test/unit/java-grammar-inheritance-test/target/generated-sources/antlr/expandedGnuCParser.g:1246:     between alt 1 and exit branch of block
/export/home/build/data/continuum/checkouts/3/target/test/unit/java-grammar-inheritance-test/target/generated-sources/antlr/expandedGnuCParser.g:1247:9: warning:lexical nondeterminism between alts 1 and 2 of block upon
/export/home/build/data/continuum/checkouts/3/target/test/unit/java-grammar-inheritance-test/target/generated-sources/antlr/expandedGnuCParser.g:1247:9:     k==1:'2'
/export/home/build/data/continuum/checkouts/3/target/test/unit/java-grammar-inheritance-test/target/generated-sources/antlr/expandedGnuCParser.g:1247:9:     k==2:'\u0000'..'\u00ff'
/export/home/build/data/continuum/checkouts/3/target/test/unit/java-grammar-inheritance-test/target/generated-sources/antlr/expandedGnuCParser.g:1247:9:     k==3:<end-of-token>,'\u0000'..'\u00ff'
/export/home/build/data/continuum/checkouts/3/target/test/unit/java-grammar-inheritance-test/target/generated-sources/antlr/expandedGnuCParser.g:1248: warning:lexical nondeterminism upon
/export/home/build/data/continuum/checkouts/3/target/test/unit/java-grammar-inheritance-test/target/generated-sources/antlr/expandedGnuCParser.g:1248:     k==1:'\t','\u000c',' '
/export/home/build/data/continuum/checkouts/3/target/test/unit/java-grammar-inheritance-test/target/generated-sources/antlr/expandedGnuCParser.g:1248:     k==2:'\u0000'..'\u00ff'
/export/home/build/data/continuum/checkouts/3/target/test/unit/java-grammar-inheritance-test/target/generated-sources/antlr/expandedGnuCParser.g:1248:     k==3:<end-of-token>,'\u0000'..'\u00ff'
/export/home/build/data/continuum/checkouts/3/target/test/unit/java-grammar-inheritance-test/target/generated-sources/antlr/expandedGnuCParser.g:1248:     between alt 1 and exit branch of block
/export/home/build/data/continuum/checkouts/3/target/test/unit/java-grammar-inheritance-test/target/generated-sources/antlr/expandedGnuCParser.g:1249:9: warning:lexical nondeterminism between alts 1 and 2 of block upon
/export/home/build/data/continuum/checkouts/3/target/test/unit/java-grammar-inheritance-test/target/generated-sources/antlr/expandedGnuCParser.g:1249:9:     k==1:'3'
/export/home/build/data/continuum/checkouts/3/target/test/unit/java-grammar-inheritance-test/target/generated-sources/antlr/expandedGnuCParser.g:1249:9:     k==2:'\u0000'..'\u00ff'
/export/home/build/data/continuum/checkouts/3/target/test/unit/java-grammar-inheritance-test/target/generated-sources/antlr/expandedGnuCParser.g:1249:9:     k==3:<end-of-token>,'\u0000'..'\u00ff'
/export/home/build/data/continuum/checkouts/3/target/test/unit/java-grammar-inheritance-test/target/generated-sources/antlr/expandedGnuCParser.g:1250: warning:lexical nondeterminism upon
/export/home/build/data/continuum/checkouts/3/target/test/unit/java-grammar-inheritance-test/target/generated-sources/antlr/expandedGnuCParser.g:1250:     k==1:'\t','\u000c',' '
/export/home/build/data/continuum/checkouts/3/target/test/unit/java-grammar-inheritance-test/target/generated-sources/antlr/expandedGnuCParser.g:1250:     k==2:'\u0000'..'\u00ff'
/export/home/build/data/continuum/checkouts/3/target/test/unit/java-grammar-inheritance-test/target/generated-sources/antlr/expandedGnuCParser.g:1250:     k==3:<end-of-token>,'\u0000'..'\u00ff'
/export/home/build/data/continuum/checkouts/3/target/test/unit/java-grammar-inheritance-test/target/generated-sources/antlr/expandedGnuCParser.g:1250:     between alt 1 and exit branch of block
/export/home/build/data/continuum/checkouts/3/target/test/unit/java-grammar-inheritance-test/target/generated-sources/antlr/expandedGnuCParser.g:1251:9: warning:lexical nondeterminism between alts 1 and 2 of block upon
/export/home/build/data/continuum/checkouts/3/target/test/unit/java-grammar-inheritance-test/target/generated-sources/antlr/expandedGnuCParser.g:1251:9:     k==1:'4'
/export/home/build/data/continuum/checkouts/3/target/test/unit/java-grammar-inheritance-test/target/generated-sources/antlr/expandedGnuCParser.g:1251:9:     k==2:'\u0000'..'\u00ff'
/export/home/build/data/continuum/checkouts/3/target/test/unit/java-grammar-inheritance-test/target/generated-sources/antlr/expandedGnuCParser.g:1251:9:     k==3:<end-of-token>,'\u0000'..'\u00ff'
/export/home/build/data/continuum/checkouts/3/target/test/unit/java-grammar-inheritance-test/target/generated-sources/antlr/expandedGnuCParser.g:129: warning:nondeterminism upon
/export/home/build/data/continuum/checkouts/3/target/test/unit/java-grammar-inheritance-test/target/generated-sources/antlr/expandedGnuCParser.g:129:     k==1:SEMI
/export/home/build/data/continuum/checkouts/3/target/test/unit/java-grammar-inheritance-test/target/generated-sources/antlr/expandedGnuCParser.g:129:     k==2:EOF,"typedef","asm","volatile",SEMI,"struct","union","enum","auto","register","extern","static","const","void","char","short","int","long","float","double","signed","unsigned",ID,STAR,LPAREN,"inline","typeof","__complex"
/export/home/build/data/continuum/checkouts/3/target/test/unit/java-grammar-inheritance-test/target/generated-sources/antlr/expandedGnuCParser.g:129:     between alt 1 and exit branch of block
/export/home/build/data/continuum/checkouts/3/target/test/unit/java-grammar-inheritance-test/target/generated-sources/antlr/expandedGnuCParser.g:242: warning:nondeterminism upon
/export/home/build/data/continuum/checkouts/3/target/test/unit/java-grammar-inheritance-test/target/generated-sources/antlr/expandedGnuCParser.g:242:     k==1:SEMI
/export/home/build/data/continuum/checkouts/3/target/test/unit/java-grammar-inheritance-test/target/generated-sources/antlr/expandedGnuCParser.g:242:     k==2:EOF,"typedef","asm","volatile",LCURLY,RCURLY,SEMI,"struct","union","enum","auto","register","extern","static","const","void","char","short","int","long","float","double","signed","unsigned",ID,STAR,LPAREN,VARARGS,"while","do","for","goto","continue","break","return","case","default","if","switch",LAND,BAND,PLUS,MINUS,INC,DEC,"sizeof",BNOT,LNOT,CharLiteral,StringLiteral,Number,"__label__","inline","typeof","__complex","__alignof","__real","__imag"
/export/home/build/data/continuum/checkouts/3/target/test/unit/java-grammar-inheritance-test/target/generated-sources/antlr/expandedGnuCParser.g:242:     between alt 1 and exit branch of block
/export/home/build/data/continuum/checkouts/3/target/test/unit/java-grammar-inheritance-test/target/generated-sources/antlr/expandedGnuCParser.g:644: warning:nondeterminism between alts 1 and 4 of block upon
/export/home/build/data/continuum/checkouts/3/target/test/unit/java-grammar-inheritance-test/target/generated-sources/antlr/expandedGnuCParser.g:644:     k==1:"struct"
/export/home/build/data/continuum/checkouts/3/target/test/unit/java-grammar-inheritance-test/target/generated-sources/antlr/expandedGnuCParser.g:644:     k==2:
/export/home/build/data/continuum/checkouts/3/target/test/unit/java-grammar-inheritance-test/target/generated-sources/antlr/expandedGnuCParser.g:644: warning:nondeterminism between alts 2 and 4 of block upon
/export/home/build/data/continuum/checkouts/3/target/test/unit/java-grammar-inheritance-test/target/generated-sources/antlr/expandedGnuCParser.g:644:     k==1:"union"
/export/home/build/data/continuum/checkouts/3/target/test/unit/java-grammar-inheritance-test/target/generated-sources/antlr/expandedGnuCParser.g:644:     k==2:
/export/home/build/data/continuum/checkouts/3/target/test/unit/java-grammar-inheritance-test/target/generated-sources/antlr/expandedGnuCParser.g:644: warning:nondeterminism between alts 3 and 4 of block upon
/export/home/build/data/continuum/checkouts/3/target/test/unit/java-grammar-inheritance-test/target/generated-sources/antlr/expandedGnuCParser.g:644:     k==1:"enum"
/export/home/build/data/continuum/checkouts/3/target/test/unit/java-grammar-inheritance-test/target/generated-sources/antlr/expandedGnuCParser.g:644:     k==2:
/export/home/build/data/continuum/checkouts/3/target/test/unit/java-grammar-inheritance-test/target/generated-sources/antlr/expandedGnuCParser.g:155:14: warning:nondeterminism between alts 1 and 2 of block upon
/export/home/build/data/continuum/checkouts/3/target/test/unit/java-grammar-inheritance-test/target/generated-sources/antlr/expandedGnuCParser.g:155:14:     k==1:LCURLY
/export/home/build/data/continuum/checkouts/3/target/test/unit/java-grammar-inheritance-test/target/generated-sources/antlr/expandedGnuCParser.g:155:14:     k==2:"asm",LCURLY,RCURLY,ID,STAR,LPAREN,LBRACKET,LAND,BAND,PLUS,MINUS,INC,DEC,"sizeof",BNOT,LNOT,DOT,CharLiteral,StringLiteral,Number,"__alignof","__real","__imag"
/export/home/build/data/continuum/checkouts/3/target/test/unit/java-grammar-inheritance-test/target/generated-sources/antlr/expandedGnuCParser.g:542: warning:nondeterminism between alts 1 and 4 of block upon
/export/home/build/data/continuum/checkouts/3/target/test/unit/java-grammar-inheritance-test/target/generated-sources/antlr/expandedGnuCParser.g:542:     k==1:"struct"
/export/home/build/data/continuum/checkouts/3/target/test/unit/java-grammar-inheritance-test/target/generated-sources/antlr/expandedGnuCParser.g:542:     k==2:
/export/home/build/data/continuum/checkouts/3/target/test/unit/java-grammar-inheritance-test/target/generated-sources/antlr/expandedGnuCParser.g:542: warning:nondeterminism between alts 2 and 4 of block upon
/export/home/build/data/continuum/checkouts/3/target/test/unit/java-grammar-inheritance-test/target/generated-sources/antlr/expandedGnuCParser.g:542:     k==1:"union"
/export/home/build/data/continuum/checkouts/3/target/test/unit/java-grammar-inheritance-test/target/generated-sources/antlr/expandedGnuCParser.g:542:     k==2:
/export/home/build/data/continuum/checkouts/3/target/test/unit/java-grammar-inheritance-test/target/generated-sources/antlr/expandedGnuCParser.g:542: warning:nondeterminism between alts 3 and 4 of block upon
/export/home/build/data/continuum/checkouts/3/target/test/unit/java-grammar-inheritance-test/target/generated-sources/antlr/expandedGnuCParser.g:542:     k==1:"enum"
/export/home/build/data/continuum/checkouts/3/target/test/unit/java-grammar-inheritance-test/target/generated-sources/antlr/expandedGnuCParser.g:542:     k==2:
/export/home/build/data/continuum/checkouts/3/target/test/unit/java-grammar-inheritance-test/target/generated-sources/antlr/expandedGnuCParser.g:217:17: warning:nondeterminism between alts 1 and 2 of block upon
/export/home/build/data/continuum/checkouts/3/target/test/unit/java-grammar-inheritance-test/target/generated-sources/antlr/expandedGnuCParser.g:217:17:     k==1:COMMA
/export/home/build/data/continuum/checkouts/3/target/test/unit/java-grammar-inheritance-test/target/generated-sources/antlr/expandedGnuCParser.g:217:17:     k==2:VARARGS
/export/home/build/data/continuum/checkouts/3/target/test/unit/java-grammar-inheritance-test/target/generated-sources/antlr/expandedGnuCParser.g:233: warning:nondeterminism upon
/export/home/build/data/continuum/checkouts/3/target/test/unit/java-grammar-inheritance-test/target/generated-sources/antlr/expandedGnuCParser.g:233:     k==1:SEMI
/export/home/build/data/continuum/checkouts/3/target/test/unit/java-grammar-inheritance-test/target/generated-sources/antlr/expandedGnuCParser.g:233:     k==2:"typedef","asm","volatile",LCURLY,RCURLY,SEMI,"struct","union","enum","auto","register","extern","static","const","void","char","short","int","long","float","double","signed","unsigned",ID,STAR,LPAREN,"while","do","for","goto","continue","break","return","case","default","if","switch",LAND,BAND,PLUS,MINUS,INC,DEC,"sizeof",BNOT,LNOT,CharLiteral,StringLiteral,Number,"__label__","inline","typeof","__complex","__alignof","__real","__imag"
/export/home/build/data/continuum/checkouts/3/target/test/unit/java-grammar-inheritance-test/target/generated-sources/antlr/expandedGnuCParser.g:233:     between alt 1 and exit branch of block
/export/home/build/data/continuum/checkouts/3/target/test/unit/java-grammar-inheritance-test/target/generated-sources/antlr/expandedGnuCParser.g:579: warning:nondeterminism between alts 1 and 4 of block upon
/export/home/build/data/continuum/checkouts/3/target/test/unit/java-grammar-inheritance-test/target/generated-sources/antlr/expandedGnuCParser.g:579:     k==1:"struct"
/export/home/build/data/continuum/checkouts/3/target/test/unit/java-grammar-inheritance-test/target/generated-sources/antlr/expandedGnuCParser.g:579:     k==2:
/export/home/build/data/continuum/checkouts/3/target/test/unit/java-grammar-inheritance-test/target/generated-sources/antlr/expandedGnuCParser.g:579: warning:nondeterminism between alts 2 and 4 of block upon
/export/home/build/data/continuum/checkouts/3/target/test/unit/java-grammar-inheritance-test/target/generated-sources/antlr/expandedGnuCParser.g:579:     k==1:"union"
/export/home/build/data/continuum/checkouts/3/target/test/unit/java-grammar-inheritance-test/target/generated-sources/antlr/expandedGnuCParser.g:579:     k==2:
/export/home/build/data/continuum/checkouts/3/target/test/unit/java-grammar-inheritance-test/target/generated-sources/antlr/expandedGnuCParser.g:579: warning:nondeterminism between alts 3 and 4 of block upon
/export/home/build/data/continuum/checkouts/3/target/test/unit/java-grammar-inheritance-test/target/generated-sources/antlr/expandedGnuCParser.g:579:     k==1:"enum"
/export/home/build/data/continuum/checkouts/3/target/test/unit/java-grammar-inheritance-test/target/generated-sources/antlr/expandedGnuCParser.g:579:     k==2:
/export/home/build/data/continuum/checkouts/3/target/test/unit/java-grammar-inheritance-test/target/generated-sources/antlr/expandedGnuCParser.g:307:21: warning:Rule 'declarator' returns a value

[INFO] Using Antlr grammar: /export/home/build/data/continuum/checkouts/3/src/test/resources/unit/java-grammar-inheritance-test/src/main/antlr/GnuCEmitter.g
ANTLR Parser Generator   Version 2.7.7 (20060906)   1989-2005

Tests run: 2, Failures: 0, Errors: 0, Skipped: 0, Time elapsed: 4.971 sec

Results :

Tests run: 2, Failures: 0, Errors: 0, Skipped: 0

ANTLR Parser Generator   Version 2.7.7 (20060906)   1989-2005

[INFO] [jar:jar]
[INFO] Building jar: /export/home/build/data/continuum/checkouts/3/target/maven-antlr-plugin-2.0-SNAPSHOT.jar
[INFO] [plugin:addPluginArtifactMetadata]
[INFO] [install:install-file {execution: it-test}]
[INFO] Layout: class org.apache.maven.artifact.repository.layout.DefaultRepositoryLayout
[INFO] Installing /export/home/build/data/continuum/checkouts/3/target/maven-antlr-plugin-2.0-SNAPSHOT.jar to /export/home/build/data/continuum/checkouts/3/target/local-repo/org/apache/maven/plugins/maven-antlr-plugin/2.0-SNAPSHOT/maven-antlr-plugin-2.0-SNAPSHOT.jar
[INFO] Creating Checksums...
[INFO] Installing /export/home/build/data/continuum/checkouts/3/pom.xml to /export/home/build/data/continuum/checkouts/3/target/local-repo/org/apache/maven/plugins/maven-antlr-plugin/2.0-SNAPSHOT/maven-antlr-plugin-2.0-SNAPSHOT.pom
[INFO] Creating Checksums...
[INFO] [invoker:run {execution: integration-test}]
[INFO] Building: java-grammar-report-test/pom.xml
[INFO] ...SUCCESS.
[INFO] 

---------------------------------------
Execution Summary:
Builds Passing: 1
Builds Failing: 0
---------------------------------------

[INFO] [install:install]
[INFO] Installing /export/home/build/data/continuum/checkouts/3/target/maven-antlr-plugin-2.0-SNAPSHOT.jar to /export/home/build/.m2/repository/org/apache/maven/plugins/maven-antlr-plugin/2.0-SNAPSHOT/maven-antlr-plugin-2.0-SNAPSHOT.jar
[INFO] [plugin:updateRegistry]
[INFO] ------------------------------------------------------------------------
[INFO] BUILD SUCCESSFUL
[INFO] ------------------------------------------------------------------------
[INFO] Total time: 1 minute 15 seconds
[INFO] Finished at: Sat Jul 14 15:07:10 GMT 2007
[INFO] Final Memory: 19M/330M
[INFO] ------------------------------------------------------------------------

****************************************************************************



Mime
View raw message