maven-notifications mailing list archives

Site index · List index
Message view « Date » · « Thread »
Top « Date » · « Thread »
From "Continuum@maven.zones.apache.org" <contin...@maven.zones.apache.org>
Subject [continuum] BUILD FAILURE: Archiva Base :: Proxy
Date Tue, 24 Jul 2007 09:15:59 GMT
Online report : http://maven.zones.apache.org/continuum/buildResult.action?buildId=12510&projectId=282
Build statistics:
  State: Failed
  Previous State: Ok
  Started at: Tue 24 Jul 2007 09:15:06 +0000
  Finished at: Tue 24 Jul 2007 09:15:50 +0000
  Total time: 43s
  Build Trigger: Schedule
  Build Number: 33
  Exit code: 1
  Building machine hostname: maven.zones.apache.org
  Operating system : SunOS(unknown)
  Java version : 1.5.0_12(Sun Microsystems Inc.)

****************************************************************************
SCM Changes:
****************************************************************************
No files changed

****************************************************************************
SCM Changes since last success:
****************************************************************************
****************************************************************************
Dependencies Changes:
****************************************************************************
org.apache.maven.archiva:archiva-configuration:1.0-alpha-3-SNAPSHOT

org.apache.maven.archiva:archiva-repository-layer:1.0-alpha-3-SNAPSHOT

org.apache.maven.archiva:archiva-base:1.0-alpha-3-SNAPSHOT

****************************************************************************
Test Summary:
****************************************************************************
Tests: 112
Failures: 1
Total time: 16490

****************************************************************************
Output:
****************************************************************************
[INFO] Scanning for projects...
[INFO] ----------------------------------------------------------------------------
[INFO] Building Archiva Base :: Proxy
[INFO]    task-segment: [clean, install]
[INFO] ----------------------------------------------------------------------------
[INFO] [clean:clean]
[INFO] Deleting directory /export/home/build/data/continuum/checkouts/282/target
[INFO] [plexus:descriptor {execution: generate}]
[INFO] Setting property: classpath.resource.loader.class => 'org.codehaus.plexus.velocity.ContextClassLoaderResourceLoader'.
[INFO] Setting property: velocimacro.messages.on => 'false'.
[INFO] Setting property: resource.loader => 'classpath'.
[INFO] Setting property: resource.manager.logwhenfound => 'false'.
[INFO] [remote-resources:process {execution: default}]
[INFO] [resources:resources]
[INFO] Using default encoding to copy filtered resources.
[INFO] Resource directory does not exist: /export/home/build/data/continuum/checkouts/282/src/main/resources
[INFO] Copying 1 resource
[INFO] Copying 2 resources
[INFO] [compiler:compile]
[INFO] Compiling 4 source files to /export/home/build/data/continuum/checkouts/282/target/classes
[INFO] [resources:testResources]
[INFO] Using default encoding to copy filtered resources.
[INFO] Copying 8 resources
[INFO] Copying 2 resources
[INFO] [compiler:testCompile]
[INFO] Compiling 11 source files to /export/home/build/data/continuum/checkouts/282/target/test-classes
[INFO] [surefire:test]
[INFO] Surefire report directory: /export/home/build/data/continuum/checkouts/282/target/surefire-reports

-------------------------------------------------------
 T E S T S
-------------------------------------------------------
Running org.apache.maven.archiva.proxy.ManagedLegacyTransferTest
DEBUG|main|    0|Registry:commons-configuration - Creating a default configuration - no configuration was provided
DEBUG|main|  542|Registry:commons-configuration - Creating a default configuration - no configuration was provided
DEBUG|main| 1135|CacheManager                   - Creating new CacheManager with default config
DEBUG|main| 1136|CacheManager                   - Configuring ehcache from classpath.
 WARN|main| 1142|ConfigurationFactory           - No configuration found. Configuring ehcache from ehcache-failsafe.xml  found in the classpath: jar:file:/export/home/build/.m2/repository/net/sf/ehcache/ehcache/1.2.4/ehcache-1.2.4.jar!/ehcache-failsafe.xml
DEBUG|main| 1143|ConfigurationFactory           - Configuring ehcache from URL: jar:file:/export/home/build/.m2/repository/net/sf/ehcache/ehcache/1.2.4/ehcache-1.2.4.jar!/ehcache-failsafe.xml
DEBUG|main| 1172|ConfigurationFactory           - Configuring ehcache from InputStream
DEBUG|main| 1280|DiskStoreConfiguration         - Disk Store Path: /var/tmp/
DEBUG|main| 1404|ConfigurationHelper            - No CacheManagerEventListenerFactory class specified. Skipping...
DEBUG|main| 1405|ConfigurationHelper            - No CachePeerListenerFactoryConfiguration specified. Not configuring a CacheManagerPeerListener.
DEBUG|main| 1405|ConfigurationHelper            - No CachePeerProviderFactoryConfiguration specified. Not configuring a CacheManagerPeerProvider.
DEBUG|main| 2186|ConfigurationHelper            - No BootstrapCacheLoaderFactory class specified. Skipping...
DEBUG|main| 2195|MemoryStore                    - Initialized net.sf.ehcache.store.LruMemoryStore for cache
DEBUG|main| 2197|LruMemoryStore                 - cache Cache: Using SpoolingLinkedHashMap implementation
DEBUG|main| 2197|Cache                          - Initialised cache: cache

.\ testLegacyManagedRepoGetNotPresent() \._________________________________________

DEBUG|main| 2276|RepositoryProxyConnectors:default - Attempting connector: ProxyConnector[
  source:ArchivaRepository[legacy-managed-repository,file:/export/home/build/data/continuum/checkouts/282/target/test-repository/legacy-managed/]
  target:ArchivaRepository[proxied1,file:/export/home/build/data/continuum/checkouts/282/src/test/repositories/proxied1/]
  proxyId:null
  policy[releases]:ignored
  policy[snapshots]:ignored
  policy[cache-failures]:ignored
  policy[checksum]:fix
]
DEBUG|main| 2276|RepositoryProxyConnectors:default - Using target repository: proxied1 - layout: default - targetPath: org/apache/maven/test/get-default-layout/1.0/get-default-layout-1.0.jar
DEBUG|main| 2276|RepositoryProxyConnectors:default - Applying [releases] policy with [ignored]
DEBUG|main| 2277|PreDownloadPolicy:releases     - OK to update, releases policy set to IGNORED.
DEBUG|main| 2277|RepositoryProxyConnectors:default - Applying [snapshots] policy with [ignored]
DEBUG|main| 2277|PreDownloadPolicy:snapshots    - OK to update, snapshots policy set to IGNORED.
DEBUG|main| 2277|RepositoryProxyConnectors:default - Applying [cache-failures] policy with [ignored]
DEBUG|main| 2277|PreDownloadPolicy:cache-failures - OK to fetch, check-failures policy set to IGNORED.
DEBUG|main| 2282|RepositoryProxyConnectors:default - Retrieving org/apache/maven/test/get-default-layout/1.0/get-default-layout-1.0.jar from Proxied Repository 1 if updated
DEBUG|main| 2299|RepositoryProxyConnectors:default - Downloaded successfully.
DEBUG|main| 2300|RepositoryProxyConnectors:default - Retrieving org/apache/maven/test/get-default-layout/1.0/get-default-layout-1.0.jar.sha1 from Proxied Repository 1 if updated
 WARN|main| 2300|RepositoryProxyConnectors:default - Resource does not exist: File: /export/home/build/data/continuum/checkouts/282/src/test/repositories/proxied1/org/apache/maven/test/get-default-layout/1.0/get-default-layout-1.0.jar.sha1 does not exist
DEBUG|main| 2301|RepositoryProxyConnectors:default - Checksum.sha1 Not Download: File: /export/home/build/data/continuum/checkouts/282/src/test/repositories/proxied1/org/apache/maven/test/get-default-layout/1.0/get-default-layout-1.0.jar.sha1 does not exist
DEBUG|main| 2301|RepositoryProxyConnectors:default - Retrieving org/apache/maven/test/get-default-layout/1.0/get-default-layout-1.0.jar.md5 from Proxied Repository 1 if updated
 WARN|main| 2302|RepositoryProxyConnectors:default - Resource does not exist: File: /export/home/build/data/continuum/checkouts/282/src/test/repositories/proxied1/org/apache/maven/test/get-default-layout/1.0/get-default-layout-1.0.jar.md5 does not exist
DEBUG|main| 2302|RepositoryProxyConnectors:default - Checksum.md5 Not Download: File: /export/home/build/data/continuum/checkouts/282/src/test/repositories/proxied1/org/apache/maven/test/get-default-layout/1.0/get-default-layout-1.0.jar.md5 does not exist
DEBUG|main| 2302|RepositoryProxyConnectors:default - Applying [checksum] policy with [fix]
 INFO|main| 2313|RepositoryProxyConnectors:default - Successfully transfered: /export/home/build/data/continuum/checkouts/282/target/test-repository/legacy-managed/org.apache.maven.test/jars/get-default-layout-1.0.jar
 INFO|main| 2367|Cache:url-failures-cache       - Disposing cache: [  name = cache status = STATUS_ALIVE eternal = false overflowToDisk = false maxElementsInMemory = 1000 maxElementsOnDisk = 0 memoryStoreEvictionPolicy = LRU timeToLiveSeconds = 1800 timeToIdleSeconds = 2700 diskPersistent = true diskExpiryThreadIntervalSeconds = 600 cacheEventListeners:  hitCount = 0 memoryStoreHitCount = 0 diskStoreHitCount = 0 missCountNotFound = 0 missCountExpired = 0 ]
DEBUG|main| 2579|Registry:commons-configuration - Creating a default configuration - no configuration was provided
DEBUG|main| 2784|Registry:commons-configuration - Creating a default configuration - no configuration was provided
DEBUG|main| 2959|CacheManager                   - Attempting to create an existing singleton. Existing singleton returned.
DEBUG|main| 2960|MemoryStore                    - Initialized net.sf.ehcache.store.LruMemoryStore for cache
DEBUG|main| 2960|LruMemoryStore                 - cache Cache: Using SpoolingLinkedHashMap implementation
DEBUG|main| 2960|Cache                          - Initialised cache: cache

.\ testLegacyManagedRepoGetAlreadyPresent() \._________________________________________

DEBUG|main| 3023|RepositoryProxyConnectors:default - Attempting connector: ProxyConnector[
  source:ArchivaRepository[legacy-managed-repository,file:/export/home/build/data/continuum/checkouts/282/target/test-repository/legacy-managed/]
  target:ArchivaRepository[proxied1,file:/export/home/build/data/continuum/checkouts/282/src/test/repositories/proxied1/]
  proxyId:null
  policy[releases]:ignored
  policy[snapshots]:ignored
  policy[cache-failures]:ignored
  policy[checksum]:fix
]
DEBUG|main| 3025|RepositoryProxyConnectors:default - Using target repository: proxied1 - layout: default - targetPath: org/apache/maven/test/get-default-layout-present/1.0/get-default-layout-present-1.0.jar
DEBUG|main| 3026|RepositoryProxyConnectors:default - Applying [releases] policy with [ignored]
DEBUG|main| 3026|PreDownloadPolicy:releases     - OK to update, releases policy set to IGNORED.
DEBUG|main| 3026|RepositoryProxyConnectors:default - Applying [snapshots] policy with [ignored]
DEBUG|main| 3027|PreDownloadPolicy:snapshots    - OK to update, snapshots policy set to IGNORED.
DEBUG|main| 3027|RepositoryProxyConnectors:default - Applying [cache-failures] policy with [ignored]
DEBUG|main| 3027|PreDownloadPolicy:cache-failures - OK to fetch, check-failures policy set to IGNORED.
DEBUG|main| 3027|RepositoryProxyConnectors:default - Retrieving org/apache/maven/test/get-default-layout-present/1.0/get-default-layout-present-1.0.jar from Proxied Repository 1
DEBUG|main| 3049|RepositoryProxyConnectors:default - Downloaded successfully.
DEBUG|main| 3049|RepositoryProxyConnectors:default - Retrieving org/apache/maven/test/get-default-layout-present/1.0/get-default-layout-present-1.0.jar.sha1 from Proxied Repository 1 if updated
 WARN|main| 3050|RepositoryProxyConnectors:default - Resource does not exist: File: /export/home/build/data/continuum/checkouts/282/src/test/repositories/proxied1/org/apache/maven/test/get-default-layout-present/1.0/get-default-layout-present-1.0.jar.sha1 does not exist
DEBUG|main| 3050|RepositoryProxyConnectors:default - Checksum.sha1 Not Download: File: /export/home/build/data/continuum/checkouts/282/src/test/repositories/proxied1/org/apache/maven/test/get-default-layout-present/1.0/get-default-layout-present-1.0.jar.sha1 does not exist
DEBUG|main| 3050|RepositoryProxyConnectors:default - Retrieving org/apache/maven/test/get-default-layout-present/1.0/get-default-layout-present-1.0.jar.md5 from Proxied Repository 1
 WARN|main| 3051|RepositoryProxyConnectors:default - Resource does not exist: File: /export/home/build/data/continuum/checkouts/282/src/test/repositories/proxied1/org/apache/maven/test/get-default-layout-present/1.0/get-default-layout-present-1.0.jar.md5 does not exist
DEBUG|main| 3051|RepositoryProxyConnectors:default - Checksum.md5 Not Download: File: /export/home/build/data/continuum/checkouts/282/src/test/repositories/proxied1/org/apache/maven/test/get-default-layout-present/1.0/get-default-layout-present-1.0.jar.md5 does not exist
DEBUG|main| 3051|RepositoryProxyConnectors:default - Applying [checksum] policy with [fix]
DEBUG|main| 3086|PostDownloadPolicy:checksum    - Not valid checksum: /export/home/build/data/continuum/checkouts/282/target/test-repository/legacy-managed/org.apache.maven.test/jars/get-default-layout-present-1.0.jar.md5
 INFO|main| 3087|RepositoryProxyConnectors:default - Successfully transfered: /export/home/build/data/continuum/checkouts/282/target/test-repository/legacy-managed/org.apache.maven.test/jars/get-default-layout-present-1.0.jar
 INFO|main| 3090|Cache:url-failures-cache       - Disposing cache: [  name = cache status = STATUS_ALIVE eternal = false overflowToDisk = false maxElementsInMemory = 1000 maxElementsOnDisk = 0 memoryStoreEvictionPolicy = LRU timeToLiveSeconds = 1800 timeToIdleSeconds = 2700 diskPersistent = true diskExpiryThreadIntervalSeconds = 600 cacheEventListeners:  hitCount = 0 memoryStoreHitCount = 0 diskStoreHitCount = 0 missCountNotFound = 0 missCountExpired = 0 ]
DEBUG|main| 3156|Registry:commons-configuration - Creating a default configuration - no configuration was provided
DEBUG|main| 3197|Registry:commons-configuration - Creating a default configuration - no configuration was provided
DEBUG|main| 3224|CacheManager                   - Attempting to create an existing singleton. Existing singleton returned.
DEBUG|main| 3225|MemoryStore                    - Initialized net.sf.ehcache.store.LruMemoryStore for cache
DEBUG|main| 3225|LruMemoryStore                 - cache Cache: Using SpoolingLinkedHashMap implementation
DEBUG|main| 3225|Cache                          - Initialised cache: cache

.\ testLegacyManagedAndProxyRepoGetNotPresent() \._________________________________________

DEBUG|main| 3230|RepositoryProxyConnectors:default - Attempting connector: ProxyConnector[
  source:ArchivaRepository[legacy-managed-repository,file:/export/home/build/data/continuum/checkouts/282/target/test-repository/legacy-managed/]
  target:ArchivaRepository[legacy-proxied,file:/export/home/build/data/continuum/checkouts/282/src/test/repositories/legacy-proxied/]
  proxyId:null
  policy[releases]:ignored
  policy[snapshots]:ignored
  policy[cache-failures]:ignored
  policy[checksum]:ignored
]
DEBUG|main| 3231|RepositoryProxyConnectors:default - Using target repository: legacy-proxied - layout: legacy - targetPath: org.apache.maven.test/jars/get-default-layout-1.0.jar
DEBUG|main| 3231|RepositoryProxyConnectors:default - Applying [releases] policy with [ignored]
DEBUG|main| 3231|PreDownloadPolicy:releases     - OK to update, releases policy set to IGNORED.
DEBUG|main| 3231|RepositoryProxyConnectors:default - Applying [snapshots] policy with [ignored]
DEBUG|main| 3231|PreDownloadPolicy:snapshots    - OK to update, snapshots policy set to IGNORED.
DEBUG|main| 3231|RepositoryProxyConnectors:default - Applying [cache-failures] policy with [ignored]
DEBUG|main| 3231|PreDownloadPolicy:cache-failures - OK to fetch, check-failures policy set to IGNORED.
DEBUG|main| 3232|RepositoryProxyConnectors:default - Retrieving org.apache.maven.test/jars/get-default-layout-1.0.jar from Proxied Legacy Repository if updated
DEBUG|main| 3233|RepositoryProxyConnectors:default - Downloaded successfully.
DEBUG|main| 3241|RepositoryProxyConnectors:default - Retrieving org.apache.maven.test/jars/get-default-layout-1.0.jar.sha1 from Proxied Legacy Repository if updated
 WARN|main| 3242|RepositoryProxyConnectors:default - Resource does not exist: File: /export/home/build/data/continuum/checkouts/282/src/test/repositories/legacy-proxied/org.apache.maven.test/jars/get-default-layout-1.0.jar.sha1 does not exist
DEBUG|main| 3242|RepositoryProxyConnectors:default - Checksum.sha1 Not Download: File: /export/home/build/data/continuum/checkouts/282/src/test/repositories/legacy-proxied/org.apache.maven.test/jars/get-default-layout-1.0.jar.sha1 does not exist
DEBUG|main| 3242|RepositoryProxyConnectors:default - Retrieving org.apache.maven.test/jars/get-default-layout-1.0.jar.md5 from Proxied Legacy Repository if updated
 WARN|main| 3242|RepositoryProxyConnectors:default - Resource does not exist: File: /export/home/build/data/continuum/checkouts/282/src/test/repositories/legacy-proxied/org.apache.maven.test/jars/get-default-layout-1.0.jar.md5 does not exist
DEBUG|main| 3242|RepositoryProxyConnectors:default - Checksum.md5 Not Download: File: /export/home/build/data/continuum/checkouts/282/src/test/repositories/legacy-proxied/org.apache.maven.test/jars/get-default-layout-1.0.jar.md5 does not exist
DEBUG|main| 3243|RepositoryProxyConnectors:default - Applying [checksum] policy with [ignored]
 INFO|main| 3243|RepositoryProxyConnectors:default - Successfully transfered: /export/home/build/data/continuum/checkouts/282/target/test-repository/legacy-managed/org.apache.maven.test/jars/get-default-layout-1.0.jar
 INFO|main| 3244|Cache:url-failures-cache       - Disposing cache: [  name = cache status = STATUS_ALIVE eternal = false overflowToDisk = false maxElementsInMemory = 1000 maxElementsOnDisk = 0 memoryStoreEvictionPolicy = LRU timeToLiveSeconds = 1800 timeToIdleSeconds = 2700 diskPersistent = true diskExpiryThreadIntervalSeconds = 600 cacheEventListeners:  hitCount = 0 memoryStoreHitCount = 0 diskStoreHitCount = 0 missCountNotFound = 0 missCountExpired = 0 ]
DEBUG|main| 3341|Registry:commons-configuration - Creating a default configuration - no configuration was provided
DEBUG|main| 3413|Registry:commons-configuration - Creating a default configuration - no configuration was provided
DEBUG|main| 3462|CacheManager                   - Attempting to create an existing singleton. Existing singleton returned.
DEBUG|main| 3462|MemoryStore                    - Initialized net.sf.ehcache.store.LruMemoryStore for cache
DEBUG|main| 3463|LruMemoryStore                 - cache Cache: Using SpoolingLinkedHashMap implementation
DEBUG|main| 3463|Cache                          - Initialised cache: cache

.\ testLegacyManagedAndProxyRepoGetAlreadyPresent() \._________________________________________

DEBUG|main| 3480|RepositoryProxyConnectors:default - Attempting connector: ProxyConnector[
  source:ArchivaRepository[legacy-managed-repository,file:/export/home/build/data/continuum/checkouts/282/target/test-repository/legacy-managed/]
  target:ArchivaRepository[legacy-proxied,file:/export/home/build/data/continuum/checkouts/282/src/test/repositories/legacy-proxied/]
  proxyId:null
  policy[releases]:ignored
  policy[snapshots]:ignored
  policy[cache-failures]:ignored
  policy[checksum]:ignored
]
DEBUG|main| 3482|RepositoryProxyConnectors:default - Using target repository: legacy-proxied - layout: legacy - targetPath: org.apache.maven.test/jars/get-default-layout-present-1.0.jar
DEBUG|main| 3482|RepositoryProxyConnectors:default - Applying [releases] policy with [ignored]
DEBUG|main| 3484|PreDownloadPolicy:releases     - OK to update, releases policy set to IGNORED.
DEBUG|main| 3484|RepositoryProxyConnectors:default - Applying [snapshots] policy with [ignored]
DEBUG|main| 3484|PreDownloadPolicy:snapshots    - OK to update, snapshots policy set to IGNORED.
DEBUG|main| 3485|RepositoryProxyConnectors:default - Applying [cache-failures] policy with [ignored]
DEBUG|main| 3485|PreDownloadPolicy:cache-failures - OK to fetch, check-failures policy set to IGNORED.
DEBUG|main| 3486|RepositoryProxyConnectors:default - Retrieving org.apache.maven.test/jars/get-default-layout-present-1.0.jar from Proxied Legacy Repository
DEBUG|main| 3490|RepositoryProxyConnectors:default - Downloaded successfully.
DEBUG|main| 3491|RepositoryProxyConnectors:default - Retrieving org.apache.maven.test/jars/get-default-layout-present-1.0.jar.sha1 from Proxied Legacy Repository if updated
 WARN|main| 3491|RepositoryProxyConnectors:default - Resource does not exist: File: /export/home/build/data/continuum/checkouts/282/src/test/repositories/legacy-proxied/org.apache.maven.test/jars/get-default-layout-present-1.0.jar.sha1 does not exist
DEBUG|main| 3491|RepositoryProxyConnectors:default - Checksum.sha1 Not Download: File: /export/home/build/data/continuum/checkouts/282/src/test/repositories/legacy-proxied/org.apache.maven.test/jars/get-default-layout-present-1.0.jar.sha1 does not exist
DEBUG|main| 3502|RepositoryProxyConnectors:default - Retrieving org.apache.maven.test/jars/get-default-layout-present-1.0.jar.md5 from Proxied Legacy Repository
 WARN|main| 3503|RepositoryProxyConnectors:default - Resource does not exist: File: /export/home/build/data/continuum/checkouts/282/src/test/repositories/legacy-proxied/org.apache.maven.test/jars/get-default-layout-present-1.0.jar.md5 does not exist
DEBUG|main| 3503|RepositoryProxyConnectors:default - Checksum.md5 Not Download: File: /export/home/build/data/continuum/checkouts/282/src/test/repositories/legacy-proxied/org.apache.maven.test/jars/get-default-layout-present-1.0.jar.md5 does not exist
DEBUG|main| 3503|RepositoryProxyConnectors:default - Applying [checksum] policy with [ignored]
 INFO|main| 3503|RepositoryProxyConnectors:default - Successfully transfered: /export/home/build/data/continuum/checkouts/282/target/test-repository/legacy-managed/org.apache.maven.test/jars/get-default-layout-present-1.0.jar
 INFO|main| 3506|Cache:url-failures-cache       - Disposing cache: [  name = cache status = STATUS_ALIVE eternal = false overflowToDisk = false maxElementsInMemory = 1000 maxElementsOnDisk = 0 memoryStoreEvictionPolicy = LRU timeToLiveSeconds = 1800 timeToIdleSeconds = 2700 diskPersistent = true diskExpiryThreadIntervalSeconds = 600 cacheEventListeners:  hitCount = 0 memoryStoreHitCount = 0 diskStoreHitCount = 0 missCountNotFound = 0 missCountExpired = 0 ]
DEBUG|main| 3591|Registry:commons-configuration - Creating a default configuration - no configuration was provided
DEBUG|main| 3603|Registry:commons-configuration - Creating a default configuration - no configuration was provided
DEBUG|main| 3644|CacheManager                   - Attempting to create an existing singleton. Existing singleton returned.
DEBUG|main| 3645|MemoryStore                    - Initialized net.sf.ehcache.store.LruMemoryStore for cache
DEBUG|main| 3645|LruMemoryStore                 - cache Cache: Using SpoolingLinkedHashMap implementation
DEBUG|main| 3646|Cache                          - Initialised cache: cache

.\ testDefaultRequestConvertedToLegacyPathInManagedRepo() \._________________________________________

DEBUG|main| 3654|RepositoryProxyConnectors:default - Attempting connector: ProxyConnector[
  source:ArchivaRepository[legacy-managed-repository,file:/export/home/build/data/continuum/checkouts/282/target/test-repository/legacy-managed/]
  target:ArchivaRepository[proxied1,file:/export/home/build/data/continuum/checkouts/282/src/test/repositories/proxied1/]
  proxyId:null
  policy[releases]:ignored
  policy[snapshots]:ignored
  policy[cache-failures]:ignored
  policy[checksum]:ignored
]
DEBUG|main| 3655|RepositoryProxyConnectors:default - Using target repository: proxied1 - layout: default - targetPath: org/apache/maven/test/get-default-layout-present/1.0/get-default-layout-present-1.0.jar
DEBUG|main| 3655|RepositoryProxyConnectors:default - Applying [releases] policy with [ignored]
DEBUG|main| 3655|PreDownloadPolicy:releases     - OK to update, releases policy set to IGNORED.
DEBUG|main| 3655|RepositoryProxyConnectors:default - Applying [snapshots] policy with [ignored]
DEBUG|main| 3656|PreDownloadPolicy:snapshots    - OK to update, snapshots policy set to IGNORED.
DEBUG|main| 3656|RepositoryProxyConnectors:default - Applying [cache-failures] policy with [ignored]
DEBUG|main| 3656|PreDownloadPolicy:cache-failures - OK to fetch, check-failures policy set to IGNORED.
DEBUG|main| 3656|RepositoryProxyConnectors:default - Retrieving org/apache/maven/test/get-default-layout-present/1.0/get-default-layout-present-1.0.jar from Proxied Repository 1 if updated
DEBUG|main| 3657|RepositoryProxyConnectors:default - Downloaded successfully.
DEBUG|main| 3665|RepositoryProxyConnectors:default - Retrieving org/apache/maven/test/get-default-layout-present/1.0/get-default-layout-present-1.0.jar.sha1 from Proxied Repository 1 if updated
 WARN|main| 3665|RepositoryProxyConnectors:default - Resource does not exist: File: /export/home/build/data/continuum/checkouts/282/src/test/repositories/proxied1/org/apache/maven/test/get-default-layout-present/1.0/get-default-layout-present-1.0.jar.sha1 does not exist
DEBUG|main| 3665|RepositoryProxyConnectors:default - Checksum.sha1 Not Download: File: /export/home/build/data/continuum/checkouts/282/src/test/repositories/proxied1/org/apache/maven/test/get-default-layout-present/1.0/get-default-layout-present-1.0.jar.sha1 does not exist
DEBUG|main| 3666|RepositoryProxyConnectors:default - Retrieving org/apache/maven/test/get-default-layout-present/1.0/get-default-layout-present-1.0.jar.md5 from Proxied Repository 1
 WARN|main| 3666|RepositoryProxyConnectors:default - Resource does not exist: File: /export/home/build/data/continuum/checkouts/282/src/test/repositories/proxied1/org/apache/maven/test/get-default-layout-present/1.0/get-default-layout-present-1.0.jar.md5 does not exist
DEBUG|main| 3666|RepositoryProxyConnectors:default - Checksum.md5 Not Download: File: /export/home/build/data/continuum/checkouts/282/src/test/repositories/proxied1/org/apache/maven/test/get-default-layout-present/1.0/get-default-layout-present-1.0.jar.md5 does not exist
DEBUG|main| 3666|RepositoryProxyConnectors:default - Applying [checksum] policy with [ignored]
 INFO|main| 3666|RepositoryProxyConnectors:default - Successfully transfered: /export/home/build/data/continuum/checkouts/282/target/test-repository/legacy-managed/org.apache.maven.test/jars/get-default-layout-present-1.0.jar
 INFO|main| 3667|Cache:url-failures-cache       - Disposing cache: [  name = cache status = STATUS_ALIVE eternal = false overflowToDisk = false maxElementsInMemory = 1000 maxElementsOnDisk = 0 memoryStoreEvictionPolicy = LRU timeToLiveSeconds = 1800 timeToIdleSeconds = 2700 diskPersistent = true diskExpiryThreadIntervalSeconds = 600 cacheEventListeners:  hitCount = 0 memoryStoreHitCount = 0 diskStoreHitCount = 0 missCountNotFound = 0 missCountExpired = 0 ]
Tests run: 5, Failures: 0, Errors: 0, Skipped: 0, Time elapsed: 7.096 sec
Running org.apache.maven.archiva.proxy.CacheFailuresTransferTest
DEBUG|main| 3756|Registry:commons-configuration - Creating a default configuration - no configuration was provided
DEBUG|main| 3839|Registry:commons-configuration - Creating a default configuration - no configuration was provided
DEBUG|main| 4179|CacheManager                   - Attempting to create an existing singleton. Existing singleton returned.
DEBUG|main| 4179|MemoryStore                    - Initialized net.sf.ehcache.store.LruMemoryStore for cache
DEBUG|main| 4179|LruMemoryStore                 - cache Cache: Using SpoolingLinkedHashMap implementation
DEBUG|main| 4179|Cache                          - Initialised cache: cache

.\ testGetWithCacheFailuresOn() \._________________________________________

DEBUG|main| 4197|RepositoryProxyConnectors:default - Attempting connector: ProxyConnector[
  source:ArchivaRepository[default-managed-repository,file:/export/home/build/data/continuum/checkouts/282/target/test-repository/managed/]
  target:ArchivaRepository[badproxied1,test://bad.machine.com/repo/]
  proxyId:null
  policy[releases]:ignored
  policy[snapshots]:ignored
  policy[cache-failures]:cached
  policy[checksum]:fix
]
DEBUG|main| 4198|RepositoryProxyConnectors:default - Using target repository: badproxied1 - layout: default - targetPath: org/apache/maven/test/get-in-second-proxy/1.0/get-in-second-proxy-1.0.jar
DEBUG|main| 4198|RepositoryProxyConnectors:default - Applying [releases] policy with [ignored]
DEBUG|main| 4198|PreDownloadPolicy:releases     - OK to update, releases policy set to IGNORED.
DEBUG|main| 4198|RepositoryProxyConnectors:default - Applying [snapshots] policy with [ignored]
DEBUG|main| 4198|PreDownloadPolicy:snapshots    - OK to update, snapshots policy set to IGNORED.
DEBUG|main| 4199|RepositoryProxyConnectors:default - Applying [cache-failures] policy with [cached]
DEBUG|main| 4199|PreDownloadPolicy:cache-failures - OK to fetch, check-failures detected no issues.
DEBUG|main| 4199|RepositoryProxyConnectors:default - Retrieving org/apache/maven/test/get-in-second-proxy/1.0/get-in-second-proxy-1.0.jar from Bad Proxied 1 if updated
DEBUG|main| 4200|Wagon:test                     - .getIfNewer(org/apache/maven/test/get-in-second-proxy/1.0/get-in-second-proxy-1.0.jar, /export/home/build/data/continuum/checkouts/282/target/test-repository/managed/org/apache/maven/test/get-in-second-proxy/1.0/get-in-second-proxy-1.0.jar.tmp, 0)
 WARN|main| 4201|RepositoryProxyConnectors:default - Download failure:transfer failed
org.apache.maven.wagon.TransferFailedException: transfer failed
	at org.easymock.MockControl$4.invoke(MockControl.java:150)
	at org.easymock.internal.ObjectMethodsFilter.invoke(ObjectMethodsFilter.java:44)
	at $Proxy2.getIfNewer(Unknown Source)
	at org.apache.maven.archiva.proxy.WagonDelegate.getIfNewer(WagonDelegate.java:66)
	at org.apache.maven.archiva.proxy.DefaultRepositoryProxyConnectors.transferSimpleFile(DefaultRepositoryProxyConnectors.java:463)
	at org.apache.maven.archiva.proxy.DefaultRepositoryProxyConnectors.transferFile(DefaultRepositoryProxyConnectors.java:357)
	at org.apache.maven.archiva.proxy.DefaultRepositoryProxyConnectors.fetchFromProxies(DefaultRepositoryProxyConnectors.java:150)
	at org.apache.maven.archiva.proxy.CacheFailuresTransferTest.testGetWithCacheFailuresOn(CacheFailuresTransferTest.java:69)
	at sun.reflect.NativeMethodAccessorImpl.invoke0(Native Method)
	at sun.reflect.NativeMethodAccessorImpl.invoke(NativeMethodAccessorImpl.java:39)
	at sun.reflect.DelegatingMethodAccessorImpl.invoke(DelegatingMethodAccessorImpl.java:25)
	at java.lang.reflect.Method.invoke(Method.java:585)
	at junit.framework.TestCase.runTest(TestCase.java:154)
	at junit.framework.TestCase.runBare(TestCase.java:127)
	at junit.framework.TestResult$1.protect(TestResult.java:106)
	at junit.framework.TestResult.runProtected(TestResult.java:124)
	at junit.framework.TestResult.run(TestResult.java:109)
	at junit.framework.TestCase.run(TestCase.java:118)
	at junit.framework.TestSuite.runTest(TestSuite.java:208)
	at junit.framework.TestSuite.run(TestSuite.java:203)
	at sun.reflect.NativeMethodAccessorImpl.invoke0(Native Method)
	at sun.reflect.NativeMethodAccessorImpl.invoke(NativeMethodAccessorImpl.java:39)
	at sun.reflect.DelegatingMethodAccessorImpl.invoke(DelegatingMethodAccessorImpl.java:25)
	at java.lang.reflect.Method.invoke(Method.java:585)
	at org.apache.maven.surefire.junit.JUnitTestSet.execute(JUnitTestSet.java:210)
	at org.apache.maven.surefire.suite.AbstractDirectoryTestSuite.executeTestSet(AbstractDirectoryTestSuite.java:135)
	at org.apache.maven.surefire.suite.AbstractDirectoryTestSuite.execute(AbstractDirectoryTestSuite.java:122)
	at org.apache.maven.surefire.Surefire.run(Surefire.java:129)
	at sun.reflect.NativeMethodAccessorImpl.invoke0(Native Method)
	at sun.reflect.NativeMethodAccessorImpl.invoke(NativeMethodAccessorImpl.java:39)
	at sun.reflect.DelegatingMethodAccessorImpl.invoke(DelegatingMethodAccessorImpl.java:25)
	at java.lang.reflect.Method.invoke(Method.java:585)
	at org.apache.maven.surefire.booter.SurefireBooter.runSuitesInProcess(SurefireBooter.java:225)
	at org.apache.maven.surefire.booter.SurefireBooter.main(SurefireBooter.java:747)
DEBUG|main| 4209|RepositoryProxyConnectors:default - Attempting connector: ProxyConnector[
  source:ArchivaRepository[default-managed-repository,file:/export/home/build/data/continuum/checkouts/282/target/test-repository/managed/]
  target:ArchivaRepository[badproxied2,test://bad.machine.com/repo/]
  proxyId:null
  policy[releases]:ignored
  policy[snapshots]:ignored
  policy[cache-failures]:cached
  policy[checksum]:fix
]
DEBUG|main| 4210|RepositoryProxyConnectors:default - Using target repository: badproxied2 - layout: default - targetPath: org/apache/maven/test/get-in-second-proxy/1.0/get-in-second-proxy-1.0.jar
DEBUG|main| 4211|RepositoryProxyConnectors:default - Applying [releases] policy with [ignored]
DEBUG|main| 4211|PreDownloadPolicy:releases     - OK to update, releases policy set to IGNORED.
DEBUG|main| 4211|RepositoryProxyConnectors:default - Applying [snapshots] policy with [ignored]
DEBUG|main| 4211|PreDownloadPolicy:snapshots    - OK to update, snapshots policy set to IGNORED.
DEBUG|main| 4211|RepositoryProxyConnectors:default - Applying [cache-failures] policy with [cached]
DEBUG|main| 4211|PreDownloadPolicy:cache-failures - NO to fetch, check-failures detected previous failure on url: test://bad.machine.com/repo/org/apache/maven/test/get-in-second-proxy/1.0/get-in-second-proxy-1.0.jar
DEBUG|main| 4212|RepositoryProxyConnectors:default - Didn't pass the [cache-failures] policy.
 INFO|main| 4212|RepositoryProxyConnectors:default - Failed pre-download policies - /export/home/build/data/continuum/checkouts/282/target/test-repository/managed/org/apache/maven/test/get-in-second-proxy/1.0/get-in-second-proxy-1.0.jar
 INFO|main| 4212|Cache:url-failures-cache       - Disposing cache: [  name = cache status = STATUS_ALIVE eternal = false overflowToDisk = false maxElementsInMemory = 1000 maxElementsOnDisk = 0 memoryStoreEvictionPolicy = LRU timeToLiveSeconds = 1800 timeToIdleSeconds = 2700 diskPersistent = false diskExpiryThreadIntervalSeconds = 600 cacheEventListeners:  hitCount = 0 memoryStoreHitCount = 0 diskStoreHitCount = 0 missCountNotFound = 0 missCountExpired = 0 ]
DEBUG|main| 4325|Registry:commons-configuration - Creating a default configuration - no configuration was provided
DEBUG|main| 4339|Registry:commons-configuration - Creating a default configuration - no configuration was provided
DEBUG|main| 4379|CacheManager                   - Attempting to create an existing singleton. Existing singleton returned.
DEBUG|main| 4380|MemoryStore                    - Initialized net.sf.ehcache.store.LruMemoryStore for cache
DEBUG|main| 4380|LruMemoryStore                 - cache Cache: Using SpoolingLinkedHashMap implementation
DEBUG|main| 4380|Cache                          - Initialised cache: cache

.\ testGetWithCacheFailuresOff() \._________________________________________

DEBUG|main| 4384|RepositoryProxyConnectors:default - Attempting connector: ProxyConnector[
  source:ArchivaRepository[default-managed-repository,file:/export/home/build/data/continuum/checkouts/282/target/test-repository/managed/]
  target:ArchivaRepository[badproxied1,test://bad.machine.com/repo/]
  proxyId:null
  policy[releases]:ignored
  policy[snapshots]:ignored
  policy[cache-failures]:ignored
  policy[checksum]:fix
]
DEBUG|main| 4385|RepositoryProxyConnectors:default - Using target repository: badproxied1 - layout: default - targetPath: org/apache/maven/test/get-in-second-proxy/1.0/get-in-second-proxy-1.0.jar
DEBUG|main| 4385|RepositoryProxyConnectors:default - Applying [releases] policy with [ignored]
DEBUG|main| 4385|PreDownloadPolicy:releases     - OK to update, releases policy set to IGNORED.
DEBUG|main| 4385|RepositoryProxyConnectors:default - Applying [snapshots] policy with [ignored]
DEBUG|main| 4385|PreDownloadPolicy:snapshots    - OK to update, snapshots policy set to IGNORED.
DEBUG|main| 4386|RepositoryProxyConnectors:default - Applying [cache-failures] policy with [ignored]
DEBUG|main| 4386|PreDownloadPolicy:cache-failures - OK to fetch, check-failures policy set to IGNORED.
DEBUG|main| 4386|RepositoryProxyConnectors:default - Retrieving org/apache/maven/test/get-in-second-proxy/1.0/get-in-second-proxy-1.0.jar from Bad Proxied 1 if updated
DEBUG|main| 4386|Wagon:test                     - .getIfNewer(org/apache/maven/test/get-in-second-proxy/1.0/get-in-second-proxy-1.0.jar, /export/home/build/data/continuum/checkouts/282/target/test-repository/managed/org/apache/maven/test/get-in-second-proxy/1.0/get-in-second-proxy-1.0.jar.tmp, 0)
 WARN|main| 4386|RepositoryProxyConnectors:default - Download failure:transfer failed
org.apache.maven.wagon.TransferFailedException: transfer failed
	at org.easymock.MockControl$4.invoke(MockControl.java:150)
	at org.easymock.internal.ObjectMethodsFilter.invoke(ObjectMethodsFilter.java:44)
	at $Proxy2.getIfNewer(Unknown Source)
	at org.apache.maven.archiva.proxy.WagonDelegate.getIfNewer(WagonDelegate.java:66)
	at org.apache.maven.archiva.proxy.DefaultRepositoryProxyConnectors.transferSimpleFile(DefaultRepositoryProxyConnectors.java:463)
	at org.apache.maven.archiva.proxy.DefaultRepositoryProxyConnectors.transferFile(DefaultRepositoryProxyConnectors.java:357)
	at org.apache.maven.archiva.proxy.DefaultRepositoryProxyConnectors.fetchFromProxies(DefaultRepositoryProxyConnectors.java:150)
	at org.apache.maven.archiva.proxy.CacheFailuresTransferTest.testGetWithCacheFailuresOff(CacheFailuresTransferTest.java:103)
	at sun.reflect.NativeMethodAccessorImpl.invoke0(Native Method)
	at sun.reflect.NativeMethodAccessorImpl.invoke(NativeMethodAccessorImpl.java:39)
	at sun.reflect.DelegatingMethodAccessorImpl.invoke(DelegatingMethodAccessorImpl.java:25)
	at java.lang.reflect.Method.invoke(Method.java:585)
	at junit.framework.TestCase.runTest(TestCase.java:154)
	at junit.framework.TestCase.runBare(TestCase.java:127)
	at junit.framework.TestResult$1.protect(TestResult.java:106)
	at junit.framework.TestResult.runProtected(TestResult.java:124)
	at junit.framework.TestResult.run(TestResult.java:109)
	at junit.framework.TestCase.run(TestCase.java:118)
	at junit.framework.TestSuite.runTest(TestSuite.java:208)
	at junit.framework.TestSuite.run(TestSuite.java:203)
	at sun.reflect.NativeMethodAccessorImpl.invoke0(Native Method)
	at sun.reflect.NativeMethodAccessorImpl.invoke(NativeMethodAccessorImpl.java:39)
	at sun.reflect.DelegatingMethodAccessorImpl.invoke(DelegatingMethodAccessorImpl.java:25)
	at java.lang.reflect.Method.invoke(Method.java:585)
	at org.apache.maven.surefire.junit.JUnitTestSet.execute(JUnitTestSet.java:210)
	at org.apache.maven.surefire.suite.AbstractDirectoryTestSuite.executeTestSet(AbstractDirectoryTestSuite.java:135)
	at org.apache.maven.surefire.suite.AbstractDirectoryTestSuite.execute(AbstractDirectoryTestSuite.java:122)
	at org.apache.maven.surefire.Surefire.run(Surefire.java:129)
	at sun.reflect.NativeMethodAccessorImpl.invoke0(Native Method)
	at sun.reflect.NativeMethodAccessorImpl.invoke(NativeMethodAccessorImpl.java:39)
	at sun.reflect.DelegatingMethodAccessorImpl.invoke(DelegatingMethodAccessorImpl.java:25)
	at java.lang.reflect.Method.invoke(Method.java:585)
	at org.apache.maven.surefire.booter.SurefireBooter.runSuitesInProcess(SurefireBooter.java:225)
	at org.apache.maven.surefire.booter.SurefireBooter.main(SurefireBooter.java:747)
DEBUG|main| 4407|RepositoryProxyConnectors:default - Attempting connector: ProxyConnector[
  source:ArchivaRepository[default-managed-repository,file:/export/home/build/data/continuum/checkouts/282/target/test-repository/managed/]
  target:ArchivaRepository[badproxied2,test://bad.machine.com/repo/]
  proxyId:null
  policy[releases]:ignored
  policy[snapshots]:ignored
  policy[cache-failures]:ignored
  policy[checksum]:fix
]
DEBUG|main| 4408|RepositoryProxyConnectors:default - Using target repository: badproxied2 - layout: default - targetPath: org/apache/maven/test/get-in-second-proxy/1.0/get-in-second-proxy-1.0.jar
DEBUG|main| 4408|RepositoryProxyConnectors:default - Applying [releases] policy with [ignored]
DEBUG|main| 4408|PreDownloadPolicy:releases     - OK to update, releases policy set to IGNORED.
DEBUG|main| 4408|RepositoryProxyConnectors:default - Applying [snapshots] policy with [ignored]
DEBUG|main| 4409|PreDownloadPolicy:snapshots    - OK to update, snapshots policy set to IGNORED.
DEBUG|main| 4410|RepositoryProxyConnectors:default - Applying [cache-failures] policy with [ignored]
DEBUG|main| 4410|PreDownloadPolicy:cache-failures - OK to fetch, check-failures policy set to IGNORED.
DEBUG|main| 4410|RepositoryProxyConnectors:default - Retrieving org/apache/maven/test/get-in-second-proxy/1.0/get-in-second-proxy-1.0.jar from Bad Proxied 2 if updated
DEBUG|main| 4410|Wagon:test                     - .getIfNewer(org/apache/maven/test/get-in-second-proxy/1.0/get-in-second-proxy-1.0.jar, /export/home/build/data/continuum/checkouts/282/target/test-repository/managed/org/apache/maven/test/get-in-second-proxy/1.0/get-in-second-proxy-1.0.jar.tmp, 0)
DEBUG|main| 4411|RepositoryProxyConnectors:default - Not downloaded, as local file is newer than remote side: /export/home/build/data/continuum/checkouts/282/target/test-repository/managed/org/apache/maven/test/get-in-second-proxy/1.0/get-in-second-proxy-1.0.jar
DEBUG|main| 4412|RepositoryProxyConnectors:default - Retrieving org/apache/maven/test/get-in-second-proxy/1.0/get-in-second-proxy-1.0.jar.sha1 from Bad Proxied 2 if updated
DEBUG|main| 4412|Wagon:test                     - .getIfNewer(org/apache/maven/test/get-in-second-proxy/1.0/get-in-second-proxy-1.0.jar.sha1, /export/home/build/data/continuum/checkouts/282/target/test-repository/managed/org/apache/maven/test/get-in-second-proxy/1.0/get-in-second-proxy-1.0.jar.sha1.tmp, 0)
DEBUG|main| 4412|RepositoryProxyConnectors:default - Not downloaded, as local file is newer than remote side: /export/home/build/data/continuum/checkouts/282/target/test-repository/managed/org/apache/maven/test/get-in-second-proxy/1.0/get-in-second-proxy-1.0.jar.sha1
DEBUG|main| 4412|RepositoryProxyConnectors:default - Checksum.sha1 Downloaded: /export/home/build/data/continuum/checkouts/282/target/test-repository/managed/org/apache/maven/test/get-in-second-proxy/1.0/get-in-second-proxy-1.0.jar.sha1
DEBUG|main| 4412|RepositoryProxyConnectors:default - Retrieving org/apache/maven/test/get-in-second-proxy/1.0/get-in-second-proxy-1.0.jar.md5 from Bad Proxied 2 if updated
DEBUG|main| 4413|Wagon:test                     - .getIfNewer(org/apache/maven/test/get-in-second-proxy/1.0/get-in-second-proxy-1.0.jar.md5, /export/home/build/data/continuum/checkouts/282/target/test-repository/managed/org/apache/maven/test/get-in-second-proxy/1.0/get-in-second-proxy-1.0.jar.md5.tmp, 0)
DEBUG|main| 4413|RepositoryProxyConnectors:default - Not downloaded, as local file is newer than remote side: /export/home/build/data/continuum/checkouts/282/target/test-repository/managed/org/apache/maven/test/get-in-second-proxy/1.0/get-in-second-proxy-1.0.jar.md5
DEBUG|main| 4413|RepositoryProxyConnectors:default - Checksum.md5 Downloaded: /export/home/build/data/continuum/checkouts/282/target/test-repository/managed/org/apache/maven/test/get-in-second-proxy/1.0/get-in-second-proxy-1.0.jar.md5
DEBUG|main| 4413|RepositoryProxyConnectors:default - Applying [checksum] policy with [fix]
DEBUG|main| 4414|PostDownloadPolicy:checksum    - Local file /export/home/build/data/continuum/checkouts/282/target/test-repository/managed/org/apache/maven/test/get-in-second-proxy/1.0/get-in-second-proxy-1.0.jar does not exist.
DEBUG|main| 4414|RepositoryProxyConnectors:default - Didn't pass the [checksum] policy.
 INFO|main| 4414|RepositoryProxyConnectors:default - Failed post-download policies - /export/home/build/data/continuum/checkouts/282/target/test-repository/managed/org/apache/maven/test/get-in-second-proxy/1.0/get-in-second-proxy-1.0.jar
 INFO|main| 4415|Cache:url-failures-cache       - Disposing cache: [  name = cache status = STATUS_ALIVE eternal = false overflowToDisk = false maxElementsInMemory = 1000 maxElementsOnDisk = 0 memoryStoreEvictionPolicy = LRU timeToLiveSeconds = 1800 timeToIdleSeconds = 2700 diskPersistent = false diskExpiryThreadIntervalSeconds = 600 cacheEventListeners:  hitCount = 0 memoryStoreHitCount = 0 diskStoreHitCount = 0 missCountNotFound = 0 missCountExpired = 0 ]
DEBUG|main| 4558|Registry:commons-configuration - Creating a default configuration - no configuration was provided
DEBUG|main| 4573|Registry:commons-configuration - Creating a default configuration - no configuration was provided
DEBUG|main| 4643|CacheManager                   - Attempting to create an existing singleton. Existing singleton returned.
DEBUG|main| 4643|MemoryStore                    - Initialized net.sf.ehcache.store.LruMemoryStore for cache
DEBUG|main| 4643|LruMemoryStore                 - cache Cache: Using SpoolingLinkedHashMap implementation
DEBUG|main| 4644|Cache                          - Initialised cache: cache

.\ testGetWhenInBothProxiedButFirstCacheFailure() \._________________________________________

DEBUG|main| 4674|RepositoryProxyConnectors:default - Attempting connector: ProxyConnector[
  source:ArchivaRepository[default-managed-repository,file:/export/home/build/data/continuum/checkouts/282/target/test-repository/managed/]
  target:ArchivaRepository[proxied1,file:/export/home/build/data/continuum/checkouts/282/src/test/repositories/proxied1/]
  proxyId:null
  policy[releases]:ignored
  policy[snapshots]:ignored
  policy[cache-failures]:cached
  policy[checksum]:fix
]
DEBUG|main| 4675|RepositoryProxyConnectors:default - Using target repository: proxied1 - layout: default - targetPath: org/apache/maven/test/get-in-second-proxy/1.0/get-in-second-proxy-1.0.jar
DEBUG|main| 4675|RepositoryProxyConnectors:default - Applying [releases] policy with [ignored]
DEBUG|main| 4675|PreDownloadPolicy:releases     - OK to update, releases policy set to IGNORED.
DEBUG|main| 4675|RepositoryProxyConnectors:default - Applying [snapshots] policy with [ignored]
DEBUG|main| 4675|PreDownloadPolicy:snapshots    - OK to update, snapshots policy set to IGNORED.
DEBUG|main| 4675|RepositoryProxyConnectors:default - Applying [cache-failures] policy with [cached]
DEBUG|main| 4676|PreDownloadPolicy:cache-failures - NO to fetch, check-failures detected previous failure on url: file:/export/home/build/data/continuum/checkouts/282/src/test/repositories/proxied1/org/apache/maven/test/get-in-second-proxy/1.0/get-in-second-proxy-1.0.jar
DEBUG|main| 4676|RepositoryProxyConnectors:default - Didn't pass the [cache-failures] policy.
 INFO|main| 4676|RepositoryProxyConnectors:default - Failed pre-download policies - /export/home/build/data/continuum/checkouts/282/target/test-repository/managed/org/apache/maven/test/get-in-second-proxy/1.0/get-in-second-proxy-1.0.jar
DEBUG|main| 4676|RepositoryProxyConnectors:default - Attempting connector: ProxyConnector[
  source:ArchivaRepository[default-managed-repository,file:/export/home/build/data/continuum/checkouts/282/target/test-repository/managed/]
  target:ArchivaRepository[proxied2,file:/export/home/build/data/continuum/checkouts/282/src/test/repositories/proxied2/]
  proxyId:null
  policy[releases]:ignored
  policy[snapshots]:ignored
  policy[cache-failures]:cached
  policy[checksum]:fix
]
DEBUG|main| 4677|RepositoryProxyConnectors:default - Using target repository: proxied2 - layout: default - targetPath: org/apache/maven/test/get-in-second-proxy/1.0/get-in-second-proxy-1.0.jar
DEBUG|main| 4677|RepositoryProxyConnectors:default - Applying [releases] policy with [ignored]
DEBUG|main| 4677|PreDownloadPolicy:releases     - OK to update, releases policy set to IGNORED.
DEBUG|main| 4677|RepositoryProxyConnectors:default - Applying [snapshots] policy with [ignored]
DEBUG|main| 4678|PreDownloadPolicy:snapshots    - OK to update, snapshots policy set to IGNORED.
DEBUG|main| 4678|RepositoryProxyConnectors:default - Applying [cache-failures] policy with [cached]
DEBUG|main| 4678|PreDownloadPolicy:cache-failures - OK to fetch, check-failures detected no issues.
DEBUG|main| 4678|RepositoryProxyConnectors:default - Retrieving org/apache/maven/test/get-in-second-proxy/1.0/get-in-second-proxy-1.0.jar from Proxied Repository 2 if updated
DEBUG|main| 4679|RepositoryProxyConnectors:default - Downloaded successfully.
DEBUG|main| 4680|RepositoryProxyConnectors:default - Retrieving org/apache/maven/test/get-in-second-proxy/1.0/get-in-second-proxy-1.0.jar.sha1 from Proxied Repository 2 if updated
 WARN|main| 4680|RepositoryProxyConnectors:default - Resource does not exist: File: /export/home/build/data/continuum/checkouts/282/src/test/repositories/proxied2/org/apache/maven/test/get-in-second-proxy/1.0/get-in-second-proxy-1.0.jar.sha1 does not exist
DEBUG|main| 4680|RepositoryProxyConnectors:default - Checksum.sha1 Not Download: File: /export/home/build/data/continuum/checkouts/282/src/test/repositories/proxied2/org/apache/maven/test/get-in-second-proxy/1.0/get-in-second-proxy-1.0.jar.sha1 does not exist
DEBUG|main| 4680|RepositoryProxyConnectors:default - Retrieving org/apache/maven/test/get-in-second-proxy/1.0/get-in-second-proxy-1.0.jar.md5 from Proxied Repository 2 if updated
 WARN|main| 4681|RepositoryProxyConnectors:default - Resource does not exist: File: /export/home/build/data/continuum/checkouts/282/src/test/repositories/proxied2/org/apache/maven/test/get-in-second-proxy/1.0/get-in-second-proxy-1.0.jar.md5 does not exist
DEBUG|main| 4681|RepositoryProxyConnectors:default - Checksum.md5 Not Download: File: /export/home/build/data/continuum/checkouts/282/src/test/repositories/proxied2/org/apache/maven/test/get-in-second-proxy/1.0/get-in-second-proxy-1.0.jar.md5 does not exist
DEBUG|main| 4681|RepositoryProxyConnectors:default - Applying [checksum] policy with [fix]
 INFO|main| 4682|RepositoryProxyConnectors:default - Successfully transfered: /export/home/build/data/continuum/checkouts/282/target/test-repository/managed/org/apache/maven/test/get-in-second-proxy/1.0/get-in-second-proxy-1.0.jar
 INFO|main| 4683|Cache:url-failures-cache       - Disposing cache: [  name = cache status = STATUS_ALIVE eternal = false overflowToDisk = false maxElementsInMemory = 1000 maxElementsOnDisk = 0 memoryStoreEvictionPolicy = LRU timeToLiveSeconds = 1800 timeToIdleSeconds = 2700 diskPersistent = false diskExpiryThreadIntervalSeconds = 600 cacheEventListeners:  hitCount = 0 memoryStoreHitCount = 0 diskStoreHitCount = 0 missCountNotFound = 0 missCountExpired = 0 ]
Tests run: 3, Failures: 0, Errors: 0, Skipped: 0, Time elapsed: 1.011 sec
Running org.apache.maven.archiva.proxy.SnapshotTransferTest
DEBUG|main| 4728|Registry:commons-configuration - Creating a default configuration - no configuration was provided
DEBUG|main| 4742|Registry:commons-configuration - Creating a default configuration - no configuration was provided
DEBUG|main| 4802|CacheManager                   - Attempting to create an existing singleton. Existing singleton returned.
DEBUG|main| 4802|MemoryStore                    - Initialized net.sf.ehcache.store.LruMemoryStore for cache
DEBUG|main| 4802|LruMemoryStore                 - cache Cache: Using SpoolingLinkedHashMap implementation
DEBUG|main| 4802|Cache                          - Initialised cache: cache

.\ testSnapshotNonExistant() \._________________________________________

DEBUG|main| 4847|RepositoryProxyConnectors:default - Attempting connector: ProxyConnector[
  source:ArchivaRepository[default-managed-repository,file:/export/home/build/data/continuum/checkouts/282/target/test-repository/managed/]
  target:ArchivaRepository[proxied1,file:/export/home/build/data/continuum/checkouts/282/src/test/repositories/proxied1/]
  proxyId:null
  policy[releases]:ignored
  policy[snapshots]:ignored
  policy[cache-failures]:ignored
  policy[checksum]:ignored
]
DEBUG|main| 4847|RepositoryProxyConnectors:default - Using target repository: proxied1 - layout: default - targetPath: org/apache/maven/test/does-not-exist/1.0-SNAPSHOT/does-not-exist-1.0-SNAPSHOT.jar
DEBUG|main| 4847|RepositoryProxyConnectors:default - Applying [releases] policy with [ignored]
DEBUG|main| 4847|PreDownloadPolicy:releases     - OK to update, releases policy set to IGNORED.
DEBUG|main| 4847|RepositoryProxyConnectors:default - Applying [snapshots] policy with [ignored]
DEBUG|main| 4847|PreDownloadPolicy:snapshots    - OK to update, snapshots policy set to IGNORED.
DEBUG|main| 4847|RepositoryProxyConnectors:default - Applying [cache-failures] policy with [ignored]
DEBUG|main| 4847|PreDownloadPolicy:cache-failures - OK to fetch, check-failures policy set to IGNORED.
DEBUG|main| 4848|RepositoryProxyConnectors:default - Retrieving org/apache/maven/test/does-not-exist/1.0-SNAPSHOT/does-not-exist-1.0-SNAPSHOT.jar from Proxied Repository 1 if updated
 WARN|main| 4848|RepositoryProxyConnectors:default - Resource does not exist: File: /export/home/build/data/continuum/checkouts/282/src/test/repositories/proxied1/org/apache/maven/test/does-not-exist/1.0-SNAPSHOT/does-not-exist-1.0-SNAPSHOT.jar does not exist
 INFO|main| 4848|Cache:url-failures-cache       - Disposing cache: [  name = cache status = STATUS_ALIVE eternal = false overflowToDisk = false maxElementsInMemory = 1000 maxElementsOnDisk = 0 memoryStoreEvictionPolicy = LRU timeToLiveSeconds = 1800 timeToIdleSeconds = 2700 diskPersistent = true diskExpiryThreadIntervalSeconds = 600 cacheEventListeners:  hitCount = 0 memoryStoreHitCount = 0 diskStoreHitCount = 0 missCountNotFound = 0 missCountExpired = 0 ]
DEBUG|main| 4965|Registry:commons-configuration - Creating a default configuration - no configuration was provided
DEBUG|main| 5026|Registry:commons-configuration - Creating a default configuration - no configuration was provided
DEBUG|main| 5133|CacheManager                   - Attempting to create an existing singleton. Existing singleton returned.
DEBUG|main| 5140|MemoryStore                    - Initialized net.sf.ehcache.store.LruMemoryStore for cache
DEBUG|main| 5140|LruMemoryStore                 - cache Cache: Using SpoolingLinkedHashMap implementation
DEBUG|main| 5140|Cache                          - Initialised cache: cache

.\ testTimestampDrivenSnapshotNotPresentAlready() \._________________________________________

DEBUG|main| 5243|RepositoryProxyConnectors:default - Attempting connector: ProxyConnector[
  source:ArchivaRepository[default-managed-repository,file:/export/home/build/data/continuum/checkouts/282/target/test-repository/managed/]
  target:ArchivaRepository[proxied1,file:/export/home/build/data/continuum/checkouts/282/src/test/repositories/proxied1/]
  proxyId:null
  policy[releases]:ignored
  policy[snapshots]:ignored
  policy[cache-failures]:ignored
  policy[checksum]:ignored
]
DEBUG|main| 5246|RepositoryProxyConnectors:default - Using target repository: proxied1 - layout: default - targetPath: org/apache/maven/test/get-timestamped-snapshot/1.0-SNAPSHOT/get-timestamped-snapshot-1.0-SNAPSHOT.jar
DEBUG|main| 5246|RepositoryProxyConnectors:default - Applying [releases] policy with [ignored]
DEBUG|main| 5247|PreDownloadPolicy:releases     - OK to update, releases policy set to IGNORED.
DEBUG|main| 5247|RepositoryProxyConnectors:default - Applying [snapshots] policy with [ignored]
DEBUG|main| 5247|PreDownloadPolicy:snapshots    - OK to update, snapshots policy set to IGNORED.
DEBUG|main| 5266|RepositoryProxyConnectors:default - Applying [cache-failures] policy with [ignored]
DEBUG|main| 5266|PreDownloadPolicy:cache-failures - OK to fetch, check-failures policy set to IGNORED.
DEBUG|main| 5268|RepositoryProxyConnectors:default - Retrieving org/apache/maven/test/get-timestamped-snapshot/1.0-SNAPSHOT/get-timestamped-snapshot-1.0-SNAPSHOT.jar from Proxied Repository 1 if updated
DEBUG|main| 5269|RepositoryProxyConnectors:default - Downloaded successfully.
DEBUG|main| 5270|RepositoryProxyConnectors:default - Retrieving org/apache/maven/test/get-timestamped-snapshot/1.0-SNAPSHOT/get-timestamped-snapshot-1.0-SNAPSHOT.jar.sha1 from Proxied Repository 1 if updated
 WARN|main| 5270|RepositoryProxyConnectors:default - Resource does not exist: File: /export/home/build/data/continuum/checkouts/282/src/test/repositories/proxied1/org/apache/maven/test/get-timestamped-snapshot/1.0-SNAPSHOT/get-timestamped-snapshot-1.0-SNAPSHOT.jar.sha1 does not exist
DEBUG|main| 5270|RepositoryProxyConnectors:default - Checksum.sha1 Not Download: File: /export/home/build/data/continuum/checkouts/282/src/test/repositories/proxied1/org/apache/maven/test/get-timestamped-snapshot/1.0-SNAPSHOT/get-timestamped-snapshot-1.0-SNAPSHOT.jar.sha1 does not exist
DEBUG|main| 5271|RepositoryProxyConnectors:default - Retrieving org/apache/maven/test/get-timestamped-snapshot/1.0-SNAPSHOT/get-timestamped-snapshot-1.0-SNAPSHOT.jar.md5 from Proxied Repository 1 if updated
 WARN|main| 5271|RepositoryProxyConnectors:default - Resource does not exist: File: /export/home/build/data/continuum/checkouts/282/src/test/repositories/proxied1/org/apache/maven/test/get-timestamped-snapshot/1.0-SNAPSHOT/get-timestamped-snapshot-1.0-SNAPSHOT.jar.md5 does not exist
DEBUG|main| 5271|RepositoryProxyConnectors:default - Checksum.md5 Not Download: File: /export/home/build/data/continuum/checkouts/282/src/test/repositories/proxied1/org/apache/maven/test/get-timestamped-snapshot/1.0-SNAPSHOT/get-timestamped-snapshot-1.0-SNAPSHOT.jar.md5 does not exist
DEBUG|main| 5271|RepositoryProxyConnectors:default - Applying [checksum] policy with [ignored]
 INFO|main| 5271|RepositoryProxyConnectors:default - Successfully transfered: /export/home/build/data/continuum/checkouts/282/target/test-repository/managed/org/apache/maven/test/get-timestamped-snapshot/1.0-SNAPSHOT/get-timestamped-snapshot-1.0-SNAPSHOT.jar
 INFO|main| 5272|Cache:url-failures-cache       - Disposing cache: [  name = cache status = STATUS_ALIVE eternal = false overflowToDisk = false maxElementsInMemory = 1000 maxElementsOnDisk = 0 memoryStoreEvictionPolicy = LRU timeToLiveSeconds = 1800 timeToIdleSeconds = 2700 diskPersistent = true diskExpiryThreadIntervalSeconds = 600 cacheEventListeners:  hitCount = 0 memoryStoreHitCount = 0 diskStoreHitCount = 0 missCountNotFound = 0 missCountExpired = 0 ]
DEBUG|main| 5329|Registry:commons-configuration - Creating a default configuration - no configuration was provided
DEBUG|main| 5346|Registry:commons-configuration - Creating a default configuration - no configuration was provided
DEBUG|main| 5398|CacheManager                   - Attempting to create an existing singleton. Existing singleton returned.
DEBUG|main| 5399|MemoryStore                    - Initialized net.sf.ehcache.store.LruMemoryStore for cache
DEBUG|main| 5399|LruMemoryStore                 - cache Cache: Using SpoolingLinkedHashMap implementation
DEBUG|main| 5399|Cache                          - Initialised cache: cache

.\ testNewerTimestampDrivenSnapshotOnFirstRepo() \._________________________________________

DEBUG|main| 5406|RepositoryProxyConnectors:default - Attempting connector: ProxyConnector[
  source:ArchivaRepository[default-managed-repository,file:/export/home/build/data/continuum/checkouts/282/target/test-repository/managed/]
  target:ArchivaRepository[proxied1,file:/export/home/build/data/continuum/checkouts/282/src/test/repositories/proxied1/]
  proxyId:null
  policy[releases]:ignored
  policy[snapshots]:ignored
  policy[cache-failures]:ignored
  policy[checksum]:ignored
]
DEBUG|main| 5407|RepositoryProxyConnectors:default - Using target repository: proxied1 - layout: default - targetPath: org/apache/maven/test/get-present-timestamped-snapshot/1.0-SNAPSHOT/get-present-timestamped-snapshot-1.0-SNAPSHOT.jar
DEBUG|main| 5407|RepositoryProxyConnectors:default - Applying [releases] policy with [ignored]
DEBUG|main| 5469|PreDownloadPolicy:releases     - OK to update, releases policy set to IGNORED.
DEBUG|main| 5469|RepositoryProxyConnectors:default - Applying [snapshots] policy with [ignored]
DEBUG|main| 5475|PreDownloadPolicy:snapshots    - OK to update, snapshots policy set to IGNORED.
DEBUG|main| 5475|RepositoryProxyConnectors:default - Applying [cache-failures] policy with [ignored]
DEBUG|main| 5475|PreDownloadPolicy:cache-failures - OK to fetch, check-failures policy set to IGNORED.
DEBUG|main| 5479|RepositoryProxyConnectors:default - Retrieving org/apache/maven/test/get-present-timestamped-snapshot/1.0-SNAPSHOT/get-present-timestamped-snapshot-1.0-SNAPSHOT.jar from Proxied Repository 1
DEBUG|main| 5484|RepositoryProxyConnectors:default - Downloaded successfully.
DEBUG|main| 5485|RepositoryProxyConnectors:default - Retrieving org/apache/maven/test/get-present-timestamped-snapshot/1.0-SNAPSHOT/get-present-timestamped-snapshot-1.0-SNAPSHOT.jar.sha1 from Proxied Repository 1 if updated
 WARN|main| 5485|RepositoryProxyConnectors:default - Resource does not exist: File: /export/home/build/data/continuum/checkouts/282/src/test/repositories/proxied1/org/apache/maven/test/get-present-timestamped-snapshot/1.0-SNAPSHOT/get-present-timestamped-snapshot-1.0-SNAPSHOT.jar.sha1 does not exist
DEBUG|main| 5485|RepositoryProxyConnectors:default - Checksum.sha1 Not Download: File: /export/home/build/data/continuum/checkouts/282/src/test/repositories/proxied1/org/apache/maven/test/get-present-timestamped-snapshot/1.0-SNAPSHOT/get-present-timestamped-snapshot-1.0-SNAPSHOT.jar.sha1 does not exist
DEBUG|main| 5485|RepositoryProxyConnectors:default - Retrieving org/apache/maven/test/get-present-timestamped-snapshot/1.0-SNAPSHOT/get-present-timestamped-snapshot-1.0-SNAPSHOT.jar.md5 from Proxied Repository 1 if updated
 WARN|main| 5485|RepositoryProxyConnectors:default - Resource does not exist: File: /export/home/build/data/continuum/checkouts/282/src/test/repositories/proxied1/org/apache/maven/test/get-present-timestamped-snapshot/1.0-SNAPSHOT/get-present-timestamped-snapshot-1.0-SNAPSHOT.jar.md5 does not exist
DEBUG|main| 5486|RepositoryProxyConnectors:default - Checksum.md5 Not Download: File: /export/home/build/data/continuum/checkouts/282/src/test/repositories/proxied1/org/apache/maven/test/get-present-timestamped-snapshot/1.0-SNAPSHOT/get-present-timestamped-snapshot-1.0-SNAPSHOT.jar.md5 does not exist
DEBUG|main| 5487|RepositoryProxyConnectors:default - Applying [checksum] policy with [ignored]
 INFO|main| 5487|RepositoryProxyConnectors:default - Successfully transfered: /export/home/build/data/continuum/checkouts/282/target/test-repository/managed/org/apache/maven/test/get-present-timestamped-snapshot/1.0-SNAPSHOT/get-present-timestamped-snapshot-1.0-SNAPSHOT.jar
 INFO|main| 5488|Cache:url-failures-cache       - Disposing cache: [  name = cache status = STATUS_ALIVE eternal = false overflowToDisk = false maxElementsInMemory = 1000 maxElementsOnDisk = 0 memoryStoreEvictionPolicy = LRU timeToLiveSeconds = 1800 timeToIdleSeconds = 2700 diskPersistent = true diskExpiryThreadIntervalSeconds = 600 cacheEventListeners:  hitCount = 0 memoryStoreHitCount = 0 diskStoreHitCount = 0 missCountNotFound = 0 missCountExpired = 0 ]
DEBUG|main| 5529|Registry:commons-configuration - Creating a default configuration - no configuration was provided
DEBUG|main| 5539|Registry:commons-configuration - Creating a default configuration - no configuration was provided
DEBUG|main| 5620|CacheManager                   - Attempting to create an existing singleton. Existing singleton returned.
DEBUG|main| 5621|MemoryStore                    - Initialized net.sf.ehcache.store.LruMemoryStore for cache
DEBUG|main| 5621|LruMemoryStore                 - cache Cache: Using SpoolingLinkedHashMap implementation
DEBUG|main| 5621|Cache                          - Initialised cache: cache

.\ testOlderTimestampDrivenSnapshotOnFirstRepo() \._________________________________________

DEBUG|main| 5625|RepositoryProxyConnectors:default - Attempting connector: ProxyConnector[
  source:ArchivaRepository[default-managed-repository,file:/export/home/build/data/continuum/checkouts/282/target/test-repository/managed/]
  target:ArchivaRepository[proxied1,file:/export/home/build/data/continuum/checkouts/282/src/test/repositories/proxied1/]
  proxyId:null
  policy[releases]:ignored
  policy[snapshots]:ignored
  policy[cache-failures]:ignored
  policy[checksum]:ignored
]
DEBUG|main| 5625|RepositoryProxyConnectors:default - Using target repository: proxied1 - layout: default - targetPath: org/apache/maven/test/get-present-timestamped-snapshot/1.0-SNAPSHOT/get-present-timestamped-snapshot-1.0-SNAPSHOT.jar
DEBUG|main| 5625|RepositoryProxyConnectors:default - Applying [releases] policy with [ignored]
DEBUG|main| 5626|PreDownloadPolicy:releases     - OK to update, releases policy set to IGNORED.
DEBUG|main| 5626|RepositoryProxyConnectors:default - Applying [snapshots] policy with [ignored]
DEBUG|main| 5626|PreDownloadPolicy:snapshots    - OK to update, snapshots policy set to IGNORED.
DEBUG|main| 5626|RepositoryProxyConnectors:default - Applying [cache-failures] policy with [ignored]
DEBUG|main| 5626|PreDownloadPolicy:cache-failures - OK to fetch, check-failures policy set to IGNORED.
DEBUG|main| 5627|RepositoryProxyConnectors:default - Retrieving org/apache/maven/test/get-present-timestamped-snapshot/1.0-SNAPSHOT/get-present-timestamped-snapshot-1.0-SNAPSHOT.jar from Proxied Repository 1
DEBUG|main| 5628|RepositoryProxyConnectors:default - Downloaded successfully.
DEBUG|main| 5628|RepositoryProxyConnectors:default - Retrieving org/apache/maven/test/get-present-timestamped-snapshot/1.0-SNAPSHOT/get-present-timestamped-snapshot-1.0-SNAPSHOT.jar.sha1 from Proxied Repository 1 if updated
 WARN|main| 5628|RepositoryProxyConnectors:default - Resource does not exist: File: /export/home/build/data/continuum/checkouts/282/src/test/repositories/proxied1/org/apache/maven/test/get-present-timestamped-snapshot/1.0-SNAPSHOT/get-present-timestamped-snapshot-1.0-SNAPSHOT.jar.sha1 does not exist
DEBUG|main| 5628|RepositoryProxyConnectors:default - Checksum.sha1 Not Download: File: /export/home/build/data/continuum/checkouts/282/src/test/repositories/proxied1/org/apache/maven/test/get-present-timestamped-snapshot/1.0-SNAPSHOT/get-present-timestamped-snapshot-1.0-SNAPSHOT.jar.sha1 does not exist
DEBUG|main| 5628|RepositoryProxyConnectors:default - Retrieving org/apache/maven/test/get-present-timestamped-snapshot/1.0-SNAPSHOT/get-present-timestamped-snapshot-1.0-SNAPSHOT.jar.md5 from Proxied Repository 1 if updated
 WARN|main| 5629|RepositoryProxyConnectors:default - Resource does not exist: File: /export/home/build/data/continuum/checkouts/282/src/test/repositories/proxied1/org/apache/maven/test/get-present-timestamped-snapshot/1.0-SNAPSHOT/get-present-timestamped-snapshot-1.0-SNAPSHOT.jar.md5 does not exist
DEBUG|main| 5629|RepositoryProxyConnectors:default - Checksum.md5 Not Download: File: /export/home/build/data/continuum/checkouts/282/src/test/repositories/proxied1/org/apache/maven/test/get-present-timestamped-snapshot/1.0-SNAPSHOT/get-present-timestamped-snapshot-1.0-SNAPSHOT.jar.md5 does not exist
DEBUG|main| 5629|RepositoryProxyConnectors:default - Applying [checksum] policy with [ignored]
 INFO|main| 5629|RepositoryProxyConnectors:default - Successfully transfered: /export/home/build/data/continuum/checkouts/282/target/test-repository/managed/org/apache/maven/test/get-present-timestamped-snapshot/1.0-SNAPSHOT/get-present-timestamped-snapshot-1.0-SNAPSHOT.jar
 INFO|main| 5630|Cache:url-failures-cache       - Disposing cache: [  name = cache status = STATUS_ALIVE eternal = false overflowToDisk = false maxElementsInMemory = 1000 maxElementsOnDisk = 0 memoryStoreEvictionPolicy = LRU timeToLiveSeconds = 1800 timeToIdleSeconds = 2700 diskPersistent = true diskExpiryThreadIntervalSeconds = 600 cacheEventListeners:  hitCount = 0 memoryStoreHitCount = 0 diskStoreHitCount = 0 missCountNotFound = 0 missCountExpired = 0 ]
DEBUG|main| 5649|Registry:commons-configuration - Creating a default configuration - no configuration was provided
DEBUG|main| 5665|Registry:commons-configuration - Creating a default configuration - no configuration was provided
DEBUG|main| 5725|CacheManager                   - Attempting to create an existing singleton. Existing singleton returned.
DEBUG|main| 5725|MemoryStore                    - Initialized net.sf.ehcache.store.LruMemoryStore for cache
DEBUG|main| 5725|LruMemoryStore                 - cache Cache: Using SpoolingLinkedHashMap implementation
DEBUG|main| 5726|Cache                          - Initialised cache: cache

.\ testTimestampDrivenSnapshotNotExpired() \._________________________________________

DEBUG|main| 5731|RepositoryProxyConnectors:default - Attempting connector: ProxyConnector[
  source:ArchivaRepository[default-managed-repository,file:/export/home/build/data/continuum/checkouts/282/target/test-repository/managed/]
  target:ArchivaRepository[proxied1,file:/export/home/build/data/continuum/checkouts/282/src/test/repositories/proxied1/]
  proxyId:null
  policy[releases]:ignored
  policy[snapshots]:ignored
  policy[cache-failures]:ignored
  policy[checksum]:ignored
]
DEBUG|main| 5732|RepositoryProxyConnectors:default - Using target repository: proxied1 - layout: default - targetPath: org/apache/maven/test/get-present-timestamped-snapshot/1.0-SNAPSHOT/get-present-timestamped-snapshot-1.0-SNAPSHOT.jar
DEBUG|main| 5732|RepositoryProxyConnectors:default - Applying [releases] policy with [ignored]
DEBUG|main| 5733|PreDownloadPolicy:releases     - OK to update, releases policy set to IGNORED.
DEBUG|main| 5733|RepositoryProxyConnectors:default - Applying [snapshots] policy with [ignored]
DEBUG|main| 5734|PreDownloadPolicy:snapshots    - OK to update, snapshots policy set to IGNORED.
DEBUG|main| 5734|RepositoryProxyConnectors:default - Applying [cache-failures] policy with [ignored]
DEBUG|main| 5734|PreDownloadPolicy:cache-failures - OK to fetch, check-failures policy set to IGNORED.
DEBUG|main| 5734|RepositoryProxyConnectors:default - Retrieving org/apache/maven/test/get-present-timestamped-snapshot/1.0-SNAPSHOT/get-present-timestamped-snapshot-1.0-SNAPSHOT.jar from Proxied Repository 1
DEBUG|main| 5745|RepositoryProxyConnectors:default - Downloaded successfully.
DEBUG|main| 5745|RepositoryProxyConnectors:default - Retrieving org/apache/maven/test/get-present-timestamped-snapshot/1.0-SNAPSHOT/get-present-timestamped-snapshot-1.0-SNAPSHOT.jar.sha1 from Proxied Repository 1 if updated
 WARN|main| 5746|RepositoryProxyConnectors:default - Resource does not exist: File: /export/home/build/data/continuum/checkouts/282/src/test/repositories/proxied1/org/apache/maven/test/get-present-timestamped-snapshot/1.0-SNAPSHOT/get-present-timestamped-snapshot-1.0-SNAPSHOT.jar.sha1 does not exist
DEBUG|main| 5746|RepositoryProxyConnectors:default - Checksum.sha1 Not Download: File: /export/home/build/data/continuum/checkouts/282/src/test/repositories/proxied1/org/apache/maven/test/get-present-timestamped-snapshot/1.0-SNAPSHOT/get-present-timestamped-snapshot-1.0-SNAPSHOT.jar.sha1 does not exist
DEBUG|main| 5746|RepositoryProxyConnectors:default - Retrieving org/apache/maven/test/get-present-timestamped-snapshot/1.0-SNAPSHOT/get-present-timestamped-snapshot-1.0-SNAPSHOT.jar.md5 from Proxied Repository 1 if updated
 WARN|main| 5746|RepositoryProxyConnectors:default - Resource does not exist: File: /export/home/build/data/continuum/checkouts/282/src/test/repositories/proxied1/org/apache/maven/test/get-present-timestamped-snapshot/1.0-SNAPSHOT/get-present-timestamped-snapshot-1.0-SNAPSHOT.jar.md5 does not exist
DEBUG|main| 5746|RepositoryProxyConnectors:default - Checksum.md5 Not Download: File: /export/home/build/data/continuum/checkouts/282/src/test/repositories/proxied1/org/apache/maven/test/get-present-timestamped-snapshot/1.0-SNAPSHOT/get-present-timestamped-snapshot-1.0-SNAPSHOT.jar.md5 does not exist
DEBUG|main| 5747|RepositoryProxyConnectors:default - Applying [checksum] policy with [ignored]
 INFO|main| 5747|RepositoryProxyConnectors:default - Successfully transfered: /export/home/build/data/continuum/checkouts/282/target/test-repository/managed/org/apache/maven/test/get-present-timestamped-snapshot/1.0-SNAPSHOT/get-present-timestamped-snapshot-1.0-SNAPSHOT.jar
 INFO|main| 5747|Cache:url-failures-cache       - Disposing cache: [  name = cache status = STATUS_ALIVE eternal = false overflowToDisk = false maxElementsInMemory = 1000 maxElementsOnDisk = 0 memoryStoreEvictionPolicy = LRU timeToLiveSeconds = 1800 timeToIdleSeconds = 2700 diskPersistent = true diskExpiryThreadIntervalSeconds = 600 cacheEventListeners:  hitCount = 0 memoryStoreHitCount = 0 diskStoreHitCount = 0 missCountNotFound = 0 missCountExpired = 0 ]
DEBUG|main| 5770|Registry:commons-configuration - Creating a default configuration - no configuration was provided
DEBUG|main| 5802|Registry:commons-configuration - Creating a default configuration - no configuration was provided
DEBUG|main| 5850|CacheManager                   - Attempting to create an existing singleton. Existing singleton returned.
DEBUG|main| 5850|MemoryStore                    - Initialized net.sf.ehcache.store.LruMemoryStore for cache
DEBUG|main| 5851|LruMemoryStore                 - cache Cache: Using SpoolingLinkedHashMap implementation
DEBUG|main| 5851|Cache                          - Initialised cache: cache

.\ testTimestampDrivenSnapshotNotUpdated() \._________________________________________

DEBUG|main| 5855|RepositoryProxyConnectors:default - Attempting connector: ProxyConnector[
  source:ArchivaRepository[default-managed-repository,file:/export/home/build/data/continuum/checkouts/282/target/test-repository/managed/]
  target:ArchivaRepository[proxied1,file:/export/home/build/data/continuum/checkouts/282/src/test/repositories/proxied1/]
  proxyId:null
  policy[releases]:ignored
  policy[snapshots]:ignored
  policy[cache-failures]:ignored
  policy[checksum]:ignored
]
DEBUG|main| 5855|RepositoryProxyConnectors:default - Using target repository: proxied1 - layout: default - targetPath: org/apache/maven/test/get-present-timestamped-snapshot/1.0-SNAPSHOT/get-present-timestamped-snapshot-1.0-SNAPSHOT.jar
DEBUG|main| 5855|RepositoryProxyConnectors:default - Applying [releases] policy with [ignored]
DEBUG|main| 5856|PreDownloadPolicy:releases     - OK to update, releases policy set to IGNORED.
DEBUG|main| 5856|RepositoryProxyConnectors:default - Applying [snapshots] policy with [ignored]
DEBUG|main| 5856|PreDownloadPolicy:snapshots    - OK to update, snapshots policy set to IGNORED.
DEBUG|main| 5856|RepositoryProxyConnectors:default - Applying [cache-failures] policy with [ignored]
DEBUG|main| 5856|PreDownloadPolicy:cache-failures - OK to fetch, check-failures policy set to IGNORED.
DEBUG|main| 5856|RepositoryProxyConnectors:default - Retrieving org/apache/maven/test/get-present-timestamped-snapshot/1.0-SNAPSHOT/get-present-timestamped-snapshot-1.0-SNAPSHOT.jar from Proxied Repository 1
DEBUG|main| 5858|RepositoryProxyConnectors:default - Downloaded successfully.
DEBUG|main| 5858|RepositoryProxyConnectors:default - Retrieving org/apache/maven/test/get-present-timestamped-snapshot/1.0-SNAPSHOT/get-present-timestamped-snapshot-1.0-SNAPSHOT.jar.sha1 from Proxied Repository 1 if updated
 WARN|main| 5858|RepositoryProxyConnectors:default - Resource does not exist: File: /export/home/build/data/continuum/checkouts/282/src/test/repositories/proxied1/org/apache/maven/test/get-present-timestamped-snapshot/1.0-SNAPSHOT/get-present-timestamped-snapshot-1.0-SNAPSHOT.jar.sha1 does not exist
DEBUG|main| 5858|RepositoryProxyConnectors:default - Checksum.sha1 Not Download: File: /export/home/build/data/continuum/checkouts/282/src/test/repositories/proxied1/org/apache/maven/test/get-present-timestamped-snapshot/1.0-SNAPSHOT/get-present-timestamped-snapshot-1.0-SNAPSHOT.jar.sha1 does not exist
DEBUG|main| 5858|RepositoryProxyConnectors:default - Retrieving org/apache/maven/test/get-present-timestamped-snapshot/1.0-SNAPSHOT/get-present-timestamped-snapshot-1.0-SNAPSHOT.jar.md5 from Proxied Repository 1 if updated
 WARN|main| 5859|RepositoryProxyConnectors:default - Resource does not exist: File: /export/home/build/data/continuum/checkouts/282/src/test/repositories/proxied1/org/apache/maven/test/get-present-timestamped-snapshot/1.0-SNAPSHOT/get-present-timestamped-snapshot-1.0-SNAPSHOT.jar.md5 does not exist
DEBUG|main| 5859|RepositoryProxyConnectors:default - Checksum.md5 Not Download: File: /export/home/build/data/continuum/checkouts/282/src/test/repositories/proxied1/org/apache/maven/test/get-present-timestamped-snapshot/1.0-SNAPSHOT/get-present-timestamped-snapshot-1.0-SNAPSHOT.jar.md5 does not exist
DEBUG|main| 5859|RepositoryProxyConnectors:default - Applying [checksum] policy with [ignored]
 INFO|main| 5859|RepositoryProxyConnectors:default - Successfully transfered: /export/home/build/data/continuum/checkouts/282/target/test-repository/managed/org/apache/maven/test/get-present-timestamped-snapshot/1.0-SNAPSHOT/get-present-timestamped-snapshot-1.0-SNAPSHOT.jar
 INFO|main| 5860|Cache:url-failures-cache       - Disposing cache: [  name = cache status = STATUS_ALIVE eternal = false overflowToDisk = false maxElementsInMemory = 1000 maxElementsOnDisk = 0 memoryStoreEvictionPolicy = LRU timeToLiveSeconds = 1800 timeToIdleSeconds = 2700 diskPersistent = true diskExpiryThreadIntervalSeconds = 600 cacheEventListeners:  hitCount = 0 memoryStoreHitCount = 0 diskStoreHitCount = 0 missCountNotFound = 0 missCountExpired = 0 ]
DEBUG|main| 5901|Registry:commons-configuration - Creating a default configuration - no configuration was provided
DEBUG|main| 5921|Registry:commons-configuration - Creating a default configuration - no configuration was provided
DEBUG|main| 5971|CacheManager                   - Attempting to create an existing singleton. Existing singleton returned.
DEBUG|main| 5972|MemoryStore                    - Initialized net.sf.ehcache.store.LruMemoryStore for cache
DEBUG|main| 5972|LruMemoryStore                 - cache Cache: Using SpoolingLinkedHashMap implementation
DEBUG|main| 5972|Cache                          - Initialised cache: cache

.\ testTimestampDrivenSnapshotNotPresentAlreadyExpiredCacheFailure() \._________________________________________

DEBUG|main| 5981|RepositoryProxyConnectors:default - Attempting connector: ProxyConnector[
  source:ArchivaRepository[default-managed-repository,file:/export/home/build/data/continuum/checkouts/282/target/test-repository/managed/]
  target:ArchivaRepository[proxied1,file:/export/home/build/data/continuum/checkouts/282/src/test/repositories/proxied1/]
  proxyId:null
  policy[releases]:ignored
  policy[snapshots]:ignored
  policy[cache-failures]:cached
  policy[checksum]:ignored
]
DEBUG|main| 5982|RepositoryProxyConnectors:default - Using target repository: proxied1 - layout: default - targetPath: org/apache/maven/test/get-timestamped-snapshot/1.0-SNAPSHOT/get-timestamped-snapshot-1.0-SNAPSHOT.jar
DEBUG|main| 5982|RepositoryProxyConnectors:default - Applying [releases] policy with [ignored]
DEBUG|main| 5983|PreDownloadPolicy:releases     - OK to update, releases policy set to IGNORED.
DEBUG|main| 5983|RepositoryProxyConnectors:default - Applying [snapshots] policy with [ignored]
DEBUG|main| 5983|PreDownloadPolicy:snapshots    - OK to update, snapshots policy set to IGNORED.
DEBUG|main| 5983|RepositoryProxyConnectors:default - Applying [cache-failures] policy with [cached]
DEBUG|main| 5983|PreDownloadPolicy:cache-failures - OK to fetch, check-failures detected no issues.
DEBUG|main| 5983|RepositoryProxyConnectors:default - Retrieving org/apache/maven/test/get-timestamped-snapshot/1.0-SNAPSHOT/get-timestamped-snapshot-1.0-SNAPSHOT.jar from Proxied Repository 1 if updated
DEBUG|main| 5984|RepositoryProxyConnectors:default - Downloaded successfully.
DEBUG|main| 5985|RepositoryProxyConnectors:default - Retrieving org/apache/maven/test/get-timestamped-snapshot/1.0-SNAPSHOT/get-timestamped-snapshot-1.0-SNAPSHOT.jar.sha1 from Proxied Repository 1 if updated
 WARN|main| 5985|RepositoryProxyConnectors:default - Resource does not exist: File: /export/home/build/data/continuum/checkouts/282/src/test/repositories/proxied1/org/apache/maven/test/get-timestamped-snapshot/1.0-SNAPSHOT/get-timestamped-snapshot-1.0-SNAPSHOT.jar.sha1 does not exist
DEBUG|main| 5985|RepositoryProxyConnectors:default - Checksum.sha1 Not Download: File: /export/home/build/data/continuum/checkouts/282/src/test/repositories/proxied1/org/apache/maven/test/get-timestamped-snapshot/1.0-SNAPSHOT/get-timestamped-snapshot-1.0-SNAPSHOT.jar.sha1 does not exist
DEBUG|main| 5985|RepositoryProxyConnectors:default - Retrieving org/apache/maven/test/get-timestamped-snapshot/1.0-SNAPSHOT/get-timestamped-snapshot-1.0-SNAPSHOT.jar.md5 from Proxied Repository 1 if updated
 WARN|main| 5985|RepositoryProxyConnectors:default - Resource does not exist: File: /export/home/build/data/continuum/checkouts/282/src/test/repositories/proxied1/org/apache/maven/test/get-timestamped-snapshot/1.0-SNAPSHOT/get-timestamped-snapshot-1.0-SNAPSHOT.jar.md5 does not exist
DEBUG|main| 5986|RepositoryProxyConnectors:default - Checksum.md5 Not Download: File: /export/home/build/data/continuum/checkouts/282/src/test/repositories/proxied1/org/apache/maven/test/get-timestamped-snapshot/1.0-SNAPSHOT/get-timestamped-snapshot-1.0-SNAPSHOT.jar.md5 does not exist
DEBUG|main| 5986|RepositoryProxyConnectors:default - Applying [checksum] policy with [ignored]
 INFO|main| 5986|RepositoryProxyConnectors:default - Successfully transfered: /export/home/build/data/continuum/checkouts/282/target/test-repository/managed/org/apache/maven/test/get-timestamped-snapshot/1.0-SNAPSHOT/get-timestamped-snapshot-1.0-SNAPSHOT.jar
 INFO|main| 5987|Cache:url-failures-cache       - Disposing cache: [  name = cache status = STATUS_ALIVE eternal = false overflowToDisk = false maxElementsInMemory = 1000 maxElementsOnDisk = 0 memoryStoreEvictionPolicy = LRU timeToLiveSeconds = 1800 timeToIdleSeconds = 2700 diskPersistent = true diskExpiryThreadIntervalSeconds = 600 cacheEventListeners:  hitCount = 0 memoryStoreHitCount = 0 diskStoreHitCount = 0 missCountNotFound = 0 missCountExpired = 0 ]
DEBUG|main| 6033|Registry:commons-configuration - Creating a default configuration - no configuration was provided
DEBUG|main| 6111|Registry:commons-configuration - Creating a default configuration - no configuration was provided
DEBUG|main| 6275|CacheManager                   - Attempting to create an existing singleton. Existing singleton returned.
DEBUG|main| 6275|MemoryStore                    - Initialized net.sf.ehcache.store.LruMemoryStore for cache
DEBUG|main| 6275|LruMemoryStore                 - cache Cache: Using SpoolingLinkedHashMap implementation
DEBUG|main| 6276|Cache                          - Initialised cache: cache

.\ testMetadataDrivenSnapshotNotPresentAlready() \._________________________________________

DEBUG|main| 6280|RepositoryProxyConnectors:default - Attempting connector: ProxyConnector[
  source:ArchivaRepository[default-managed-repository,file:/export/home/build/data/continuum/checkouts/282/target/test-repository/managed/]
  target:ArchivaRepository[proxied1,file:/export/home/build/data/continuum/checkouts/282/src/test/repositories/proxied1/]
  proxyId:null
  policy[releases]:ignored
  policy[snapshots]:ignored
  policy[cache-failures]:ignored
  policy[checksum]:ignored
]
DEBUG|main| 6281|RepositoryProxyConnectors:default - Using target repository: proxied1 - layout: default - targetPath: org/apache/maven/test/get-metadata-snapshot/1.0-SNAPSHOT/get-metadata-snapshot-1.0-20050831.101112-1.jar
DEBUG|main| 6281|RepositoryProxyConnectors:default - Applying [releases] policy with [ignored]
DEBUG|main| 6282|PreDownloadPolicy:releases     - OK to update, releases policy set to IGNORED.
DEBUG|main| 6282|RepositoryProxyConnectors:default - Applying [snapshots] policy with [ignored]
DEBUG|main| 6282|PreDownloadPolicy:snapshots    - OK to update, snapshots policy set to IGNORED.
DEBUG|main| 6282|RepositoryProxyConnectors:default - Applying [cache-failures] policy with [ignored]
DEBUG|main| 6282|PreDownloadPolicy:cache-failures - OK to fetch, check-failures policy set to IGNORED.
DEBUG|main| 6282|RepositoryProxyConnectors:default - Retrieving org/apache/maven/test/get-metadata-snapshot/1.0-SNAPSHOT/get-metadata-snapshot-1.0-20050831.101112-1.jar from Proxied Repository 1 if updated
DEBUG|main| 6284|RepositoryProxyConnectors:default - Downloaded successfully.
DEBUG|main| 6285|RepositoryProxyConnectors:default - Retrieving org/apache/maven/test/get-metadata-snapshot/1.0-SNAPSHOT/get-metadata-snapshot-1.0-20050831.101112-1.jar.sha1 from Proxied Repository 1 if updated
 WARN|main| 6285|RepositoryProxyConnectors:default - Resource does not exist: File: /export/home/build/data/continuum/checkouts/282/src/test/repositories/proxied1/org/apache/maven/test/get-metadata-snapshot/1.0-SNAPSHOT/get-metadata-snapshot-1.0-20050831.101112-1.jar.sha1 does not exist
DEBUG|main| 6285|RepositoryProxyConnectors:default - Checksum.sha1 Not Download: File: /export/home/build/data/continuum/checkouts/282/src/test/repositories/proxied1/org/apache/maven/test/get-metadata-snapshot/1.0-SNAPSHOT/get-metadata-snapshot-1.0-20050831.101112-1.jar.sha1 does not exist
DEBUG|main| 6285|RepositoryProxyConnectors:default - Retrieving org/apache/maven/test/get-metadata-snapshot/1.0-SNAPSHOT/get-metadata-snapshot-1.0-20050831.101112-1.jar.md5 from Proxied Repository 1 if updated
 WARN|main| 6285|RepositoryProxyConnectors:default - Resource does not exist: File: /export/home/build/data/continuum/checkouts/282/src/test/repositories/proxied1/org/apache/maven/test/get-metadata-snapshot/1.0-SNAPSHOT/get-metadata-snapshot-1.0-20050831.101112-1.jar.md5 does not exist
DEBUG|main| 6286|RepositoryProxyConnectors:default - Checksum.md5 Not Download: File: /export/home/build/data/continuum/checkouts/282/src/test/repositories/proxied1/org/apache/maven/test/get-metadata-snapshot/1.0-SNAPSHOT/get-metadata-snapshot-1.0-20050831.101112-1.jar.md5 does not exist
DEBUG|main| 6286|RepositoryProxyConnectors:default - Applying [checksum] policy with [ignored]
 INFO|main| 6286|RepositoryProxyConnectors:default - Successfully transfered: /export/home/build/data/continuum/checkouts/282/target/test-repository/managed/org/apache/maven/test/get-metadata-snapshot/1.0-SNAPSHOT/get-metadata-snapshot-1.0-20050831.101112-1.jar
 INFO|main| 6287|Cache:url-failures-cache       - Disposing cache: [  name = cache status = STATUS_ALIVE eternal = false overflowToDisk = false maxElementsInMemory = 1000 maxElementsOnDisk = 0 memoryStoreEvictionPolicy = LRU timeToLiveSeconds = 1800 timeToIdleSeconds = 2700 diskPersistent = true diskExpiryThreadIntervalSeconds = 600 cacheEventListeners:  hitCount = 0 memoryStoreHitCount = 0 diskStoreHitCount = 0 missCountNotFound = 0 missCountExpired = 0 ]
DEBUG|main| 6306|Registry:commons-configuration - Creating a default configuration - no configuration was provided
DEBUG|main| 6324|Registry:commons-configuration - Creating a default configuration - no configuration was provided
DEBUG|main| 6354|CacheManager                   - Attempting to create an existing singleton. Existing singleton returned.
DEBUG|main| 6355|MemoryStore                    - Initialized net.sf.ehcache.store.LruMemoryStore for cache
DEBUG|main| 6355|LruMemoryStore                 - cache Cache: Using SpoolingLinkedHashMap implementation
DEBUG|main| 6355|Cache                          - Initialised cache: cache

.\ testGetMetadataDrivenSnapshotRemoteUpdate() \._________________________________________

DEBUG|main| 6359|RepositoryProxyConnectors:default - Attempting connector: ProxyConnector[
  source:ArchivaRepository[default-managed-repository,file:/export/home/build/data/continuum/checkouts/282/target/test-repository/managed/]
  target:ArchivaRepository[proxied1,file:/export/home/build/data/continuum/checkouts/282/src/test/repositories/proxied1/]
  proxyId:null
  policy[releases]:ignored
  policy[snapshots]:ignored
  policy[cache-failures]:ignored
  policy[checksum]:ignored
]
DEBUG|main| 6368|RepositoryProxyConnectors:default - Using target repository: proxied1 - layout: default - targetPath: org/apache/maven/test/get-present-metadata-snapshot/1.0-SNAPSHOT/get-present-metadata-snapshot-1.0-20050831.101112-1.jar
DEBUG|main| 6368|RepositoryProxyConnectors:default - Applying [releases] policy with [ignored]
DEBUG|main| 6369|PreDownloadPolicy:releases     - OK to update, releases policy set to IGNORED.
DEBUG|main| 6369|RepositoryProxyConnectors:default - Applying [snapshots] policy with [ignored]
DEBUG|main| 6369|PreDownloadPolicy:snapshots    - OK to update, snapshots policy set to IGNORED.
DEBUG|main| 6369|RepositoryProxyConnectors:default - Applying [cache-failures] policy with [ignored]
DEBUG|main| 6369|PreDownloadPolicy:cache-failures - OK to fetch, check-failures policy set to IGNORED.
DEBUG|main| 6369|RepositoryProxyConnectors:default - Retrieving org/apache/maven/test/get-present-metadata-snapshot/1.0-SNAPSHOT/get-present-metadata-snapshot-1.0-20050831.101112-1.jar from Proxied Repository 1
DEBUG|main| 6378|RepositoryProxyConnectors:default - Downloaded successfully.
DEBUG|main| 6378|RepositoryProxyConnectors:default - Retrieving org/apache/maven/test/get-present-metadata-snapshot/1.0-SNAPSHOT/get-present-metadata-snapshot-1.0-20050831.101112-1.jar.sha1 from Proxied Repository 1 if updated
 WARN|main| 6378|RepositoryProxyConnectors:default - Resource does not exist: File: /export/home/build/data/continuum/checkouts/282/src/test/repositories/proxied1/org/apache/maven/test/get-present-metadata-snapshot/1.0-SNAPSHOT/get-present-metadata-snapshot-1.0-20050831.101112-1.jar.sha1 does not exist
DEBUG|main| 6379|RepositoryProxyConnectors:default - Checksum.sha1 Not Download: File: /export/home/build/data/continuum/checkouts/282/src/test/repositories/proxied1/org/apache/maven/test/get-present-metadata-snapshot/1.0-SNAPSHOT/get-present-metadata-snapshot-1.0-20050831.101112-1.jar.sha1 does not exist
DEBUG|main| 6379|RepositoryProxyConnectors:default - Retrieving org/apache/maven/test/get-present-metadata-snapshot/1.0-SNAPSHOT/get-present-metadata-snapshot-1.0-20050831.101112-1.jar.md5 from Proxied Repository 1 if updated
 WARN|main| 6379|RepositoryProxyConnectors:default - Resource does not exist: File: /export/home/build/data/continuum/checkouts/282/src/test/repositories/proxied1/org/apache/maven/test/get-present-metadata-snapshot/1.0-SNAPSHOT/get-present-metadata-snapshot-1.0-20050831.101112-1.jar.md5 does not exist
DEBUG|main| 6379|RepositoryProxyConnectors:default - Checksum.md5 Not Download: File: /export/home/build/data/continuum/checkouts/282/src/test/repositories/proxied1/org/apache/maven/test/get-present-metadata-snapshot/1.0-SNAPSHOT/get-present-metadata-snapshot-1.0-20050831.101112-1.jar.md5 does not exist
DEBUG|main| 6379|RepositoryProxyConnectors:default - Applying [checksum] policy with [ignored]
 INFO|main| 6380|RepositoryProxyConnectors:default - Successfully transfered: /export/home/build/data/continuum/checkouts/282/target/test-repository/managed/org/apache/maven/test/get-present-metadata-snapshot/1.0-SNAPSHOT/get-present-metadata-snapshot-1.0-20050831.101112-1.jar
 INFO|main| 6380|Cache:url-failures-cache       - Disposing cache: [  name = cache status = STATUS_ALIVE eternal = false overflowToDisk = false maxElementsInMemory = 1000 maxElementsOnDisk = 0 memoryStoreEvictionPolicy = LRU timeToLiveSeconds = 1800 timeToIdleSeconds = 2700 diskPersistent = true diskExpiryThreadIntervalSeconds = 600 cacheEventListeners:  hitCount = 0 memoryStoreHitCount = 0 diskStoreHitCount = 0 missCountNotFound = 0 missCountExpired = 0 ]
Tests run: 9, Failures: 0, Errors: 0, Skipped: 0, Time elapsed: 1.697 sec
Running org.apache.maven.archiva.proxy.ChecksumTransferTest
DEBUG|main| 6589|Registry:commons-configuration - Creating a default configuration - no configuration was provided
DEBUG|main| 6615|Registry:commons-configuration - Creating a default configuration - no configuration was provided
DEBUG|main| 6636|CacheManager                   - Attempting to create an existing singleton. Existing singleton returned.
DEBUG|main| 6637|MemoryStore                    - Initialized net.sf.ehcache.store.LruMemoryStore for cache
DEBUG|main| 6637|LruMemoryStore                 - cache Cache: Using SpoolingLinkedHashMap implementation
DEBUG|main| 6637|Cache                          - Initialised cache: cache

.\ testGetChecksumBothCorrect() \._________________________________________

DEBUG|main| 6640|RepositoryProxyConnectors:default - Attempting connector: ProxyConnector[
  source:ArchivaRepository[default-managed-repository,file:/export/home/build/data/continuum/checkouts/282/target/test-repository/managed/]
  target:ArchivaRepository[proxied1,file:/export/home/build/data/continuum/checkouts/282/src/test/repositories/proxied1/]
  proxyId:null
  policy[releases]:ignored
  policy[snapshots]:ignored
  policy[cache-failures]:ignored
  policy[checksum]:ignored
]
DEBUG|main| 6640|RepositoryProxyConnectors:default - Using target repository: proxied1 - layout: default - targetPath: org/apache/maven/test/get-checksum-both-right/1.0/get-checksum-both-right-1.0.jar
DEBUG|main| 6640|RepositoryProxyConnectors:default - Applying [releases] policy with [ignored]
DEBUG|main| 6641|PreDownloadPolicy:releases     - OK to update, releases policy set to IGNORED.
DEBUG|main| 6641|RepositoryProxyConnectors:default - Applying [snapshots] policy with [ignored]
DEBUG|main| 6641|PreDownloadPolicy:snapshots    - OK to update, snapshots policy set to IGNORED.
DEBUG|main| 6641|RepositoryProxyConnectors:default - Applying [cache-failures] policy with [ignored]
DEBUG|main| 6641|PreDownloadPolicy:cache-failures - OK to fetch, check-failures policy set to IGNORED.
DEBUG|main| 6641|RepositoryProxyConnectors:default - Retrieving org/apache/maven/test/get-checksum-both-right/1.0/get-checksum-both-right-1.0.jar from Proxied Repository 1 if updated
DEBUG|main| 6701|RepositoryProxyConnectors:default - Downloaded successfully.
DEBUG|main| 6702|RepositoryProxyConnectors:default - Retrieving org/apache/maven/test/get-checksum-both-right/1.0/get-checksum-both-right-1.0.jar.sha1 from Proxied Repository 1 if updated
DEBUG|main| 6703|RepositoryProxyConnectors:default - Downloaded successfully.
DEBUG|main| 6703|RepositoryProxyConnectors:default - Checksum.sha1 Downloaded: /export/home/build/data/continuum/checkouts/282/target/test-repository/managed/org/apache/maven/test/get-checksum-both-right/1.0/get-checksum-both-right-1.0.jar.sha1
DEBUG|main| 6704|RepositoryProxyConnectors:default - Retrieving org/apache/maven/test/get-checksum-both-right/1.0/get-checksum-both-right-1.0.jar.md5 from Proxied Repository 1 if updated
DEBUG|main| 6759|RepositoryProxyConnectors:default - Downloaded successfully.
DEBUG|main| 6760|RepositoryProxyConnectors:default - Checksum.md5 Downloaded: /export/home/build/data/continuum/checkouts/282/target/test-repository/managed/org/apache/maven/test/get-checksum-both-right/1.0/get-checksum-both-right-1.0.jar.md5
DEBUG|main| 6760|RepositoryProxyConnectors:default - Applying [checksum] policy with [ignored]
 INFO|main| 6760|RepositoryProxyConnectors:default - Successfully transfered: /export/home/build/data/continuum/checkouts/282/target/test-repository/managed/org/apache/maven/test/get-checksum-both-right/1.0/get-checksum-both-right-1.0.jar
 INFO|main| 6763|Cache:url-failures-cache       - Disposing cache: [  name = cache status = STATUS_ALIVE eternal = false overflowToDisk = false maxElementsInMemory = 1000 maxElementsOnDisk = 0 memoryStoreEvictionPolicy = LRU timeToLiveSeconds = 1800 timeToIdleSeconds = 2700 diskPersistent = true diskExpiryThreadIntervalSeconds = 600 cacheEventListeners:  hitCount = 0 memoryStoreHitCount = 0 diskStoreHitCount = 0 missCountNotFound = 0 missCountExpired = 0 ]
DEBUG|main| 6783|Registry:commons-configuration - Creating a default configuration - no configuration was provided
DEBUG|main| 6793|Registry:commons-configuration - Creating a default configuration - no configuration was provided
DEBUG|main| 6822|CacheManager                   - Attempting to create an existing singleton. Existing singleton returned.
DEBUG|main| 6823|MemoryStore                    - Initialized net.sf.ehcache.store.LruMemoryStore for cache
DEBUG|main| 6823|LruMemoryStore                 - cache Cache: Using SpoolingLinkedHashMap implementation
DEBUG|main| 6823|Cache                          - Initialised cache: cache

.\ testGetChecksumCorrectSha1NoMd5() \._________________________________________

DEBUG|main| 6838|RepositoryProxyConnectors:default - Attempting connector: ProxyConnector[
  source:ArchivaRepository[default-managed-repository,file:/export/home/build/data/continuum/checkouts/282/target/test-repository/managed/]
  target:ArchivaRepository[proxied1,file:/export/home/build/data/continuum/checkouts/282/src/test/repositories/proxied1/]
  proxyId:null
  policy[releases]:ignored
  policy[snapshots]:ignored
  policy[cache-failures]:ignored
  policy[checksum]:ignored
]
DEBUG|main| 6841|RepositoryProxyConnectors:default - Using target repository: proxied1 - layout: default - targetPath: org/apache/maven/test/get-checksum-sha1-only/1.0/get-checksum-sha1-only-1.0.jar
DEBUG|main| 6842|RepositoryProxyConnectors:default - Applying [releases] policy with [ignored]
DEBUG|main| 6842|PreDownloadPolicy:releases     - OK to update, releases policy set to IGNORED.
DEBUG|main| 6842|RepositoryProxyConnectors:default - Applying [snapshots] policy with [ignored]
DEBUG|main| 6842|PreDownloadPolicy:snapshots    - OK to update, snapshots policy set to IGNORED.
DEBUG|main| 6844|RepositoryProxyConnectors:default - Applying [cache-failures] policy with [ignored]
DEBUG|main| 6844|PreDownloadPolicy:cache-failures - OK to fetch, check-failures policy set to IGNORED.
DEBUG|main| 6844|RepositoryProxyConnectors:default - Retrieving org/apache/maven/test/get-checksum-sha1-only/1.0/get-checksum-sha1-only-1.0.jar from Proxied Repository 1 if updated
DEBUG|main| 6845|RepositoryProxyConnectors:default - Downloaded successfully.
DEBUG|main| 6846|RepositoryProxyConnectors:default - Retrieving org/apache/maven/test/get-checksum-sha1-only/1.0/get-checksum-sha1-only-1.0.jar.sha1 from Proxied Repository 1 if updated
DEBUG|main| 6846|RepositoryProxyConnectors:default - Downloaded successfully.
DEBUG|main| 6847|RepositoryProxyConnectors:default - Checksum.sha1 Downloaded: /export/home/build/data/continuum/checkouts/282/target/test-repository/managed/org/apache/maven/test/get-checksum-sha1-only/1.0/get-checksum-sha1-only-1.0.jar.sha1
DEBUG|main| 6847|RepositoryProxyConnectors:default - Retrieving org/apache/maven/test/get-checksum-sha1-only/1.0/get-checksum-sha1-only-1.0.jar.md5 from Proxied Repository 1 if updated
 WARN|main| 6847|RepositoryProxyConnectors:default - Resource does not exist: File: /export/home/build/data/continuum/checkouts/282/src/test/repositories/proxied1/org/apache/maven/test/get-checksum-sha1-only/1.0/get-checksum-sha1-only-1.0.jar.md5 does not exist
DEBUG|main| 6847|RepositoryProxyConnectors:default - Checksum.md5 Not Download: File: /export/home/build/data/continuum/checkouts/282/src/test/repositories/proxied1/org/apache/maven/test/get-checksum-sha1-only/1.0/get-checksum-sha1-only-1.0.jar.md5 does not exist
DEBUG|main| 6847|RepositoryProxyConnectors:default - Applying [checksum] policy with [ignored]
 INFO|main| 6847|RepositoryProxyConnectors:default - Successfully transfered: /export/home/build/data/continuum/checkouts/282/target/test-repository/managed/org/apache/maven/test/get-checksum-sha1-only/1.0/get-checksum-sha1-only-1.0.jar
 INFO|main| 6848|Cache:url-failures-cache       - Disposing cache: [  name = cache status = STATUS_ALIVE eternal = false overflowToDisk = false maxElementsInMemory = 1000 maxElementsOnDisk = 0 memoryStoreEvictionPolicy = LRU timeToLiveSeconds = 1800 timeToIdleSeconds = 2700 diskPersistent = true diskExpiryThreadIntervalSeconds = 600 cacheEventListeners:  hitCount = 0 memoryStoreHitCount = 0 diskStoreHitCount = 0 missCountNotFound = 0 missCountExpired = 0 ]
DEBUG|main| 6878|Registry:commons-configuration - Creating a default configuration - no configuration was provided
DEBUG|main| 6889|Registry:commons-configuration - Creating a default configuration - no configuration was provided
DEBUG|main| 6910|CacheManager                   - Attempting to create an existing singleton. Existing singleton returned.
DEBUG|main| 6910|MemoryStore                    - Initialized net.sf.ehcache.store.LruMemoryStore for cache
DEBUG|main| 6911|LruMemoryStore                 - cache Cache: Using SpoolingLinkedHashMap implementation
DEBUG|main| 6911|Cache                          - Initialised cache: cache

.\ testGetChecksumNoSha1CorrectMd5() \._________________________________________

DEBUG|main| 6913|RepositoryProxyConnectors:default - Attempting connector: ProxyConnector[
  source:ArchivaRepository[default-managed-repository,file:/export/home/build/data/continuum/checkouts/282/target/test-repository/managed/]
  target:ArchivaRepository[proxied1,file:/export/home/build/data/continuum/checkouts/282/src/test/repositories/proxied1/]
  proxyId:null
  policy[releases]:ignored
  policy[snapshots]:ignored
  policy[cache-failures]:ignored
  policy[checksum]:ignored
]
DEBUG|main| 6914|RepositoryProxyConnectors:default - Using target repository: proxied1 - layout: default - targetPath: org/apache/maven/test/get-checksum-md5-only/1.0/get-checksum-md5-only-1.0.jar
DEBUG|main| 6914|RepositoryProxyConnectors:default - Applying [releases] policy with [ignored]
DEBUG|main| 6914|PreDownloadPolicy:releases     - OK to update, releases policy set to IGNORED.
DEBUG|main| 6914|RepositoryProxyConnectors:default - Applying [snapshots] policy with [ignored]
DEBUG|main| 6915|PreDownloadPolicy:snapshots    - OK to update, snapshots policy set to IGNORED.
DEBUG|main| 6915|RepositoryProxyConnectors:default - Applying [cache-failures] policy with [ignored]
DEBUG|main| 6915|PreDownloadPolicy:cache-failures - OK to fetch, check-failures policy set to IGNORED.
DEBUG|main| 6915|RepositoryProxyConnectors:default - Retrieving org/apache/maven/test/get-checksum-md5-only/1.0/get-checksum-md5-only-1.0.jar from Proxied Repository 1 if updated
DEBUG|main| 6916|RepositoryProxyConnectors:default - Downloaded successfully.
DEBUG|main| 6917|RepositoryProxyConnectors:default - Retrieving org/apache/maven/test/get-checksum-md5-only/1.0/get-checksum-md5-only-1.0.jar.sha1 from Proxied Repository 1 if updated
 WARN|main| 6918|RepositoryProxyConnectors:default - Resource does not exist: File: /export/home/build/data/continuum/checkouts/282/src/test/repositories/proxied1/org/apache/maven/test/get-checksum-md5-only/1.0/get-checksum-md5-only-1.0.jar.sha1 does not exist
DEBUG|main| 6918|RepositoryProxyConnectors:default - Checksum.sha1 Not Download: File: /export/home/build/data/continuum/checkouts/282/src/test/repositories/proxied1/org/apache/maven/test/get-checksum-md5-only/1.0/get-checksum-md5-only-1.0.jar.sha1 does not exist
DEBUG|main| 6918|RepositoryProxyConnectors:default - Retrieving org/apache/maven/test/get-checksum-md5-only/1.0/get-checksum-md5-only-1.0.jar.md5 from Proxied Repository 1 if updated
DEBUG|main| 6919|RepositoryProxyConnectors:default - Downloaded successfully.
DEBUG|main| 6919|RepositoryProxyConnectors:default - Checksum.md5 Downloaded: /export/home/build/data/continuum/checkouts/282/target/test-repository/managed/org/apache/maven/test/get-checksum-md5-only/1.0/get-checksum-md5-only-1.0.jar.md5
DEBUG|main| 6919|RepositoryProxyConnectors:default - Applying [checksum] policy with [ignored]
 INFO|main| 6920|RepositoryProxyConnectors:default - Successfully transfered: /export/home/build/data/continuum/checkouts/282/target/test-repository/managed/org/apache/maven/test/get-checksum-md5-only/1.0/get-checksum-md5-only-1.0.jar
 INFO|main| 6920|Cache:url-failures-cache       - Disposing cache: [  name = cache status = STATUS_ALIVE eternal = false overflowToDisk = false maxElementsInMemory = 1000 maxElementsOnDisk = 0 memoryStoreEvictionPolicy = LRU timeToLiveSeconds = 1800 timeToIdleSeconds = 2700 diskPersistent = true diskExpiryThreadIntervalSeconds = 600 cacheEventListeners:  hitCount = 0 memoryStoreHitCount = 0 diskStoreHitCount = 0 missCountNotFound = 0 missCountExpired = 0 ]
DEBUG|main| 6959|Registry:commons-configuration - Creating a default configuration - no configuration was provided
DEBUG|main| 6971|Registry:commons-configuration - Creating a default configuration - no configuration was provided
DEBUG|main| 7028|CacheManager                   - Attempting to create an existing singleton. Existing singleton returned.
DEBUG|main| 7028|MemoryStore                    - Initialized net.sf.ehcache.store.LruMemoryStore for cache
DEBUG|main| 7029|LruMemoryStore                 - cache Cache: Using SpoolingLinkedHashMap implementation
DEBUG|main| 7029|Cache                          - Initialised cache: cache

.\ testGetWithNoChecksumsUsingIgnoredSetting() \._________________________________________

DEBUG|main| 7031|RepositoryProxyConnectors:default - Attempting connector: ProxyConnector[
  source:ArchivaRepository[default-managed-repository,file:/export/home/build/data/continuum/checkouts/282/target/test-repository/managed/]
  target:ArchivaRepository[proxied1,file:/export/home/build/data/continuum/checkouts/282/src/test/repositories/proxied1/]
  proxyId:null
  policy[releases]:ignored
  policy[snapshots]:ignored
  policy[cache-failures]:ignored
  policy[checksum]:ignored
]
DEBUG|main| 7031|RepositoryProxyConnectors:default - Using target repository: proxied1 - layout: default - targetPath: org/apache/maven/test/get-default-layout/1.0/get-default-layout-1.0.jar
DEBUG|main| 7032|RepositoryProxyConnectors:default - Applying [releases] policy with [ignored]
DEBUG|main| 7032|PreDownloadPolicy:releases     - OK to update, releases policy set to IGNORED.
DEBUG|main| 7032|RepositoryProxyConnectors:default - Applying [snapshots] policy with [ignored]
DEBUG|main| 7032|PreDownloadPolicy:snapshots    - OK to update, snapshots policy set to IGNORED.
DEBUG|main| 7032|RepositoryProxyConnectors:default - Applying [cache-failures] policy with [ignored]
DEBUG|main| 7032|PreDownloadPolicy:cache-failures - OK to fetch, check-failures policy set to IGNORED.
DEBUG|main| 7033|RepositoryProxyConnectors:default - Retrieving org/apache/maven/test/get-default-layout/1.0/get-default-layout-1.0.jar from Proxied Repository 1 if updated
DEBUG|main| 7033|RepositoryProxyConnectors:default - Downloaded successfully.
DEBUG|main| 7035|RepositoryProxyConnectors:default - Retrieving org/apache/maven/test/get-default-layout/1.0/get-default-layout-1.0.jar.sha1 from Proxied Repository 1 if updated
 WARN|main| 7035|RepositoryProxyConnectors:default - Resource does not exist: File: /export/home/build/data/continuum/checkouts/282/src/test/repositories/proxied1/org/apache/maven/test/get-default-layout/1.0/get-default-layout-1.0.jar.sha1 does not exist
DEBUG|main| 7035|RepositoryProxyConnectors:default - Checksum.sha1 Not Download: File: /export/home/build/data/continuum/checkouts/282/src/test/repositories/proxied1/org/apache/maven/test/get-default-layout/1.0/get-default-layout-1.0.jar.sha1 does not exist
DEBUG|main| 7035|RepositoryProxyConnectors:default - Retrieving org/apache/maven/test/get-default-layout/1.0/get-default-layout-1.0.jar.md5 from Proxied Repository 1 if updated
 WARN|main| 7036|RepositoryProxyConnectors:default - Resource does not exist: File: /export/home/build/data/continuum/checkouts/282/src/test/repositories/proxied1/org/apache/maven/test/get-default-layout/1.0/get-default-layout-1.0.jar.md5 does not exist
DEBUG|main| 7036|RepositoryProxyConnectors:default - Checksum.md5 Not Download: File: /export/home/build/data/continuum/checkouts/282/src/test/repositories/proxied1/org/apache/maven/test/get-default-layout/1.0/get-default-layout-1.0.jar.md5 does not exist
DEBUG|main| 7036|RepositoryProxyConnectors:default - Applying [checksum] policy with [ignored]
 INFO|main| 7036|RepositoryProxyConnectors:default - Successfully transfered: /export/home/build/data/continuum/checkouts/282/target/test-repository/managed/org/apache/maven/test/get-default-layout/1.0/get-default-layout-1.0.jar
 INFO|main| 7037|Cache:url-failures-cache       - Disposing cache: [  name = cache status = STATUS_ALIVE eternal = false overflowToDisk = false maxElementsInMemory = 1000 maxElementsOnDisk = 0 memoryStoreEvictionPolicy = LRU timeToLiveSeconds = 1800 timeToIdleSeconds = 2700 diskPersistent = true diskExpiryThreadIntervalSeconds = 600 cacheEventListeners:  hitCount = 0 memoryStoreHitCount = 0 diskStoreHitCount = 0 missCountNotFound = 0 missCountExpired = 0 ]
DEBUG|main| 7063|Registry:commons-configuration - Creating a default configuration - no configuration was provided
DEBUG|main| 7073|Registry:commons-configuration - Creating a default configuration - no configuration was provided
DEBUG|main| 7106|CacheManager                   - Attempting to create an existing singleton. Existing singleton returned.
DEBUG|main| 7106|MemoryStore                    - Initialized net.sf.ehcache.store.LruMemoryStore for cache
DEBUG|main| 7106|LruMemoryStore                 - cache Cache: Using SpoolingLinkedHashMap implementation
DEBUG|main| 7107|Cache                          - Initialised cache: cache

.\ testGetChecksumBadSha1BadMd5IgnoredSetting() \._________________________________________

DEBUG|main| 7109|RepositoryProxyConnectors:default - Attempting connector: ProxyConnector[
  source:ArchivaRepository[default-managed-repository,file:/export/home/build/data/continuum/checkouts/282/target/test-repository/managed/]
  target:ArchivaRepository[proxied1,file:/export/home/build/data/continuum/checkouts/282/src/test/repositories/proxied1/]
  proxyId:null
  policy[releases]:ignored
  policy[snapshots]:ignored
  policy[cache-failures]:ignored
  policy[checksum]:ignored
]
DEBUG|main| 7109|RepositoryProxyConnectors:default - Using target repository: proxied1 - layout: default - targetPath: org/apache/maven/test/get-checksum-both-bad/1.0/get-checksum-both-bad-1.0.jar
DEBUG|main| 7110|RepositoryProxyConnectors:default - Applying [releases] policy with [ignored]
DEBUG|main| 7110|PreDownloadPolicy:releases     - OK to update, releases policy set to IGNORED.
DEBUG|main| 7110|RepositoryProxyConnectors:default - Applying [snapshots] policy with [ignored]
DEBUG|main| 7110|PreDownloadPolicy:snapshots    - OK to update, snapshots policy set to IGNORED.
DEBUG|main| 7110|RepositoryProxyConnectors:default - Applying [cache-failures] policy with [ignored]
DEBUG|main| 7110|PreDownloadPolicy:cache-failures - OK to fetch, check-failures policy set to IGNORED.
DEBUG|main| 7111|RepositoryProxyConnectors:default - Retrieving org/apache/maven/test/get-checksum-both-bad/1.0/get-checksum-both-bad-1.0.jar from Proxied Repository 1 if updated
DEBUG|main| 7112|RepositoryProxyConnectors:default - Downloaded successfully.
DEBUG|main| 7112|RepositoryProxyConnectors:default - Retrieving org/apache/maven/test/get-checksum-both-bad/1.0/get-checksum-both-bad-1.0.jar.sha1 from Proxied Repository 1 if updated
DEBUG|main| 7114|RepositoryProxyConnectors:default - Downloaded successfully.
DEBUG|main| 7121|RepositoryProxyConnectors:default - Checksum.sha1 Downloaded: /export/home/build/data/continuum/checkouts/282/target/test-repository/managed/org/apache/maven/test/get-checksum-both-bad/1.0/get-checksum-both-bad-1.0.jar.sha1
DEBUG|main| 7122|RepositoryProxyConnectors:default - Retrieving org/apache/maven/test/get-checksum-both-bad/1.0/get-checksum-both-bad-1.0.jar.md5 from Proxied Repository 1 if updated
DEBUG|main| 7123|RepositoryProxyConnectors:default - Downloaded successfully.
DEBUG|main| 7123|RepositoryProxyConnectors:default - Checksum.md5 Downloaded: /export/home/build/data/continuum/checkouts/282/target/test-repository/managed/org/apache/maven/test/get-checksum-both-bad/1.0/get-checksum-both-bad-1.0.jar.md5
DEBUG|main| 7124|RepositoryProxyConnectors:default - Applying [checksum] policy with [ignored]
 INFO|main| 7124|RepositoryProxyConnectors:default - Successfully transfered: /export/home/build/data/continuum/checkouts/282/target/test-repository/managed/org/apache/maven/test/get-checksum-both-bad/1.0/get-checksum-both-bad-1.0.jar
 INFO|main| 7126|Cache:url-failures-cache       - Disposing cache: [  name = cache status = STATUS_ALIVE eternal = false overflowToDisk = false maxElementsInMemory = 1000 maxElementsOnDisk = 0 memoryStoreEvictionPolicy = LRU timeToLiveSeconds = 1800 timeToIdleSeconds = 2700 diskPersistent = true diskExpiryThreadIntervalSeconds = 600 cacheEventListeners:  hitCount = 0 memoryStoreHitCount = 0 diskStoreHitCount = 0 missCountNotFound = 0 missCountExpired = 0 ]
DEBUG|main| 7152|Registry:commons-configuration - Creating a default configuration - no configuration was provided
DEBUG|main| 7162|Registry:commons-configuration - Creating a default configuration - no configuration was provided
DEBUG|main| 7202|CacheManager                   - Attempting to create an existing singleton. Existing singleton returned.
DEBUG|main| 7203|MemoryStore                    - Initialized net.sf.ehcache.store.LruMemoryStore for cache
DEBUG|main| 7203|LruMemoryStore                 - cache Cache: Using SpoolingLinkedHashMap implementation
DEBUG|main| 7203|Cache                          - Initialised cache: cache

.\ testGetChecksumBadSha1BadMd5FailSetting() \._________________________________________

DEBUG|main| 7207|RepositoryProxyConnectors:default - Attempting connector: ProxyConnector[
  source:ArchivaRepository[default-managed-repository,file:/export/home/build/data/continuum/checkouts/282/target/test-repository/managed/]
  target:ArchivaRepository[proxied1,file:/export/home/build/data/continuum/checkouts/282/src/test/repositories/proxied1/]
  proxyId:null
  policy[releases]:ignored
  policy[snapshots]:ignored
  policy[cache-failures]:ignored
  policy[checksum]:fail
]
DEBUG|main| 7208|RepositoryProxyConnectors:default - Using target repository: proxied1 - layout: default - targetPath: org/apache/maven/test/get-checksum-both-bad/1.0/get-checksum-both-bad-1.0.jar
DEBUG|main| 7208|RepositoryProxyConnectors:default - Applying [releases] policy with [ignored]
DEBUG|main| 7208|PreDownloadPolicy:releases     - OK to update, releases policy set to IGNORED.
DEBUG|main| 7208|RepositoryProxyConnectors:default - Applying [snapshots] policy with [ignored]
DEBUG|main| 7208|PreDownloadPolicy:snapshots    - OK to update, snapshots policy set to IGNORED.
DEBUG|main| 7209|RepositoryProxyConnectors:default - Applying [cache-failures] policy with [ignored]
DEBUG|main| 7209|PreDownloadPolicy:cache-failures - OK to fetch, check-failures policy set to IGNORED.
DEBUG|main| 7209|RepositoryProxyConnectors:default - Retrieving org/apache/maven/test/get-checksum-both-bad/1.0/get-checksum-both-bad-1.0.jar from Proxied Repository 1 if updated
DEBUG|main| 7209|RepositoryProxyConnectors:default - Downloaded successfully.
DEBUG|main| 7210|RepositoryProxyConnectors:default - Retrieving org/apache/maven/test/get-checksum-both-bad/1.0/get-checksum-both-bad-1.0.jar.sha1 from Proxied Repository 1 if updated
DEBUG|main| 7211|RepositoryProxyConnectors:default - Downloaded successfully.
DEBUG|main| 7211|RepositoryProxyConnectors:default - Checksum.sha1 Downloaded: /export/home/build/data/continuum/checkouts/282/target/test-repository/managed/org/apache/maven/test/get-checksum-both-bad/1.0/get-checksum-both-bad-1.0.jar.sha1
DEBUG|main| 7211|RepositoryProxyConnectors:default - Retrieving org/apache/maven/test/get-checksum-both-bad/1.0/get-checksum-both-bad-1.0.jar.md5 from Proxied Repository 1 if updated
DEBUG|main| 7212|RepositoryProxyConnectors:default - Downloaded successfully.
DEBUG|main| 7212|RepositoryProxyConnectors:default - Checksum.md5 Downloaded: /export/home/build/data/continuum/checkouts/282/target/test-repository/managed/org/apache/maven/test/get-checksum-both-bad/1.0/get-checksum-both-bad-1.0.jar.md5
DEBUG|main| 7212|RepositoryProxyConnectors:default - Applying [checksum] policy with [fail]
DEBUG|main| 7214|PostDownloadPolicy:checksum    - Not valid checksum: /export/home/build/data/continuum/checkouts/282/target/test-repository/managed/org/apache/maven/test/get-checksum-both-bad/1.0/get-checksum-both-bad-1.0.jar.sha1
 WARN|main| 7215|PostDownloadPolicy:checksum    - SHA1 is incorrect for /export/home/build/data/continuum/checkouts/282/target/test-repository/managed/org/apache/maven/test/get-checksum-both-bad/1.0/get-checksum-both-bad-1.0.jar
DEBUG|main| 7215|PostDownloadPolicy:checksum    - Not valid checksum: /export/home/build/data/continuum/checkouts/282/target/test-repository/managed/org/apache/maven/test/get-checksum-both-bad/1.0/get-checksum-both-bad-1.0.jar.md5
 WARN|main| 7216|PostDownloadPolicy:checksum    - MD5 is incorrect for /export/home/build/data/continuum/checkouts/282/target/test-repository/managed/org/apache/maven/test/get-checksum-both-bad/1.0/get-checksum-both-bad-1.0.jar
DEBUG|main| 7216|RepositoryProxyConnectors:default - Didn't pass the [checksum] policy.
 INFO|main| 7216|RepositoryProxyConnectors:default - Failed post-download policies - /export/home/build/data/continuum/checkouts/282/target/test-repository/managed/org/apache/maven/test/get-checksum-both-bad/1.0/get-checksum-both-bad-1.0.jar
 INFO|main| 7217|Cache:url-failures-cache       - Disposing cache: [  name = cache status = STATUS_ALIVE eternal = false overflowToDisk = false maxElementsInMemory = 1000 maxElementsOnDisk = 0 memoryStoreEvictionPolicy = LRU timeToLiveSeconds = 1800 timeToIdleSeconds = 2700 diskPersistent = true diskExpiryThreadIntervalSeconds = 600 cacheEventListeners:  hitCount = 0 memoryStoreHitCount = 0 diskStoreHitCount = 0 missCountNotFound = 0 missCountExpired = 0 ]
DEBUG|main| 7332|Registry:commons-configuration - Creating a default configuration - no configuration was provided
DEBUG|main| 7342|Registry:commons-configuration - Creating a default configuration - no configuration was provided
DEBUG|main| 7360|CacheManager                   - Attempting to create an existing singleton. Existing singleton returned.
DEBUG|main| 7361|MemoryStore                    - Initialized net.sf.ehcache.store.LruMemoryStore for cache
DEBUG|main| 7361|LruMemoryStore                 - cache Cache: Using SpoolingLinkedHashMap implementation
DEBUG|main| 7361|Cache                          - Initialised cache: cache

.\ testGetChecksumBadSha1BadMd5FixSetting() \._________________________________________

DEBUG|main| 7364|RepositoryProxyConnectors:default - Attempting connector: ProxyConnector[
  source:ArchivaRepository[default-managed-repository,file:/export/home/build/data/continuum/checkouts/282/target/test-repository/managed/]
  target:ArchivaRepository[proxied1,file:/export/home/build/data/continuum/checkouts/282/src/test/repositories/proxied1/]
  proxyId:null
  policy[releases]:ignored
  policy[snapshots]:ignored
  policy[cache-failures]:ignored
  policy[checksum]:fix
]
DEBUG|main| 7365|RepositoryProxyConnectors:default - Using target repository: proxied1 - layout: default - targetPath: org/apache/maven/test/get-checksum-both-bad/1.0/get-checksum-both-bad-1.0.jar
DEBUG|main| 7365|RepositoryProxyConnectors:default - Applying [releases] policy with [ignored]
DEBUG|main| 7365|PreDownloadPolicy:releases     - OK to update, releases policy set to IGNORED.
DEBUG|main| 7365|RepositoryProxyConnectors:default - Applying [snapshots] policy with [ignored]
DEBUG|main| 7365|PreDownloadPolicy:snapshots    - OK to update, snapshots policy set to IGNORED.
DEBUG|main| 7366|RepositoryProxyConnectors:default - Applying [cache-failures] policy with [ignored]
DEBUG|main| 7366|PreDownloadPolicy:cache-failures - OK to fetch, check-failures policy set to IGNORED.
DEBUG|main| 7366|RepositoryProxyConnectors:default - Retrieving org/apache/maven/test/get-checksum-both-bad/1.0/get-checksum-both-bad-1.0.jar from Proxied Repository 1 if updated
DEBUG|main| 7367|RepositoryProxyConnectors:default - Downloaded successfully.
DEBUG|main| 7367|RepositoryProxyConnectors:default - Retrieving org/apache/maven/test/get-checksum-both-bad/1.0/get-checksum-both-bad-1.0.jar.sha1 from Proxied Repository 1 if updated
DEBUG|main| 7368|RepositoryProxyConnectors:default - Downloaded successfully.
DEBUG|main| 7368|RepositoryProxyConnectors:default - Checksum.sha1 Downloaded: /export/home/build/data/continuum/checkouts/282/target/test-repository/managed/org/apache/maven/test/get-checksum-both-bad/1.0/get-checksum-both-bad-1.0.jar.sha1
DEBUG|main| 7369|RepositoryProxyConnectors:default - Retrieving org/apache/maven/test/get-checksum-both-bad/1.0/get-checksum-both-bad-1.0.jar.md5 from Proxied Repository 1 if updated
DEBUG|main| 7369|RepositoryProxyConnectors:default - Downloaded successfully.
DEBUG|main| 7370|RepositoryProxyConnectors:default - Checksum.md5 Downloaded: /export/home/build/data/continuum/checkouts/282/target/test-repository/managed/org/apache/maven/test/get-checksum-both-bad/1.0/get-checksum-both-bad-1.0.jar.md5
DEBUG|main| 7370|RepositoryProxyConnectors:default - Applying [checksum] policy with [fix]
DEBUG|main| 7371|PostDownloadPolicy:checksum    - Not valid checksum: /export/home/build/data/continuum/checkouts/282/target/test-repository/managed/org/apache/maven/test/get-checksum-both-bad/1.0/get-checksum-both-bad-1.0.jar.sha1
DEBUG|main| 7372|PostDownloadPolicy:checksum    - Not valid checksum: /export/home/build/data/continuum/checkouts/282/target/test-repository/managed/org/apache/maven/test/get-checksum-both-bad/1.0/get-checksum-both-bad-1.0.jar.md5
 INFO|main| 7373|RepositoryProxyConnectors:default - Successfully transfered: /export/home/build/data/continuum/checkouts/282/target/test-repository/managed/org/apache/maven/test/get-checksum-both-bad/1.0/get-checksum-both-bad-1.0.jar
 INFO|main| 7374|Cache:url-failures-cache       - Disposing cache: [  name = cache status = STATUS_ALIVE eternal = false overflowToDisk = false maxElementsInMemory = 1000 maxElementsOnDisk = 0 memoryStoreEvictionPolicy = LRU timeToLiveSeconds = 1800 timeToIdleSeconds = 2700 diskPersistent = true diskExpiryThreadIntervalSeconds = 600 cacheEventListeners:  hitCount = 0 memoryStoreHitCount = 0 diskStoreHitCount = 0 missCountNotFound = 0 missCountExpired = 0 ]
DEBUG|main| 7393|Registry:commons-configuration - Creating a default configuration - no configuration was provided
DEBUG|main| 7402|Registry:commons-configuration - Creating a default configuration - no configuration was provided
DEBUG|main| 7429|CacheManager                   - Attempting to create an existing singleton. Existing singleton returned.
DEBUG|main| 7430|MemoryStore                    - Initialized net.sf.ehcache.store.LruMemoryStore for cache
DEBUG|main| 7430|LruMemoryStore                 - cache Cache: Using SpoolingLinkedHashMap implementation
DEBUG|main| 7430|Cache                          - Initialised cache: cache

.\ testGetChecksumCorrectSha1BadMd5UsingFailSetting() \._________________________________________

DEBUG|main| 7432|RepositoryProxyConnectors:default - Attempting connector: ProxyConnector[
  source:ArchivaRepository[default-managed-repository,file:/export/home/build/data/continuum/checkouts/282/target/test-repository/managed/]
  target:ArchivaRepository[proxied1,file:/export/home/build/data/continuum/checkouts/282/src/test/repositories/proxied1/]
  proxyId:null
  policy[releases]:ignored
  policy[snapshots]:ignored
  policy[cache-failures]:ignored
  policy[checksum]:fail
]
DEBUG|main| 7433|RepositoryProxyConnectors:default - Using target repository: proxied1 - layout: default - targetPath: org/apache/maven/test/get-checksum-sha1-bad-md5/1.0/get-checksum-sha1-bad-md5-1.0.jar
DEBUG|main| 7433|RepositoryProxyConnectors:default - Applying [releases] policy with [ignored]
DEBUG|main| 7433|PreDownloadPolicy:releases     - OK to update, releases policy set to IGNORED.
DEBUG|main| 7433|RepositoryProxyConnectors:default - Applying [snapshots] policy with [ignored]
DEBUG|main| 7434|PreDownloadPolicy:snapshots    - OK to update, snapshots policy set to IGNORED.
DEBUG|main| 7434|RepositoryProxyConnectors:default - Applying [cache-failures] policy with [ignored]
DEBUG|main| 7434|PreDownloadPolicy:cache-failures - OK to fetch, check-failures policy set to IGNORED.
DEBUG|main| 7435|RepositoryProxyConnectors:default - Retrieving org/apache/maven/test/get-checksum-sha1-bad-md5/1.0/get-checksum-sha1-bad-md5-1.0.jar from Proxied Repository 1 if updated
DEBUG|main| 7530|RepositoryProxyConnectors:default - Downloaded successfully.
DEBUG|main| 7531|RepositoryProxyConnectors:default - Retrieving org/apache/maven/test/get-checksum-sha1-bad-md5/1.0/get-checksum-sha1-bad-md5-1.0.jar.sha1 from Proxied Repository 1 if updated
DEBUG|main| 7783|RepositoryProxyConnectors:default - Downloaded successfully.
DEBUG|main| 7784|RepositoryProxyConnectors:default - Checksum.sha1 Downloaded: /export/home/build/data/continuum/checkouts/282/target/test-repository/managed/org/apache/maven/test/get-checksum-sha1-bad-md5/1.0/get-checksum-sha1-bad-md5-1.0.jar.sha1
DEBUG|main| 7784|RepositoryProxyConnectors:default - Retrieving org/apache/maven/test/get-checksum-sha1-bad-md5/1.0/get-checksum-sha1-bad-md5-1.0.jar.md5 from Proxied Repository 1 if updated
DEBUG|main| 7785|RepositoryProxyConnectors:default - Downloaded successfully.
DEBUG|main| 7786|RepositoryProxyConnectors:default - Checksum.md5 Downloaded: /export/home/build/data/continuum/checkouts/282/target/test-repository/managed/org/apache/maven/test/get-checksum-sha1-bad-md5/1.0/get-checksum-sha1-bad-md5-1.0.jar.md5
DEBUG|main| 7786|RepositoryProxyConnectors:default - Applying [checksum] policy with [fail]
DEBUG|main| 7787|PostDownloadPolicy:checksum    - Valid checksum: /export/home/build/data/continuum/checkouts/282/target/test-repository/managed/org/apache/maven/test/get-checksum-sha1-bad-md5/1.0/get-checksum-sha1-bad-md5-1.0.jar.sha1
DEBUG|main| 7787|PostDownloadPolicy:checksum    - Not valid checksum: /export/home/build/data/continuum/checkouts/282/target/test-repository/managed/org/apache/maven/test/get-checksum-sha1-bad-md5/1.0/get-checksum-sha1-bad-md5-1.0.jar.md5
 WARN|main| 7787|PostDownloadPolicy:checksum    - MD5 is incorrect for /export/home/build/data/continuum/checkouts/282/target/test-repository/managed/org/apache/maven/test/get-checksum-sha1-bad-md5/1.0/get-checksum-sha1-bad-md5-1.0.jar
DEBUG|main| 7789|RepositoryProxyConnectors:default - Didn't pass the [checksum] policy.
 INFO|main| 7789|RepositoryProxyConnectors:default - Failed post-download policies - /export/home/build/data/continuum/checkouts/282/target/test-repository/managed/org/apache/maven/test/get-checksum-sha1-bad-md5/1.0/get-checksum-sha1-bad-md5-1.0.jar
 INFO|main| 7789|Cache:url-failures-cache       - Disposing cache: [  name = cache status = STATUS_ALIVE eternal = false overflowToDisk = false maxElementsInMemory = 1000 maxElementsOnDisk = 0 memoryStoreEvictionPolicy = LRU timeToLiveSeconds = 1800 timeToIdleSeconds = 2700 diskPersistent = true diskExpiryThreadIntervalSeconds = 600 cacheEventListeners:  hitCount = 0 memoryStoreHitCount = 0 diskStoreHitCount = 0 missCountNotFound = 0 missCountExpired = 0 ]
DEBUG|main| 7896|Registry:commons-configuration - Creating a default configuration - no configuration was provided
DEBUG|main| 7954|Registry:commons-configuration - Creating a default configuration - no configuration was provided
DEBUG|main| 7970|CacheManager                   - Attempting to create an existing singleton. Existing singleton returned.
DEBUG|main| 7971|MemoryStore                    - Initialized net.sf.ehcache.store.LruMemoryStore for cache
DEBUG|main| 7971|LruMemoryStore                 - cache Cache: Using SpoolingLinkedHashMap implementation
DEBUG|main| 7971|Cache                          - Initialised cache: cache

.\ testGetChecksumNoSha1CorrectMd5UsingFailSetting() \._________________________________________

DEBUG|main| 7974|RepositoryProxyConnectors:default - Attempting connector: ProxyConnector[
  source:ArchivaRepository[default-managed-repository,file:/export/home/build/data/continuum/checkouts/282/target/test-repository/managed/]
  target:ArchivaRepository[proxied1,file:/export/home/build/data/continuum/checkouts/282/src/test/repositories/proxied1/]
  proxyId:null
  policy[releases]:ignored
  policy[snapshots]:ignored
  policy[cache-failures]:ignored
  policy[checksum]:fail
]
DEBUG|main| 7975|RepositoryProxyConnectors:default - Using target repository: proxied1 - layout: default - targetPath: org/apache/maven/test/get-checksum-md5-only/1.0/get-checksum-md5-only-1.0.jar
DEBUG|main| 7975|RepositoryProxyConnectors:default - Applying [releases] policy with [ignored]
DEBUG|main| 7975|PreDownloadPolicy:releases     - OK to update, releases policy set to IGNORED.
DEBUG|main| 7976|RepositoryProxyConnectors:default - Applying [snapshots] policy with [ignored]
DEBUG|main| 7976|PreDownloadPolicy:snapshots    - OK to update, snapshots policy set to IGNORED.
DEBUG|main| 7976|RepositoryProxyConnectors:default - Applying [cache-failures] policy with [ignored]
DEBUG|main| 7976|PreDownloadPolicy:cache-failures - OK to fetch, check-failures policy set to IGNORED.
DEBUG|main| 7976|RepositoryProxyConnectors:default - Retrieving org/apache/maven/test/get-checksum-md5-only/1.0/get-checksum-md5-only-1.0.jar from Proxied Repository 1 if updated
DEBUG|main| 7977|RepositoryProxyConnectors:default - Downloaded successfully.
DEBUG|main| 7978|RepositoryProxyConnectors:default - Retrieving org/apache/maven/test/get-checksum-md5-only/1.0/get-checksum-md5-only-1.0.jar.sha1 from Proxied Repository 1 if updated
 WARN|main| 7978|RepositoryProxyConnectors:default - Resource does not exist: File: /export/home/build/data/continuum/checkouts/282/src/test/repositories/proxied1/org/apache/maven/test/get-checksum-md5-only/1.0/get-checksum-md5-only-1.0.jar.sha1 does not exist
DEBUG|main| 7978|RepositoryProxyConnectors:default - Checksum.sha1 Not Download: File: /export/home/build/data/continuum/checkouts/282/src/test/repositories/proxied1/org/apache/maven/test/get-checksum-md5-only/1.0/get-checksum-md5-only-1.0.jar.sha1 does not exist
DEBUG|main| 7978|RepositoryProxyConnectors:default - Retrieving org/apache/maven/test/get-checksum-md5-only/1.0/get-checksum-md5-only-1.0.jar.md5 from Proxied Repository 1 if updated
DEBUG|main| 7979|RepositoryProxyConnectors:default - Downloaded successfully.
DEBUG|main| 7979|RepositoryProxyConnectors:default - Checksum.md5 Downloaded: /export/home/build/data/continuum/checkouts/282/target/test-repository/managed/org/apache/maven/test/get-checksum-md5-only/1.0/get-checksum-md5-only-1.0.jar.md5
DEBUG|main| 7979|RepositoryProxyConnectors:default - Applying [checksum] policy with [fail]
DEBUG|main| 7980|PostDownloadPolicy:checksum    - Valid checksum: /export/home/build/data/continuum/checkouts/282/target/test-repository/managed/org/apache/maven/test/get-checksum-md5-only/1.0/get-checksum-md5-only-1.0.jar.md5
 INFO|main| 7980|RepositoryProxyConnectors:default - Successfully transfered: /export/home/build/data/continuum/checkouts/282/target/test-repository/managed/org/apache/maven/test/get-checksum-md5-only/1.0/get-checksum-md5-only-1.0.jar
 INFO|main| 7981|Cache:url-failures-cache       - Disposing cache: [  name = cache status = STATUS_ALIVE eternal = false overflowToDisk = false maxElementsInMemory = 1000 maxElementsOnDisk = 0 memoryStoreEvictionPolicy = LRU timeToLiveSeconds = 1800 timeToIdleSeconds = 2700 diskPersistent = true diskExpiryThreadIntervalSeconds = 600 cacheEventListeners:  hitCount = 0 memoryStoreHitCount = 0 diskStoreHitCount = 0 missCountNotFound = 0 missCountExpired = 0 ]
DEBUG|main| 8078|Registry:commons-configuration - Creating a default configuration - no configuration was provided
DEBUG|main| 8097|Registry:commons-configuration - Creating a default configuration - no configuration was provided
DEBUG|main| 8146|CacheManager                   - Attempting to create an existing singleton. Existing singleton returned.
DEBUG|main| 8146|MemoryStore                    - Initialized net.sf.ehcache.store.LruMemoryStore for cache
DEBUG|main| 8147|LruMemoryStore                 - cache Cache: Using SpoolingLinkedHashMap implementation
DEBUG|main| 8147|Cache                          - Initialised cache: cache

.\ testGetWithNoChecksumsUsingFailSetting() \._________________________________________

DEBUG|main| 8150|RepositoryProxyConnectors:default - Attempting connector: ProxyConnector[
  source:ArchivaRepository[default-managed-repository,file:/export/home/build/data/continuum/checkouts/282/target/test-repository/managed/]
  target:ArchivaRepository[proxied1,file:/export/home/build/data/continuum/checkouts/282/src/test/repositories/proxied1/]
  proxyId:null
  policy[releases]:ignored
  policy[snapshots]:ignored
  policy[cache-failures]:ignored
  policy[checksum]:fail
]
DEBUG|main| 8150|RepositoryProxyConnectors:default - Using target repository: proxied1 - layout: default - targetPath: org/apache/maven/test/get-default-layout/1.0/get-default-layout-1.0.jar
DEBUG|main| 8155|RepositoryProxyConnectors:default - Applying [releases] policy with [ignored]
DEBUG|main| 8155|PreDownloadPolicy:releases     - OK to update, releases policy set to IGNORED.
DEBUG|main| 8156|RepositoryProxyConnectors:default - Applying [snapshots] policy with [ignored]
DEBUG|main| 8156|PreDownloadPolicy:snapshots    - OK to update, snapshots policy set to IGNORED.
DEBUG|main| 8156|RepositoryProxyConnectors:default - Applying [cache-failures] policy with [ignored]
DEBUG|main| 8156|PreDownloadPolicy:cache-failures - OK to fetch, check-failures policy set to IGNORED.
DEBUG|main| 8165|RepositoryProxyConnectors:default - Retrieving org/apache/maven/test/get-default-layout/1.0/get-default-layout-1.0.jar from Proxied Repository 1 if updated
DEBUG|main| 8233|RepositoryProxyConnectors:default - Downloaded successfully.
DEBUG|main| 8234|RepositoryProxyConnectors:default - Retrieving org/apache/maven/test/get-default-layout/1.0/get-default-layout-1.0.jar.sha1 from Proxied Repository 1 if updated
 WARN|main| 8234|RepositoryProxyConnectors:default - Resource does not exist: File: /export/home/build/data/continuum/checkouts/282/src/test/repositories/proxied1/org/apache/maven/test/get-default-layout/1.0/get-default-layout-1.0.jar.sha1 does not exist
DEBUG|main| 8234|RepositoryProxyConnectors:default - Checksum.sha1 Not Download: File: /export/home/build/data/continuum/checkouts/282/src/test/repositories/proxied1/org/apache/maven/test/get-default-layout/1.0/get-default-layout-1.0.jar.sha1 does not exist
DEBUG|main| 8235|RepositoryProxyConnectors:default - Retrieving org/apache/maven/test/get-default-layout/1.0/get-default-layout-1.0.jar.md5 from Proxied Repository 1 if updated
 WARN|main| 8235|RepositoryProxyConnectors:default - Resource does not exist: File: /export/home/build/data/continuum/checkouts/282/src/test/repositories/proxied1/org/apache/maven/test/get-default-layout/1.0/get-default-layout-1.0.jar.md5 does not exist
DEBUG|main| 8235|RepositoryProxyConnectors:default - Checksum.md5 Not Download: File: /export/home/build/data/continuum/checkouts/282/src/test/repositories/proxied1/org/apache/maven/test/get-default-layout/1.0/get-default-layout-1.0.jar.md5 does not exist
DEBUG|main| 8235|RepositoryProxyConnectors:default - Applying [checksum] policy with [fail]
ERROR|main| 8235|PostDownloadPolicy:checksum    - File /export/home/build/data/continuum/checkouts/282/target/test-repository/managed/org/apache/maven/test/get-default-layout/1.0/get-default-layout-1.0.jar has no checksum files (sha1 or md5).
DEBUG|main| 8236|RepositoryProxyConnectors:default - Didn't pass the [checksum] policy.
 INFO|main| 8236|RepositoryProxyConnectors:default - Failed post-download policies - /export/home/build/data/continuum/checkouts/282/target/test-repository/managed/org/apache/maven/test/get-default-layout/1.0/get-default-layout-1.0.jar
 INFO|main| 8236|Cache:url-failures-cache       - Disposing cache: [  name = cache status = STATUS_ALIVE eternal = false overflowToDisk = false maxElementsInMemory = 1000 maxElementsOnDisk = 0 memoryStoreEvictionPolicy = LRU timeToLiveSeconds = 1800 timeToIdleSeconds = 2700 diskPersistent = true diskExpiryThreadIntervalSeconds = 600 cacheEventListeners:  hitCount = 0 memoryStoreHitCount = 0 diskStoreHitCount = 0 missCountNotFound = 0 missCountExpired = 0 ]
DEBUG|main| 8255|Registry:commons-configuration - Creating a default configuration - no configuration was provided
DEBUG|main| 8263|Registry:commons-configuration - Creating a default configuration - no configuration was provided
DEBUG|main| 8281|CacheManager                   - Attempting to create an existing singleton. Existing singleton returned.
DEBUG|main| 8281|MemoryStore                    - Initialized net.sf.ehcache.store.LruMemoryStore for cache
DEBUG|main| 8281|LruMemoryStore                 - cache Cache: Using SpoolingLinkedHashMap implementation
DEBUG|main| 8281|Cache                          - Initialised cache: cache

.\ testGetChecksumCorrectSha1BadMd5UsingIgnoredSetting() \._________________________________________

DEBUG|main| 8285|RepositoryProxyConnectors:default - Attempting connector: ProxyConnector[
  source:ArchivaRepository[default-managed-repository,file:/export/home/build/data/continuum/checkouts/282/target/test-repository/managed/]
  target:ArchivaRepository[proxied1,file:/export/home/build/data/continuum/checkouts/282/src/test/repositories/proxied1/]
  proxyId:null
  policy[releases]:ignored
  policy[snapshots]:ignored
  policy[cache-failures]:ignored
  policy[checksum]:ignored
]
DEBUG|main| 8286|RepositoryProxyConnectors:default - Using target repository: proxied1 - layout: default - targetPath: org/apache/maven/test/get-checksum-sha1-bad-md5/1.0/get-checksum-sha1-bad-md5-1.0.jar
DEBUG|main| 8286|RepositoryProxyConnectors:default - Applying [releases] policy with [ignored]
DEBUG|main| 8286|PreDownloadPolicy:releases     - OK to update, releases policy set to IGNORED.
DEBUG|main| 8286|RepositoryProxyConnectors:default - Applying [snapshots] policy with [ignored]
DEBUG|main| 8286|PreDownloadPolicy:snapshots    - OK to update, snapshots policy set to IGNORED.
DEBUG|main| 8287|RepositoryProxyConnectors:default - Applying [cache-failures] policy with [ignored]
DEBUG|main| 8287|PreDownloadPolicy:cache-failures - OK to fetch, check-failures policy set to IGNORED.
DEBUG|main| 8287|RepositoryProxyConnectors:default - Retrieving org/apache/maven/test/get-checksum-sha1-bad-md5/1.0/get-checksum-sha1-bad-md5-1.0.jar from Proxied Repository 1 if updated
DEBUG|main| 8288|RepositoryProxyConnectors:default - Downloaded successfully.
DEBUG|main| 8288|RepositoryProxyConnectors:default - Retrieving org/apache/maven/test/get-checksum-sha1-bad-md5/1.0/get-checksum-sha1-bad-md5-1.0.jar.sha1 from Proxied Repository 1 if updated
DEBUG|main| 8289|RepositoryProxyConnectors:default - Downloaded successfully.
DEBUG|main| 8289|RepositoryProxyConnectors:default - Checksum.sha1 Downloaded: /export/home/build/data/continuum/checkouts/282/target/test-repository/managed/org/apache/maven/test/get-checksum-sha1-bad-md5/1.0/get-checksum-sha1-bad-md5-1.0.jar.sha1
DEBUG|main| 8289|RepositoryProxyConnectors:default - Retrieving org/apache/maven/test/get-checksum-sha1-bad-md5/1.0/get-checksum-sha1-bad-md5-1.0.jar.md5 from Proxied Repository 1 if updated
DEBUG|main| 8290|RepositoryProxyConnectors:default - Downloaded successfully.
DEBUG|main| 8290|RepositoryProxyConnectors:default - Checksum.md5 Downloaded: /export/home/build/data/continuum/checkouts/282/target/test-repository/managed/org/apache/maven/test/get-checksum-sha1-bad-md5/1.0/get-checksum-sha1-bad-md5-1.0.jar.md5
DEBUG|main| 8291|RepositoryProxyConnectors:default - Applying [checksum] policy with [ignored]
 INFO|main| 8291|RepositoryProxyConnectors:default - Successfully transfered: /export/home/build/data/continuum/checkouts/282/target/test-repository/managed/org/apache/maven/test/get-checksum-sha1-bad-md5/1.0/get-checksum-sha1-bad-md5-1.0.jar
 INFO|main| 8292|Cache:url-failures-cache       - Disposing cache: [  name = cache status = STATUS_ALIVE eternal = false overflowToDisk = false maxElementsInMemory = 1000 maxElementsOnDisk = 0 memoryStoreEvictionPolicy = LRU timeToLiveSeconds = 1800 timeToIdleSeconds = 2700 diskPersistent = true diskExpiryThreadIntervalSeconds = 600 cacheEventListeners:  hitCount = 0 memoryStoreHitCount = 0 diskStoreHitCount = 0 missCountNotFound = 0 missCountExpired = 0 ]
DEBUG|main| 8552|Registry:commons-configuration - Creating a default configuration - no configuration was provided
DEBUG|main| 8616|Registry:commons-configuration - Creating a default configuration - no configuration was provided
DEBUG|main| 8718|CacheManager                   - Attempting to create an existing singleton. Existing singleton returned.
DEBUG|main| 8718|MemoryStore                    - Initialized net.sf.ehcache.store.LruMemoryStore for cache
DEBUG|main| 8718|LruMemoryStore                 - cache Cache: Using SpoolingLinkedHashMap implementation
DEBUG|main| 8719|Cache                          - Initialised cache: cache

.\ testGetChecksumCorrectSha1BadMd5UsingFixSetting() \._________________________________________

DEBUG|main| 8722|RepositoryProxyConnectors:default - Attempting connector: ProxyConnector[
  source:ArchivaRepository[default-managed-repository,file:/export/home/build/data/continuum/checkouts/282/target/test-repository/managed/]
  target:ArchivaRepository[proxied1,file:/export/home/build/data/continuum/checkouts/282/src/test/repositories/proxied1/]
  proxyId:null
  policy[releases]:ignored
  policy[snapshots]:ignored
  policy[cache-failures]:ignored
  policy[checksum]:fix
]
DEBUG|main| 8723|RepositoryProxyConnectors:default - Using target repository: proxied1 - layout: default - targetPath: org/apache/maven/test/get-checksum-sha1-bad-md5/1.0/get-checksum-sha1-bad-md5-1.0.jar
DEBUG|main| 8723|RepositoryProxyConnectors:default - Applying [releases] policy with [ignored]
DEBUG|main| 8723|PreDownloadPolicy:releases     - OK to update, releases policy set to IGNORED.
DEBUG|main| 8723|RepositoryProxyConnectors:default - Applying [snapshots] policy with [ignored]
DEBUG|main| 8723|PreDownloadPolicy:snapshots    - OK to update, snapshots policy set to IGNORED.
DEBUG|main| 8724|RepositoryProxyConnectors:default - Applying [cache-failures] policy with [ignored]
DEBUG|main| 8724|PreDownloadPolicy:cache-failures - OK to fetch, check-failures policy set to IGNORED.
DEBUG|main| 8724|RepositoryProxyConnectors:default - Retrieving org/apache/maven/test/get-checksum-sha1-bad-md5/1.0/get-checksum-sha1-bad-md5-1.0.jar from Proxied Repository 1 if updated
DEBUG|main| 8725|RepositoryProxyConnectors:default - Downloaded successfully.
DEBUG|main| 8725|RepositoryProxyConnectors:default - Retrieving org/apache/maven/test/get-checksum-sha1-bad-md5/1.0/get-checksum-sha1-bad-md5-1.0.jar.sha1 from Proxied Repository 1 if updated
DEBUG|main| 8726|RepositoryProxyConnectors:default - Downloaded successfully.
DEBUG|main| 8726|RepositoryProxyConnectors:default - Checksum.sha1 Downloaded: /export/home/build/data/continuum/checkouts/282/target/test-repository/managed/org/apache/maven/test/get-checksum-sha1-bad-md5/1.0/get-checksum-sha1-bad-md5-1.0.jar.sha1
DEBUG|main| 8726|RepositoryProxyConnectors:default - Retrieving org/apache/maven/test/get-checksum-sha1-bad-md5/1.0/get-checksum-sha1-bad-md5-1.0.jar.md5 from Proxied Repository 1 if updated
DEBUG|main| 8727|RepositoryProxyConnectors:default - Downloaded successfully.
DEBUG|main| 8727|RepositoryProxyConnectors:default - Checksum.md5 Downloaded: /export/home/build/data/continuum/checkouts/282/target/test-repository/managed/org/apache/maven/test/get-checksum-sha1-bad-md5/1.0/get-checksum-sha1-bad-md5-1.0.jar.md5
DEBUG|main| 8728|RepositoryProxyConnectors:default - Applying [checksum] policy with [fix]
DEBUG|main| 8728|PostDownloadPolicy:checksum    - Valid checksum: /export/home/build/data/continuum/checkouts/282/target/test-repository/managed/org/apache/maven/test/get-checksum-sha1-bad-md5/1.0/get-checksum-sha1-bad-md5-1.0.jar.sha1
DEBUG|main| 8729|PostDownloadPolicy:checksum    - Not valid checksum: /export/home/build/data/continuum/checkouts/282/target/test-repository/managed/org/apache/maven/test/get-checksum-sha1-bad-md5/1.0/get-checksum-sha1-bad-md5-1.0.jar.md5
 INFO|main| 8730|RepositoryProxyConnectors:default - Successfully transfered: /export/home/build/data/continuum/checkouts/282/target/test-repository/managed/org/apache/maven/test/get-checksum-sha1-bad-md5/1.0/get-checksum-sha1-bad-md5-1.0.jar
 INFO|main| 8731|Cache:url-failures-cache       - Disposing cache: [  name = cache status = STATUS_ALIVE eternal = false overflowToDisk = false maxElementsInMemory = 1000 maxElementsOnDisk = 0 memoryStoreEvictionPolicy = LRU timeToLiveSeconds = 1800 timeToIdleSeconds = 2700 diskPersistent = true diskExpiryThreadIntervalSeconds = 600 cacheEventListeners:  hitCount = 0 memoryStoreHitCount = 0 diskStoreHitCount = 0 missCountNotFound = 0 missCountExpired = 0 ]
DEBUG|main| 8761|Registry:commons-configuration - Creating a default configuration - no configuration was provided
DEBUG|main| 8771|Registry:commons-configuration - Creating a default configuration - no configuration was provided
DEBUG|main| 8853|CacheManager                   - Attempting to create an existing singleton. Existing singleton returned.
DEBUG|main| 8856|MemoryStore                    - Initialized net.sf.ehcache.store.LruMemoryStore for cache
DEBUG|main| 8856|LruMemoryStore                 - cache Cache: Using SpoolingLinkedHashMap implementation
DEBUG|main| 8856|Cache                          - Initialised cache: cache

.\ testGetChecksumNoSha1CorrectMd5UsingFixSetting() \._________________________________________

DEBUG|main| 8859|RepositoryProxyConnectors:default - Attempting connector: ProxyConnector[
  source:ArchivaRepository[default-managed-repository,file:/export/home/build/data/continuum/checkouts/282/target/test-repository/managed/]
  target:ArchivaRepository[proxied1,file:/export/home/build/data/continuum/checkouts/282/src/test/repositories/proxied1/]
  proxyId:null
  policy[releases]:ignored
  policy[snapshots]:ignored
  policy[cache-failures]:ignored
  policy[checksum]:fix
]
DEBUG|main| 8860|RepositoryProxyConnectors:default - Using target repository: proxied1 - layout: default - targetPath: org/apache/maven/test/get-checksum-md5-only/1.0/get-checksum-md5-only-1.0.jar
DEBUG|main| 8861|RepositoryProxyConnectors:default - Applying [releases] policy with [ignored]
DEBUG|main| 8861|PreDownloadPolicy:releases     - OK to update, releases policy set to IGNORED.
DEBUG|main| 8861|RepositoryProxyConnectors:default - Applying [snapshots] policy with [ignored]
DEBUG|main| 8861|PreDownloadPolicy:snapshots    - OK to update, snapshots policy set to IGNORED.
DEBUG|main| 8861|RepositoryProxyConnectors:default - Applying [cache-failures] policy with [ignored]
DEBUG|main| 8861|PreDownloadPolicy:cache-failures - OK to fetch, check-failures policy set to IGNORED.
DEBUG|main| 8862|RepositoryProxyConnectors:default - Retrieving org/apache/maven/test/get-checksum-md5-only/1.0/get-checksum-md5-only-1.0.jar from Proxied Repository 1 if updated
DEBUG|main| 8862|RepositoryProxyConnectors:default - Downloaded successfully.
DEBUG|main| 8863|RepositoryProxyConnectors:default - Retrieving org/apache/maven/test/get-checksum-md5-only/1.0/get-checksum-md5-only-1.0.jar.sha1 from Proxied Repository 1 if updated
 WARN|main| 8863|RepositoryProxyConnectors:default - Resource does not exist: File: /export/home/build/data/continuum/checkouts/282/src/test/repositories/proxied1/org/apache/maven/test/get-checksum-md5-only/1.0/get-checksum-md5-only-1.0.jar.sha1 does not exist
DEBUG|main| 8863|RepositoryProxyConnectors:default - Checksum.sha1 Not Download: File: /export/home/build/data/continuum/checkouts/282/src/test/repositories/proxied1/org/apache/maven/test/get-checksum-md5-only/1.0/get-checksum-md5-only-1.0.jar.sha1 does not exist
DEBUG|main| 8863|RepositoryProxyConnectors:default - Retrieving org/apache/maven/test/get-checksum-md5-only/1.0/get-checksum-md5-only-1.0.jar.md5 from Proxied Repository 1 if updated
DEBUG|main| 8868|RepositoryProxyConnectors:default - Downloaded successfully.
DEBUG|main| 8869|RepositoryProxyConnectors:default - Checksum.md5 Downloaded: /export/home/build/data/continuum/checkouts/282/target/test-repository/managed/org/apache/maven/test/get-checksum-md5-only/1.0/get-checksum-md5-only-1.0.jar.md5
DEBUG|main| 8870|RepositoryProxyConnectors:default - Applying [checksum] policy with [fix]
DEBUG|main| 8871|PostDownloadPolicy:checksum    - Valid checksum: /export/home/build/data/continuum/checkouts/282/target/test-repository/managed/org/apache/maven/test/get-checksum-md5-only/1.0/get-checksum-md5-only-1.0.jar.md5
 INFO|main| 8871|RepositoryProxyConnectors:default - Successfully transfered: /export/home/build/data/continuum/checkouts/282/target/test-repository/managed/org/apache/maven/test/get-checksum-md5-only/1.0/get-checksum-md5-only-1.0.jar
 INFO|main| 8872|Cache:url-failures-cache       - Disposing cache: [  name = cache status = STATUS_ALIVE eternal = false overflowToDisk = false maxElementsInMemory = 1000 maxElementsOnDisk = 0 memoryStoreEvictionPolicy = LRU timeToLiveSeconds = 1800 timeToIdleSeconds = 2700 diskPersistent = true diskExpiryThreadIntervalSeconds = 600 cacheEventListeners:  hitCount = 0 memoryStoreHitCount = 0 diskStoreHitCount = 0 missCountNotFound = 0 missCountExpired = 0 ]
DEBUG|main| 8900|Registry:commons-configuration - Creating a default configuration - no configuration was provided
DEBUG|main| 8909|Registry:commons-configuration - Creating a default configuration - no configuration was provided
DEBUG|main| 8927|CacheManager                   - Attempting to create an existing singleton. Existing singleton returned.
DEBUG|main| 8927|MemoryStore                    - Initialized net.sf.ehcache.store.LruMemoryStore for cache
DEBUG|main| 8928|LruMemoryStore                 - cache Cache: Using SpoolingLinkedHashMap implementation
DEBUG|main| 8928|Cache                          - Initialised cache: cache

.\ testGetWithNoChecksumsUsingFixSetting() \._________________________________________

DEBUG|main| 8930|RepositoryProxyConnectors:default - Attempting connector: ProxyConnector[
  source:ArchivaRepository[default-managed-repository,file:/export/home/build/data/continuum/checkouts/282/target/test-repository/managed/]
  target:ArchivaRepository[proxied1,file:/export/home/build/data/continuum/checkouts/282/src/test/repositories/proxied1/]
  proxyId:null
  policy[releases]:ignored
  policy[snapshots]:ignored
  policy[cache-failures]:ignored
  policy[checksum]:fix
]
DEBUG|main| 8931|RepositoryProxyConnectors:default - Using target repository: proxied1 - layout: default - targetPath: org/apache/maven/test/get-default-layout/1.0/get-default-layout-1.0.jar
DEBUG|main| 8931|RepositoryProxyConnectors:default - Applying [releases] policy with [ignored]
DEBUG|main| 8931|PreDownloadPolicy:releases     - OK to update, releases policy set to IGNORED.
DEBUG|main| 8931|RepositoryProxyConnectors:default - Applying [snapshots] policy with [ignored]
DEBUG|main| 8931|PreDownloadPolicy:snapshots    - OK to update, snapshots policy set to IGNORED.
DEBUG|main| 8932|RepositoryProxyConnectors:default - Applying [cache-failures] policy with [ignored]
DEBUG|main| 8932|PreDownloadPolicy:cache-failures - OK to fetch, check-failures policy set to IGNORED.
DEBUG|main| 8932|RepositoryProxyConnectors:default - Retrieving org/apache/maven/test/get-default-layout/1.0/get-default-layout-1.0.jar from Proxied Repository 1 if updated
DEBUG|main| 8933|RepositoryProxyConnectors:default - Downloaded successfully.
DEBUG|main| 8933|RepositoryProxyConnectors:default - Retrieving org/apache/maven/test/get-default-layout/1.0/get-default-layout-1.0.jar.sha1 from Proxied Repository 1 if updated
 WARN|main| 8934|RepositoryProxyConnectors:default - Resource does not exist: File: /export/home/build/data/continuum/checkouts/282/src/test/repositories/proxied1/org/apache/maven/test/get-default-layout/1.0/get-default-layout-1.0.jar.sha1 does not exist
DEBUG|main| 8934|RepositoryProxyConnectors:default - Checksum.sha1 Not Download: File: /export/home/build/data/continuum/checkouts/282/src/test/repositories/proxied1/org/apache/maven/test/get-default-layout/1.0/get-default-layout-1.0.jar.sha1 does not exist
DEBUG|main| 8935|RepositoryProxyConnectors:default - Retrieving org/apache/maven/test/get-default-layout/1.0/get-default-layout-1.0.jar.md5 from Proxied Repository 1 if updated
 WARN|main| 8935|RepositoryProxyConnectors:default - Resource does not exist: File: /export/home/build/data/continuum/checkouts/282/src/test/repositories/proxied1/org/apache/maven/test/get-default-layout/1.0/get-default-layout-1.0.jar.md5 does not exist
DEBUG|main| 8935|RepositoryProxyConnectors:default - Checksum.md5 Not Download: File: /export/home/build/data/continuum/checkouts/282/src/test/repositories/proxied1/org/apache/maven/test/get-default-layout/1.0/get-default-layout-1.0.jar.md5 does not exist
DEBUG|main| 8935|RepositoryProxyConnectors:default - Applying [checksum] policy with [fix]
 INFO|main| 8936|RepositoryProxyConnectors:default - Successfully transfered: /export/home/build/data/continuum/checkouts/282/target/test-repository/managed/org/apache/maven/test/get-default-layout/1.0/get-default-layout-1.0.jar
 INFO|main| 8937|Cache:url-failures-cache       - Disposing cache: [  name = cache status = STATUS_ALIVE eternal = false overflowToDisk = false maxElementsInMemory = 1000 maxElementsOnDisk = 0 memoryStoreEvictionPolicy = LRU timeToLiveSeconds = 1800 timeToIdleSeconds = 2700 diskPersistent = true diskExpiryThreadIntervalSeconds = 600 cacheEventListeners:  hitCount = 0 memoryStoreHitCount = 0 diskStoreHitCount = 0 missCountNotFound = 0 missCountExpired = 0 ]
DEBUG|main| 8955|Registry:commons-configuration - Creating a default configuration - no configuration was provided
DEBUG|main| 8965|Registry:commons-configuration - Creating a default configuration - no configuration was provided
DEBUG|main| 8982|CacheManager                   - Attempting to create an existing singleton. Existing singleton returned.
DEBUG|main| 8983|MemoryStore                    - Initialized net.sf.ehcache.store.LruMemoryStore for cache
DEBUG|main| 8983|LruMemoryStore                 - cache Cache: Using SpoolingLinkedHashMap implementation
DEBUG|main| 8983|Cache                          - Initialised cache: cache

.\ testGetChecksumTransferFailed() \._________________________________________

DEBUG|main| 8995|RepositoryProxyConnectors:default - Attempting connector: ProxyConnector[
  source:ArchivaRepository[default-managed-repository,file:/export/home/build/data/continuum/checkouts/282/target/test-repository/managed/]
  target:ArchivaRepository[badproxied,test://bad.machine.com/repo/]
  proxyId:null
  policy[releases]:ignored
  policy[snapshots]:ignored
  policy[cache-failures]:ignored
  policy[checksum]:ignored
]
DEBUG|main| 8996|RepositoryProxyConnectors:default - Using target repository: badproxied - layout: default - targetPath: org/apache/maven/test/get-checksum-sha1-only/1.0/get-checksum-sha1-only-1.0.jar
DEBUG|main| 8996|RepositoryProxyConnectors:default - Applying [releases] policy with [ignored]
DEBUG|main| 8996|PreDownloadPolicy:releases     - OK to update, releases policy set to IGNORED.
DEBUG|main| 8996|RepositoryProxyConnectors:default - Applying [snapshots] policy with [ignored]
DEBUG|main| 8996|PreDownloadPolicy:snapshots    - OK to update, snapshots policy set to IGNORED.
DEBUG|main| 8996|RepositoryProxyConnectors:default - Applying [cache-failures] policy with [ignored]
DEBUG|main| 8997|PreDownloadPolicy:cache-failures - OK to fetch, check-failures policy set to IGNORED.
DEBUG|main| 8997|RepositoryProxyConnectors:default - Retrieving org/apache/maven/test/get-checksum-sha1-only/1.0/get-checksum-sha1-only-1.0.jar from Bad Proxied if updated
DEBUG|main| 8997|Wagon:test                     - .getIfNewer(org/apache/maven/test/get-checksum-sha1-only/1.0/get-checksum-sha1-only-1.0.jar, /export/home/build/data/continuum/checkouts/282/target/test-repository/managed/org/apache/maven/test/get-checksum-sha1-only/1.0/get-checksum-sha1-only-1.0.jar.tmp, 0)
DEBUG|main| 8997|RepositoryProxyConnectors:default - Downloaded successfully.
DEBUG|main| 8998|RepositoryProxyConnectors:default - Retrieving org/apache/maven/test/get-checksum-sha1-only/1.0/get-checksum-sha1-only-1.0.jar.sha1 from Bad Proxied if updated
DEBUG|main| 8998|Wagon:test                     - .getIfNewer(org/apache/maven/test/get-checksum-sha1-only/1.0/get-checksum-sha1-only-1.0.jar.sha1, /export/home/build/data/continuum/checkouts/282/target/test-repository/managed/org/apache/maven/test/get-checksum-sha1-only/1.0/get-checksum-sha1-only-1.0.jar.sha1.tmp, 0)
DEBUG|main| 8998|RepositoryProxyConnectors:default - Downloaded successfully.
DEBUG|main| 8998|RepositoryProxyConnectors:default - Checksum.sha1 Downloaded: /export/home/build/data/continuum/checkouts/282/target/test-repository/managed/org/apache/maven/test/get-checksum-sha1-only/1.0/get-checksum-sha1-only-1.0.jar.sha1
DEBUG|main| 8999|RepositoryProxyConnectors:default - Retrieving org/apache/maven/test/get-checksum-sha1-only/1.0/get-checksum-sha1-only-1.0.jar.md5 from Bad Proxied if updated
DEBUG|main| 8999|Wagon:test                     - .getIfNewer(org/apache/maven/test/get-checksum-sha1-only/1.0/get-checksum-sha1-only-1.0.jar.md5, /export/home/build/data/continuum/checkouts/282/target/test-repository/managed/org/apache/maven/test/get-checksum-sha1-only/1.0/get-checksum-sha1-only-1.0.jar.md5.tmp, 0)
 WARN|main| 8999|RepositoryProxyConnectors:default - Download failure:transfer failed
org.apache.maven.wagon.TransferFailedException: transfer failed
	at org.easymock.MockControl$4.invoke(MockControl.java:150)
	at org.easymock.internal.ObjectMethodsFilter.invoke(ObjectMethodsFilter.java:44)
	at $Proxy2.getIfNewer(Unknown Source)
	at org.apache.maven.archiva.proxy.WagonDelegate.getIfNewer(WagonDelegate.java:66)
	at org.apache.maven.archiva.proxy.DefaultRepositoryProxyConnectors.transferSimpleFile(DefaultRepositoryProxyConnectors.java:463)
	at org.apache.maven.archiva.proxy.DefaultRepositoryProxyConnectors.transferChecksum(DefaultRepositoryProxyConnectors.java:420)
	at org.apache.maven.archiva.proxy.DefaultRepositoryProxyConnectors.transferFile(DefaultRepositoryProxyConnectors.java:360)
	at org.apache.maven.archiva.proxy.DefaultRepositoryProxyConnectors.fetchFromProxies(DefaultRepositoryProxyConnectors.java:150)
	at org.apache.maven.archiva.proxy.ChecksumTransferTest.testGetChecksumTransferFailed(ChecksumTransferTest.java:376)
	at sun.reflect.NativeMethodAccessorImpl.invoke0(Native Method)
	at sun.reflect.NativeMethodAccessorImpl.invoke(NativeMethodAccessorImpl.java:39)
	at sun.reflect.DelegatingMethodAccessorImpl.invoke(DelegatingMethodAccessorImpl.java:25)
	at java.lang.reflect.Method.invoke(Method.java:585)
	at junit.framework.TestCase.runTest(TestCase.java:154)
	at junit.framework.TestCase.runBare(TestCase.java:127)
	at junit.framework.TestResult$1.protect(TestResult.java:106)
	at junit.framework.TestResult.runProtected(TestResult.java:124)
	at junit.framework.TestResult.run(TestResult.java:109)
	at junit.framework.TestCase.run(TestCase.java:118)
	at junit.framework.TestSuite.runTest(TestSuite.java:208)
	at junit.framework.TestSuite.run(TestSuite.java:203)
	at sun.reflect.NativeMethodAccessorImpl.invoke0(Native Method)
	at sun.reflect.NativeMethodAccessorImpl.invoke(NativeMethodAccessorImpl.java:39)
	at sun.reflect.DelegatingMethodAccessorImpl.invoke(DelegatingMethodAccessorImpl.java:25)
	at java.lang.reflect.Method.invoke(Method.java:585)
	at org.apache.maven.surefire.junit.JUnitTestSet.execute(JUnitTestSet.java:210)
	at org.apache.maven.surefire.suite.AbstractDirectoryTestSuite.executeTestSet(AbstractDirectoryTestSuite.java:135)
	at org.apache.maven.surefire.suite.AbstractDirectoryTestSuite.execute(AbstractDirectoryTestSuite.java:122)
	at org.apache.maven.surefire.Surefire.run(Surefire.java:129)
	at sun.reflect.NativeMethodAccessorImpl.invoke0(Native Method)
	at sun.reflect.NativeMethodAccessorImpl.invoke(NativeMethodAccessorImpl.java:39)
	at sun.reflect.DelegatingMethodAccessorImpl.invoke(DelegatingMethodAccessorImpl.java:25)
	at java.lang.reflect.Method.invoke(Method.java:585)
	at org.apache.maven.surefire.booter.SurefireBooter.runSuitesInProcess(SurefireBooter.java:225)
	at org.apache.maven.surefire.booter.SurefireBooter.main(SurefireBooter.java:747)
 WARN|main| 9002|RepositoryProxyConnectors:default - Transfer failed on checksum: test://bad.machine.com/repo/org/apache/maven/test/get-checksum-sha1-only/1.0/get-checksum-sha1-only-1.0.jar : transfer failed
org.apache.maven.wagon.TransferFailedException: transfer failed
	at org.easymock.MockControl$4.invoke(MockControl.java:150)
	at org.easymock.internal.ObjectMethodsFilter.invoke(ObjectMethodsFilter.java:44)
	at $Proxy2.getIfNewer(Unknown Source)
	at org.apache.maven.archiva.proxy.WagonDelegate.getIfNewer(WagonDelegate.java:66)
	at org.apache.maven.archiva.proxy.DefaultRepositoryProxyConnectors.transferSimpleFile(DefaultRepositoryProxyConnectors.java:463)
	at org.apache.maven.archiva.proxy.DefaultRepositoryProxyConnectors.transferChecksum(DefaultRepositoryProxyConnectors.java:420)
	at org.apache.maven.archiva.proxy.DefaultRepositoryProxyConnectors.transferFile(DefaultRepositoryProxyConnectors.java:360)
	at org.apache.maven.archiva.proxy.DefaultRepositoryProxyConnectors.fetchFromProxies(DefaultRepositoryProxyConnectors.java:150)
	at org.apache.maven.archiva.proxy.ChecksumTransferTest.testGetChecksumTransferFailed(ChecksumTransferTest.java:376)
	at sun.reflect.NativeMethodAccessorImpl.invoke0(Native Method)
	at sun.reflect.NativeMethodAccessorImpl.invoke(NativeMethodAccessorImpl.java:39)
	at sun.reflect.DelegatingMethodAccessorImpl.invoke(DelegatingMethodAccessorImpl.java:25)
	at java.lang.reflect.Method.invoke(Method.java:585)
	at junit.framework.TestCase.runTest(TestCase.java:154)
	at junit.framework.TestCase.runBare(TestCase.java:127)
	at junit.framework.TestResult$1.protect(TestResult.java:106)
	at junit.framework.TestResult.runProtected(TestResult.java:124)
	at junit.framework.TestResult.run(TestResult.java:109)
	at junit.framework.TestCase.run(TestCase.java:118)
	at junit.framework.TestSuite.runTest(TestSuite.java:208)
	at junit.framework.TestSuite.run(TestSuite.java:203)
	at sun.reflect.NativeMethodAccessorImpl.invoke0(Native Method)
	at sun.reflect.NativeMethodAccessorImpl.invoke(NativeMethodAccessorImpl.java:39)
	at sun.reflect.DelegatingMethodAccessorImpl.invoke(DelegatingMethodAccessorImpl.java:25)
	at java.lang.reflect.Method.invoke(Method.java:585)
	at org.apache.maven.surefire.junit.JUnitTestSet.execute(JUnitTestSet.java:210)
	at org.apache.maven.surefire.suite.AbstractDirectoryTestSuite.executeTestSet(AbstractDirectoryTestSuite.java:135)
	at org.apache.maven.surefire.suite.AbstractDirectoryTestSuite.execute(AbstractDirectoryTestSuite.java:122)
	at org.apache.maven.surefire.Surefire.run(Surefire.java:129)
	at sun.reflect.NativeMethodAccessorImpl.invoke0(Native Method)
	at sun.reflect.NativeMethodAccessorImpl.invoke(NativeMethodAccessorImpl.java:39)
	at sun.reflect.DelegatingMethodAccessorImpl.invoke(DelegatingMethodAccessorImpl.java:25)
	at java.lang.reflect.Method.invoke(Method.java:585)
	at org.apache.maven.surefire.booter.SurefireBooter.runSuitesInProcess(SurefireBooter.java:225)
	at org.apache.maven.surefire.booter.SurefireBooter.main(SurefireBooter.java:747)
DEBUG|main| 9004|RepositoryProxyConnectors:default - Applying [checksum] policy with [ignored]
 INFO|main| 9004|RepositoryProxyConnectors:default - Successfully transfered: /export/home/build/data/continuum/checkouts/282/target/test-repository/managed/org/apache/maven/test/get-checksum-sha1-only/1.0/get-checksum-sha1-only-1.0.jar
 INFO|main| 9008|Cache:url-failures-cache       - Disposing cache: [  name = cache status = STATUS_ALIVE eternal = false overflowToDisk = false maxElementsInMemory = 1000 maxElementsOnDisk = 0 memoryStoreEvictionPolicy = LRU timeToLiveSeconds = 1800 timeToIdleSeconds = 2700 diskPersistent = true diskExpiryThreadIntervalSeconds = 600 cacheEventListeners:  hitCount = 0 memoryStoreHitCount = 0 diskStoreHitCount = 0 missCountNotFound = 0 missCountExpired = 0 ]
DEBUG|main| 9048|Registry:commons-configuration - Creating a default configuration - no configuration was provided
DEBUG|main| 9064|Registry:commons-configuration - Creating a default configuration - no configuration was provided
DEBUG|main| 9095|CacheManager                   - Attempting to create an existing singleton. Existing singleton returned.
DEBUG|main| 9095|MemoryStore                    - Initialized net.sf.ehcache.store.LruMemoryStore for cache
DEBUG|main| 9096|LruMemoryStore                 - cache Cache: Using SpoolingLinkedHashMap implementation
DEBUG|main| 9096|Cache                          - Initialised cache: cache

.\ testGetAlwaysBadChecksumPresentLocallyAbsentRemoteUsingIgnoredSetting() \._________________________________________

DEBUG|main| 9101|RepositoryProxyConnectors:default - Attempting connector: ProxyConnector[
  source:ArchivaRepository[default-managed-repository,file:/export/home/build/data/continuum/checkouts/282/target/test-repository/managed/]
  target:ArchivaRepository[proxied1,file:/export/home/build/data/continuum/checkouts/282/src/test/repositories/proxied1/]
  proxyId:null
  policy[releases]:ignored
  policy[snapshots]:ignored
  policy[cache-failures]:ignored
  policy[checksum]:ignored
]
DEBUG|main| 9102|RepositoryProxyConnectors:default - Using target repository: proxied1 - layout: default - targetPath: org/apache/maven/test/get-bad-local-checksum/1.0/get-bad-local-checksum-1.0.jar
DEBUG|main| 9103|RepositoryProxyConnectors:default - Applying [releases] policy with [ignored]
DEBUG|main| 9104|PreDownloadPolicy:releases     - OK to update, releases policy set to IGNORED.
DEBUG|main| 9104|RepositoryProxyConnectors:default - Applying [snapshots] policy with [ignored]
DEBUG|main| 9104|PreDownloadPolicy:snapshots    - OK to update, snapshots policy set to IGNORED.
DEBUG|main| 9104|RepositoryProxyConnectors:default - Applying [cache-failures] policy with [ignored]
DEBUG|main| 9105|PreDownloadPolicy:cache-failures - OK to fetch, check-failures policy set to IGNORED.
DEBUG|main| 9105|RepositoryProxyConnectors:default - Retrieving org/apache/maven/test/get-bad-local-checksum/1.0/get-bad-local-checksum-1.0.jar from Proxied Repository 1
DEBUG|main| 9205|RepositoryProxyConnectors:default - Downloaded successfully.
DEBUG|main| 9205|RepositoryProxyConnectors:default - Retrieving org/apache/maven/test/get-bad-local-checksum/1.0/get-bad-local-checksum-1.0.jar.sha1 from Proxied Repository 1
 WARN|main| 9206|RepositoryProxyConnectors:default - Resource does not exist: File: /export/home/build/data/continuum/checkouts/282/src/test/repositories/proxied1/org/apache/maven/test/get-bad-local-checksum/1.0/get-bad-local-checksum-1.0.jar.sha1 does not exist
DEBUG|main| 9206|RepositoryProxyConnectors:default - Checksum.sha1 Not Download: File: /export/home/build/data/continuum/checkouts/282/src/test/repositories/proxied1/org/apache/maven/test/get-bad-local-checksum/1.0/get-bad-local-checksum-1.0.jar.sha1 does not exist
DEBUG|main| 9206|RepositoryProxyConnectors:default - Retrieving org/apache/maven/test/get-bad-local-checksum/1.0/get-bad-local-checksum-1.0.jar.md5 from Proxied Repository 1
 WARN|main| 9206|RepositoryProxyConnectors:default - Resource does not exist: File: /export/home/build/data/continuum/checkouts/282/src/test/repositories/proxied1/org/apache/maven/test/get-bad-local-checksum/1.0/get-bad-local-checksum-1.0.jar.md5 does not exist
DEBUG|main| 9206|RepositoryProxyConnectors:default - Checksum.md5 Not Download: File: /export/home/build/data/continuum/checkouts/282/src/test/repositories/proxied1/org/apache/maven/test/get-bad-local-checksum/1.0/get-bad-local-checksum-1.0.jar.md5 does not exist
DEBUG|main| 9206|RepositoryProxyConnectors:default - Applying [checksum] policy with [ignored]
 INFO|main| 9207|RepositoryProxyConnectors:default - Successfully transfered: /export/home/build/data/continuum/checkouts/282/target/test-repository/managed/org/apache/maven/test/get-bad-local-checksum/1.0/get-bad-local-checksum-1.0.jar
 INFO|main| 9207|Cache:url-failures-cache       - Disposing cache: [  name = cache status = STATUS_ALIVE eternal = false overflowToDisk = false maxElementsInMemory = 1000 maxElementsOnDisk = 0 memoryStoreEvictionPolicy = LRU timeToLiveSeconds = 1800 timeToIdleSeconds = 2700 diskPersistent = true diskExpiryThreadIntervalSeconds = 600 cacheEventListeners:  hitCount = 0 memoryStoreHitCount = 0 diskStoreHitCount = 0 missCountNotFound = 0 missCountExpired = 0 ]
DEBUG|main| 9234|Registry:commons-configuration - Creating a default configuration - no configuration was provided
DEBUG|main| 9247|Registry:commons-configuration - Creating a default configuration - no configuration was provided
DEBUG|main| 9491|CacheManager                   - Attempting to create an existing singleton. Existing singleton returned.
DEBUG|main| 9492|MemoryStore                    - Initialized net.sf.ehcache.store.LruMemoryStore for cache
DEBUG|main| 9492|LruMemoryStore                 - cache Cache: Using SpoolingLinkedHashMap implementation
DEBUG|main| 9492|Cache                          - Initialised cache: cache

.\ testGetAlwaysBadChecksumPresentLocallyAbsentRemoteUsingFailSetting() \._________________________________________

DEBUG|main| 9498|RepositoryProxyConnectors:default - Attempting connector: ProxyConnector[
  source:ArchivaRepository[default-managed-repository,file:/export/home/build/data/continuum/checkouts/282/target/test-repository/managed/]
  target:ArchivaRepository[proxied1,file:/export/home/build/data/continuum/checkouts/282/src/test/repositories/proxied1/]
  proxyId:null
  policy[releases]:ignored
  policy[snapshots]:ignored
  policy[cache-failures]:ignored
  policy[checksum]:fail
]
DEBUG|main| 9499|RepositoryProxyConnectors:default - Using target repository: proxied1 - layout: default - targetPath: org/apache/maven/test/get-bad-local-checksum/1.0/get-bad-local-checksum-1.0.jar
DEBUG|main| 9499|RepositoryProxyConnectors:default - Applying [releases] policy with [ignored]
DEBUG|main| 9499|PreDownloadPolicy:releases     - OK to update, releases policy set to IGNORED.
DEBUG|main| 9500|RepositoryProxyConnectors:default - Applying [snapshots] policy with [ignored]
DEBUG|main| 9500|PreDownloadPolicy:snapshots    - OK to update, snapshots policy set to IGNORED.
DEBUG|main| 9500|RepositoryProxyConnectors:default - Applying [cache-failures] policy with [ignored]
DEBUG|main| 9500|PreDownloadPolicy:cache-failures - OK to fetch, check-failures policy set to IGNORED.
DEBUG|main| 9500|RepositoryProxyConnectors:default - Retrieving org/apache/maven/test/get-bad-local-checksum/1.0/get-bad-local-checksum-1.0.jar from Proxied Repository 1
DEBUG|main| 9501|RepositoryProxyConnectors:default - Downloaded successfully.
DEBUG|main| 9502|RepositoryProxyConnectors:default - Retrieving org/apache/maven/test/get-bad-local-checksum/1.0/get-bad-local-checksum-1.0.jar.sha1 from Proxied Repository 1
 WARN|main| 9502|RepositoryProxyConnectors:default - Resource does not exist: File: /export/home/build/data/continuum/checkouts/282/src/test/repositories/proxied1/org/apache/maven/test/get-bad-local-checksum/1.0/get-bad-local-checksum-1.0.jar.sha1 does not exist
DEBUG|main| 9502|RepositoryProxyConnectors:default - Checksum.sha1 Not Download: File: /export/home/build/data/continuum/checkouts/282/src/test/repositories/proxied1/org/apache/maven/test/get-bad-local-checksum/1.0/get-bad-local-checksum-1.0.jar.sha1 does not exist
DEBUG|main| 9502|RepositoryProxyConnectors:default - Retrieving org/apache/maven/test/get-bad-local-checksum/1.0/get-bad-local-checksum-1.0.jar.md5 from Proxied Repository 1
 WARN|main| 9502|RepositoryProxyConnectors:default - Resource does not exist: File: /export/home/build/data/continuum/checkouts/282/src/test/repositories/proxied1/org/apache/maven/test/get-bad-local-checksum/1.0/get-bad-local-checksum-1.0.jar.md5 does not exist
DEBUG|main| 9502|RepositoryProxyConnectors:default - Checksum.md5 Not Download: File: /export/home/build/data/continuum/checkouts/282/src/test/repositories/proxied1/org/apache/maven/test/get-bad-local-checksum/1.0/get-bad-local-checksum-1.0.jar.md5 does not exist
DEBUG|main| 9503|RepositoryProxyConnectors:default - Applying [checksum] policy with [fail]
DEBUG|main| 9503|PostDownloadPolicy:checksum    - Not valid checksum: /export/home/build/data/continuum/checkouts/282/target/test-repository/managed/org/apache/maven/test/get-bad-local-checksum/1.0/get-bad-local-checksum-1.0.jar.sha1
 WARN|main| 9503|PostDownloadPolicy:checksum    - SHA1 is incorrect for /export/home/build/data/continuum/checkouts/282/target/test-repository/managed/org/apache/maven/test/get-bad-local-checksum/1.0/get-bad-local-checksum-1.0.jar
DEBUG|main| 9504|PostDownloadPolicy:checksum    - Not valid checksum: /export/home/build/data/continuum/checkouts/282/target/test-repository/managed/org/apache/maven/test/get-bad-local-checksum/1.0/get-bad-local-checksum-1.0.jar.md5
 WARN|main| 9504|PostDownloadPolicy:checksum    - MD5 is incorrect for /export/home/build/data/continuum/checkouts/282/target/test-repository/managed/org/apache/maven/test/get-bad-local-checksum/1.0/get-bad-local-checksum-1.0.jar
DEBUG|main| 9506|RepositoryProxyConnectors:default - Didn't pass the [checksum] policy.
 INFO|main| 9506|RepositoryProxyConnectors:default - Failed post-download policies - /export/home/build/data/continuum/checkouts/282/target/test-repository/managed/org/apache/maven/test/get-bad-local-checksum/1.0/get-bad-local-checksum-1.0.jar
 INFO|main| 9507|Cache:url-failures-cache       - Disposing cache: [  name = cache status = STATUS_ALIVE eternal = false overflowToDisk = false maxElementsInMemory = 1000 maxElementsOnDisk = 0 memoryStoreEvictionPolicy = LRU timeToLiveSeconds = 1800 timeToIdleSeconds = 2700 diskPersistent = true diskExpiryThreadIntervalSeconds = 600 cacheEventListeners:  hitCount = 0 memoryStoreHitCount = 0 diskStoreHitCount = 0 missCountNotFound = 0 missCountExpired = 0 ]
DEBUG|main| 9529|Registry:commons-configuration - Creating a default configuration - no configuration was provided
DEBUG|main| 9588|Registry:commons-configuration - Creating a default configuration - no configuration was provided
DEBUG|main| 9622|CacheManager                   - Attempting to create an existing singleton. Existing singleton returned.
DEBUG|main| 9623|MemoryStore                    - Initialized net.sf.ehcache.store.LruMemoryStore for cache
DEBUG|main| 9623|LruMemoryStore                 - cache Cache: Using SpoolingLinkedHashMap implementation
DEBUG|main| 9623|Cache                          - Initialised cache: cache

.\ testGetAlwaysBadChecksumPresentLocallyAbsentRemoteUsingFixSetting() \._________________________________________

DEBUG|main| 9625|RepositoryProxyConnectors:default - Attempting connector: ProxyConnector[
  source:ArchivaRepository[default-managed-repository,file:/export/home/build/data/continuum/checkouts/282/target/test-repository/managed/]
  target:ArchivaRepository[proxied1,file:/export/home/build/data/continuum/checkouts/282/src/test/repositories/proxied1/]
  proxyId:null
  policy[releases]:ignored
  policy[snapshots]:ignored
  policy[cache-failures]:ignored
  policy[checksum]:fix
]
DEBUG|main| 9626|RepositoryProxyConnectors:default - Using target repository: proxied1 - layout: default - targetPath: org/apache/maven/test/get-bad-local-checksum/1.0/get-bad-local-checksum-1.0.jar
DEBUG|main| 9626|RepositoryProxyConnectors:default - Applying [releases] policy with [ignored]
DEBUG|main| 9626|PreDownloadPolicy:releases     - OK to update, releases policy set to IGNORED.
DEBUG|main| 9626|RepositoryProxyConnectors:default - Applying [snapshots] policy with [ignored]
DEBUG|main| 9627|PreDownloadPolicy:snapshots    - OK to update, snapshots policy set to IGNORED.
DEBUG|main| 9627|RepositoryProxyConnectors:default - Applying [cache-failures] policy with [ignored]
DEBUG|main| 9627|PreDownloadPolicy:cache-failures - OK to fetch, check-failures policy set to IGNORED.
DEBUG|main| 9627|RepositoryProxyConnectors:default - Retrieving org/apache/maven/test/get-bad-local-checksum/1.0/get-bad-local-checksum-1.0.jar from Proxied Repository 1
DEBUG|main| 9628|RepositoryProxyConnectors:default - Downloaded successfully.
DEBUG|main| 9628|RepositoryProxyConnectors:default - Retrieving org/apache/maven/test/get-bad-local-checksum/1.0/get-bad-local-checksum-1.0.jar.sha1 from Proxied Repository 1
 WARN|main| 9629|RepositoryProxyConnectors:default - Resource does not exist: File: /export/home/build/data/continuum/checkouts/282/src/test/repositories/proxied1/org/apache/maven/test/get-bad-local-checksum/1.0/get-bad-local-checksum-1.0.jar.sha1 does not exist
DEBUG|main| 9629|RepositoryProxyConnectors:default - Checksum.sha1 Not Download: File: /export/home/build/data/continuum/checkouts/282/src/test/repositories/proxied1/org/apache/maven/test/get-bad-local-checksum/1.0/get-bad-local-checksum-1.0.jar.sha1 does not exist
DEBUG|main| 9629|RepositoryProxyConnectors:default - Retrieving org/apache/maven/test/get-bad-local-checksum/1.0/get-bad-local-checksum-1.0.jar.md5 from Proxied Repository 1
 WARN|main| 9629|RepositoryProxyConnectors:default - Resource does not exist: File: /export/home/build/data/continuum/checkouts/282/src/test/repositories/proxied1/org/apache/maven/test/get-bad-local-checksum/1.0/get-bad-local-checksum-1.0.jar.md5 does not exist
DEBUG|main| 9630|RepositoryProxyConnectors:default - Checksum.md5 Not Download: File: /export/home/build/data/continuum/checkouts/282/src/test/repositories/proxied1/org/apache/maven/test/get-bad-local-checksum/1.0/get-bad-local-checksum-1.0.jar.md5 does not exist
DEBUG|main| 9630|RepositoryProxyConnectors:default - Applying [checksum] policy with [fix]
DEBUG|main| 9630|PostDownloadPolicy:checksum    - Not valid checksum: /export/home/build/data/continuum/checkouts/282/target/test-repository/managed/org/apache/maven/test/get-bad-local-checksum/1.0/get-bad-local-checksum-1.0.jar.sha1
DEBUG|main| 9632|PostDownloadPolicy:checksum    - Not valid checksum: /export/home/build/data/continuum/checkouts/282/target/test-repository/managed/org/apache/maven/test/get-bad-local-checksum/1.0/get-bad-local-checksum-1.0.jar.md5
 INFO|main| 9633|RepositoryProxyConnectors:default - Successfully transfered: /export/home/build/data/continuum/checkouts/282/target/test-repository/managed/org/apache/maven/test/get-bad-local-checksum/1.0/get-bad-local-checksum-1.0.jar
 INFO|main| 9633|Cache:url-failures-cache       - Disposing cache: [  name = cache status = STATUS_ALIVE eternal = false overflowToDisk = false maxElementsInMemory = 1000 maxElementsOnDisk = 0 memoryStoreEvictionPolicy = LRU timeToLiveSeconds = 1800 timeToIdleSeconds = 2700 diskPersistent = true diskExpiryThreadIntervalSeconds = 600 cacheEventListeners:  hitCount = 0 memoryStoreHitCount = 0 diskStoreHitCount = 0 missCountNotFound = 0 missCountExpired = 0 ]
Tests run: 18, Failures: 0, Errors: 0, Skipped: 0, Time elapsed: 3.255 sec
Running org.apache.maven.archiva.proxy.ManagedDefaultTransferTest
DEBUG|main| 9664|Registry:commons-configuration - Creating a default configuration - no configuration was provided
DEBUG|main| 9674|Registry:commons-configuration - Creating a default configuration - no configuration was provided
DEBUG|main| 9731|CacheManager                   - Attempting to create an existing singleton. Existing singleton returned.
DEBUG|main| 9731|MemoryStore                    - Initialized net.sf.ehcache.store.LruMemoryStore for cache
DEBUG|main| 9732|LruMemoryStore                 - cache Cache: Using SpoolingLinkedHashMap implementation
DEBUG|main| 9732|Cache                          - Initialised cache: cache

.\ testGetDefaultLayoutNotPresent() \._________________________________________

DEBUG|main| 9735|RepositoryProxyConnectors:default - Attempting connector: ProxyConnector[
  source:ArchivaRepository[default-managed-repository,file:/export/home/build/data/continuum/checkouts/282/target/test-repository/managed/]
  target:ArchivaRepository[proxied1,file:/export/home/build/data/continuum/checkouts/282/src/test/repositories/proxied1/]
  proxyId:null
  policy[releases]:once
  policy[snapshots]:once
  policy[cache-failures]:ignored
  policy[checksum]:fix
]
DEBUG|main| 9736|RepositoryProxyConnectors:default - Using target repository: proxied1 - layout: default - targetPath: org/apache/maven/test/get-default-layout/1.0/get-default-layout-1.0.jar
DEBUG|main| 9736|RepositoryProxyConnectors:default - Applying [releases] policy with [once]
DEBUG|main| 9736|PreDownloadPolicy:releases     - OK to update releases, local file does not exist.
DEBUG|main| 9736|RepositoryProxyConnectors:default - Applying [snapshots] policy with [once]
DEBUG|main| 9736|PreDownloadPolicy:snapshots    - OK to update, snapshot policy does not apply for non-snapshot versions.
DEBUG|main| 9736|RepositoryProxyConnectors:default - Applying [cache-failures] policy with [ignored]
DEBUG|main| 9737|PreDownloadPolicy:cache-failures - OK to fetch, check-failures policy set to IGNORED.
DEBUG|main| 9737|RepositoryProxyConnectors:default - Retrieving org/apache/maven/test/get-default-layout/1.0/get-default-layout-1.0.jar from Proxied Repository 1 if updated
DEBUG|main| 9737|RepositoryProxyConnectors:default - Downloaded successfully.
DEBUG|main| 9738|RepositoryProxyConnectors:default - Retrieving org/apache/maven/test/get-default-layout/1.0/get-default-layout-1.0.jar.sha1 from Proxied Repository 1
 WARN|main| 9738|RepositoryProxyConnectors:default - Resource does not exist: File: /export/home/build/data/continuum/checkouts/282/src/test/repositories/proxied1/org/apache/maven/test/get-default-layout/1.0/get-default-layout-1.0.jar.sha1 does not exist
DEBUG|main| 9738|RepositoryProxyConnectors:default - Checksum.sha1 Not Download: File: /export/home/build/data/continuum/checkouts/282/src/test/repositories/proxied1/org/apache/maven/test/get-default-layout/1.0/get-default-layout-1.0.jar.sha1 does not exist
DEBUG|main| 9738|RepositoryProxyConnectors:default - Retrieving org/apache/maven/test/get-default-layout/1.0/get-default-layout-1.0.jar.md5 from Proxied Repository 1
 WARN|main| 9739|RepositoryProxyConnectors:default - Resource does not exist: File: /export/home/build/data/continuum/checkouts/282/src/test/repositories/proxied1/org/apache/maven/test/get-default-layout/1.0/get-default-layout-1.0.jar.md5 does not exist
DEBUG|main| 9739|RepositoryProxyConnectors:default - Checksum.md5 Not Download: File: /export/home/build/data/continuum/checkouts/282/src/test/repositories/proxied1/org/apache/maven/test/get-default-layout/1.0/get-default-layout-1.0.jar.md5 does not exist
DEBUG|main| 9739|RepositoryProxyConnectors:default - Applying [checksum] policy with [fix]
DEBUG|main| 9741|PostDownloadPolicy:checksum    - Valid checksum: /export/home/build/data/continuum/checkouts/282/target/test-repository/managed/org/apache/maven/test/get-default-layout/1.0/get-default-layout-1.0.jar.sha1
DEBUG|main| 9742|PostDownloadPolicy:checksum    - Valid checksum: /export/home/build/data/continuum/checkouts/282/target/test-repository/managed/org/apache/maven/test/get-default-layout/1.0/get-default-layout-1.0.jar.md5
 INFO|main| 9742|RepositoryProxyConnectors:default - Successfully transfered: /export/home/build/data/continuum/checkouts/282/target/test-repository/managed/org/apache/maven/test/get-default-layout/1.0/get-default-layout-1.0.jar
 INFO|main| 9743|Cache:url-failures-cache       - Disposing cache: [  name = cache status = STATUS_ALIVE eternal = false overflowToDisk = false maxElementsInMemory = 1000 maxElementsOnDisk = 0 memoryStoreEvictionPolicy = LRU timeToLiveSeconds = 1800 timeToIdleSeconds = 2700 diskPersistent = true diskExpiryThreadIntervalSeconds = 600 cacheEventListeners:  hitCount = 0 memoryStoreHitCount = 0 diskStoreHitCount = 0 missCountNotFound = 0 missCountExpired = 0 ]
DEBUG|main| 9765|Registry:commons-configuration - Creating a default configuration - no configuration was provided
DEBUG|main| 9798|Registry:commons-configuration - Creating a default configuration - no configuration was provided
DEBUG|main| 9818|CacheManager                   - Attempting to create an existing singleton. Existing singleton returned.
DEBUG|main| 9818|MemoryStore                    - Initialized net.sf.ehcache.store.LruMemoryStore for cache
DEBUG|main| 9818|LruMemoryStore                 - cache Cache: Using SpoolingLinkedHashMap implementation
DEBUG|main| 9818|Cache                          - Initialised cache: cache

.\ testGetDefaultLayoutAlreadyPresentPolicyOnce() \._________________________________________

DEBUG|main| 9821|RepositoryProxyConnectors:default - Attempting connector: ProxyConnector[
  source:ArchivaRepository[default-managed-repository,file:/export/home/build/data/continuum/checkouts/282/target/test-repository/managed/]
  target:ArchivaRepository[proxied1,file:/export/home/build/data/continuum/checkouts/282/src/test/repositories/proxied1/]
  proxyId:null
  policy[releases]:once
  policy[snapshots]:once
  policy[cache-failures]:ignored
  policy[checksum]:fix
]
DEBUG|main| 9821|RepositoryProxyConnectors:default - Using target repository: proxied1 - layout: default - targetPath: org/apache/maven/test/get-default-layout-present/1.0/get-default-layout-present-1.0.jar
DEBUG|main| 9821|RepositoryProxyConnectors:default - Applying [releases] policy with [once]
DEBUG|main| 9821|PreDownloadPolicy:releases     - NO to updatereleases, local file exist (and policy is ONCE).
DEBUG|main| 9822|RepositoryProxyConnectors:default - Didn't pass the [releases] policy.
 INFO|main| 9822|RepositoryProxyConnectors:default - Failed pre-download policies - /export/home/build/data/continuum/checkouts/282/target/test-repository/managed/org/apache/maven/test/get-default-layout-present/1.0/get-default-layout-present-1.0.jar
 INFO|main| 9822|RepositoryProxyConnectors:default - Successfully transfered: /export/home/build/data/continuum/checkouts/282/target/test-repository/managed/org/apache/maven/test/get-default-layout-present/1.0/get-default-layout-present-1.0.jar
 INFO|main| 9823|Cache:url-failures-cache       - Disposing cache: [  name = cache status = STATUS_ALIVE eternal = false overflowToDisk = false maxElementsInMemory = 1000 maxElementsOnDisk = 0 memoryStoreEvictionPolicy = LRU timeToLiveSeconds = 1800 timeToIdleSeconds = 2700 diskPersistent = true diskExpiryThreadIntervalSeconds = 600 cacheEventListeners:  hitCount = 0 memoryStoreHitCount = 0 diskStoreHitCount = 0 missCountNotFound = 0 missCountExpired = 0 ]
DEBUG|main| 9936|Registry:commons-configuration - Creating a default configuration - no configuration was provided
DEBUG|main| 9947|Registry:commons-configuration - Creating a default configuration - no configuration was provided
DEBUG|main| 9964|CacheManager                   - Attempting to create an existing singleton. Existing singleton returned.
DEBUG|main| 9965|MemoryStore                    - Initialized net.sf.ehcache.store.LruMemoryStore for cache
DEBUG|main| 9965|LruMemoryStore                 - cache Cache: Using SpoolingLinkedHashMap implementation
DEBUG|main| 9965|Cache                          - Initialised cache: cache

.\ testGetDefaultLayoutAlreadyPresentPolicyIgnored() \._________________________________________

DEBUG|main| 9967|RepositoryProxyConnectors:default - Attempting connector: ProxyConnector[
  source:ArchivaRepository[default-managed-repository,file:/export/home/build/data/continuum/checkouts/282/target/test-repository/managed/]
  target:ArchivaRepository[proxied1,file:/export/home/build/data/continuum/checkouts/282/src/test/repositories/proxied1/]
  proxyId:null
  policy[releases]:ignored
  policy[snapshots]:ignored
  policy[cache-failures]:ignored
  policy[checksum]:fix
]
DEBUG|main| 9968|RepositoryProxyConnectors:default - Using target repository: proxied1 - layout: default - targetPath: org/apache/maven/test/get-default-layout-present/1.0/get-default-layout-present-1.0.jar
DEBUG|main| 9968|RepositoryProxyConnectors:default - Applying [releases] policy with [ignored]
DEBUG|main| 9968|PreDownloadPolicy:releases     - OK to update, releases policy set to IGNORED.
DEBUG|main| 9968|RepositoryProxyConnectors:default - Applying [snapshots] policy with [ignored]
DEBUG|main|10004|PreDownloadPolicy:snapshots    - OK to update, snapshots policy set to IGNORED.
DEBUG|main|10005|RepositoryProxyConnectors:default - Applying [cache-failures] policy with [ignored]
DEBUG|main|10005|PreDownloadPolicy:cache-failures - OK to fetch, check-failures policy set to IGNORED.
DEBUG|main|10006|RepositoryProxyConnectors:default - Retrieving org/apache/maven/test/get-default-layout-present/1.0/get-default-layout-present-1.0.jar from Proxied Repository 1
DEBUG|main|10010|RepositoryProxyConnectors:default - Downloaded successfully.
DEBUG|main|10011|RepositoryProxyConnectors:default - Retrieving org/apache/maven/test/get-default-layout-present/1.0/get-default-layout-present-1.0.jar.sha1 from Proxied Repository 1 if updated
 WARN|main|10012|RepositoryProxyConnectors:default - Resource does not exist: File: /export/home/build/data/continuum/checkouts/282/src/test/repositories/proxied1/org/apache/maven/test/get-default-layout-present/1.0/get-default-layout-present-1.0.jar.sha1 does not exist
DEBUG|main|10012|RepositoryProxyConnectors:default - Checksum.sha1 Not Download: File: /export/home/build/data/continuum/checkouts/282/src/test/repositories/proxied1/org/apache/maven/test/get-default-layout-present/1.0/get-default-layout-present-1.0.jar.sha1 does not exist
DEBUG|main|10013|RepositoryProxyConnectors:default - Retrieving org/apache/maven/test/get-default-layout-present/1.0/get-default-layout-present-1.0.jar.md5 from Proxied Repository 1
 WARN|main|10013|RepositoryProxyConnectors:default - Resource does not exist: File: /export/home/build/data/continuum/checkouts/282/src/test/repositories/proxied1/org/apache/maven/test/get-default-layout-present/1.0/get-default-layout-present-1.0.jar.md5 does not exist
DEBUG|main|10013|RepositoryProxyConnectors:default - Checksum.md5 Not Download: File: /export/home/build/data/continuum/checkouts/282/src/test/repositories/proxied1/org/apache/maven/test/get-default-layout-present/1.0/get-default-layout-present-1.0.jar.md5 does not exist
DEBUG|main|10013|RepositoryProxyConnectors:default - Applying [checksum] policy with [fix]
DEBUG|main|10014|PostDownloadPolicy:checksum    - Not valid checksum: /export/home/build/data/continuum/checkouts/282/target/test-repository/managed/org/apache/maven/test/get-default-layout-present/1.0/get-default-layout-present-1.0.jar.md5
 INFO|main|10015|RepositoryProxyConnectors:default - Successfully transfered: /export/home/build/data/continuum/checkouts/282/target/test-repository/managed/org/apache/maven/test/get-default-layout-present/1.0/get-default-layout-present-1.0.jar
 INFO|main|10016|Cache:url-failures-cache       - Disposing cache: [  name = cache status = STATUS_ALIVE eternal = false overflowToDisk = false maxElementsInMemory = 1000 maxElementsOnDisk = 0 memoryStoreEvictionPolicy = LRU timeToLiveSeconds = 1800 timeToIdleSeconds = 2700 diskPersistent = true diskExpiryThreadIntervalSeconds = 600 cacheEventListeners:  hitCount = 0 memoryStoreHitCount = 0 diskStoreHitCount = 0 missCountNotFound = 0 missCountExpired = 0 ]
DEBUG|main|10045|Registry:commons-configuration - Creating a default configuration - no configuration was provided
DEBUG|main|10122|Registry:commons-configuration - Creating a default configuration - no configuration was provided
DEBUG|main|10139|CacheManager                   - Attempting to create an existing singleton. Existing singleton returned.
DEBUG|main|10140|MemoryStore                    - Initialized net.sf.ehcache.store.LruMemoryStore for cache
DEBUG|main|10140|LruMemoryStore                 - cache Cache: Using SpoolingLinkedHashMap implementation
DEBUG|main|10140|Cache                          - Initialised cache: cache

.\ testGetDefaultLayoutRemoteUpdate() \._________________________________________

DEBUG|main|10143|RepositoryProxyConnectors:default - Attempting connector: ProxyConnector[
  source:ArchivaRepository[default-managed-repository,file:/export/home/build/data/continuum/checkouts/282/target/test-repository/managed/]
  target:ArchivaRepository[proxied1,file:/export/home/build/data/continuum/checkouts/282/src/test/repositories/proxied1/]
  proxyId:null
  policy[releases]:daily
  policy[snapshots]:daily
  policy[cache-failures]:ignored
  policy[checksum]:fix
]
DEBUG|main|10143|RepositoryProxyConnectors:default - Using target repository: proxied1 - layout: default - targetPath: org/apache/maven/test/get-default-layout-present/1.0/get-default-layout-present-1.0.jar
DEBUG|main|10143|RepositoryProxyConnectors:default - Applying [releases] policy with [daily]
DEBUG|main|10144|RepositoryProxyConnectors:default - Applying [snapshots] policy with [daily]
DEBUG|main|10144|PreDownloadPolicy:snapshots    - OK to update, snapshot policy does not apply for non-snapshot versions.
DEBUG|main|10144|RepositoryProxyConnectors:default - Applying [cache-failures] policy with [ignored]
DEBUG|main|10144|PreDownloadPolicy:cache-failures - OK to fetch, check-failures policy set to IGNORED.
DEBUG|main|10144|RepositoryProxyConnectors:default - Retrieving org/apache/maven/test/get-default-layout-present/1.0/get-default-layout-present-1.0.jar from Proxied Repository 1
DEBUG|main|10145|RepositoryProxyConnectors:default - Downloaded successfully.
DEBUG|main|10146|RepositoryProxyConnectors:default - Retrieving org/apache/maven/test/get-default-layout-present/1.0/get-default-layout-present-1.0.jar.sha1 from Proxied Repository 1
 WARN|main|10146|RepositoryProxyConnectors:default - Resource does not exist: File: /export/home/build/data/continuum/checkouts/282/src/test/repositories/proxied1/org/apache/maven/test/get-default-layout-present/1.0/get-default-layout-present-1.0.jar.sha1 does not exist
DEBUG|main|10146|RepositoryProxyConnectors:default - Checksum.sha1 Not Download: File: /export/home/build/data/continuum/checkouts/282/src/test/repositories/proxied1/org/apache/maven/test/get-default-layout-present/1.0/get-default-layout-present-1.0.jar.sha1 does not exist
DEBUG|main|10146|RepositoryProxyConnectors:default - Retrieving org/apache/maven/test/get-default-layout-present/1.0/get-default-layout-present-1.0.jar.md5 from Proxied Repository 1
 WARN|main|10147|RepositoryProxyConnectors:default - Resource does not exist: File: /export/home/build/data/continuum/checkouts/282/src/test/repositories/proxied1/org/apache/maven/test/get-default-layout-present/1.0/get-default-layout-present-1.0.jar.md5 does not exist
DEBUG|main|10147|RepositoryProxyConnectors:default - Checksum.md5 Not Download: File: /export/home/build/data/continuum/checkouts/282/src/test/repositories/proxied1/org/apache/maven/test/get-default-layout-present/1.0/get-default-layout-present-1.0.jar.md5 does not exist
DEBUG|main|10147|RepositoryProxyConnectors:default - Applying [checksum] policy with [fix]
DEBUG|main|10148|PostDownloadPolicy:checksum    - Valid checksum: /export/home/build/data/continuum/checkouts/282/target/test-repository/managed/org/apache/maven/test/get-default-layout-present/1.0/get-default-layout-present-1.0.jar.sha1
DEBUG|main|10148|PostDownloadPolicy:checksum    - Not valid checksum: /export/home/build/data/continuum/checkouts/282/target/test-repository/managed/org/apache/maven/test/get-default-layout-present/1.0/get-default-layout-present-1.0.jar.md5
 INFO|main|10149|RepositoryProxyConnectors:default - Successfully transfered: /export/home/build/data/continuum/checkouts/282/target/test-repository/managed/org/apache/maven/test/get-default-layout-present/1.0/get-default-layout-present-1.0.jar
 INFO|main|10149|Cache:url-failures-cache       - Disposing cache: [  name = cache status = STATUS_ALIVE eternal = false overflowToDisk = false maxElementsInMemory = 1000 maxElementsOnDisk = 0 memoryStoreEvictionPolicy = LRU timeToLiveSeconds = 1800 timeToIdleSeconds = 2700 diskPersistent = true diskExpiryThreadIntervalSeconds = 600 cacheEventListeners:  hitCount = 0 memoryStoreHitCount = 0 diskStoreHitCount = 0 missCountNotFound = 0 missCountExpired = 0 ]
DEBUG|main|10175|Registry:commons-configuration - Creating a default configuration - no configuration was provided
DEBUG|main|10184|Registry:commons-configuration - Creating a default configuration - no configuration was provided
DEBUG|main|10295|CacheManager                   - Attempting to create an existing singleton. Existing singleton returned.
DEBUG|main|10296|MemoryStore                    - Initialized net.sf.ehcache.store.LruMemoryStore for cache
DEBUG|main|10296|LruMemoryStore                 - cache Cache: Using SpoolingLinkedHashMap implementation
DEBUG|main|10296|Cache                          - Initialised cache: cache

.\ testGetWhenInBothProxiedRepos() \._________________________________________

DEBUG|main|10305|RepositoryProxyConnectors:default - Attempting connector: ProxyConnector[
  source:ArchivaRepository[default-managed-repository,file:/export/home/build/data/continuum/checkouts/282/target/test-repository/managed/]
  target:ArchivaRepository[proxied1,file:/export/home/build/data/continuum/checkouts/282/src/test/repositories/proxied1/]
  proxyId:null
  policy[releases]:ignored
  policy[snapshots]:ignored
  policy[cache-failures]:ignored
  policy[checksum]:fix
]
DEBUG|main|10306|RepositoryProxyConnectors:default - Using target repository: proxied1 - layout: default - targetPath: org/apache/maven/test/get-in-both-proxies/1.0/get-in-both-proxies-1.0.jar
DEBUG|main|10306|RepositoryProxyConnectors:default - Applying [releases] policy with [ignored]
DEBUG|main|10306|PreDownloadPolicy:releases     - OK to update, releases policy set to IGNORED.
DEBUG|main|10307|RepositoryProxyConnectors:default - Applying [snapshots] policy with [ignored]
DEBUG|main|10307|PreDownloadPolicy:snapshots    - OK to update, snapshots policy set to IGNORED.
DEBUG|main|10307|RepositoryProxyConnectors:default - Applying [cache-failures] policy with [ignored]
DEBUG|main|10307|PreDownloadPolicy:cache-failures - OK to fetch, check-failures policy set to IGNORED.
DEBUG|main|10307|RepositoryProxyConnectors:default - Retrieving org/apache/maven/test/get-in-both-proxies/1.0/get-in-both-proxies-1.0.jar from Proxied Repository 1 if updated
DEBUG|main|10342|RepositoryProxyConnectors:default - Downloaded successfully.
DEBUG|main|10343|RepositoryProxyConnectors:default - Retrieving org/apache/maven/test/get-in-both-proxies/1.0/get-in-both-proxies-1.0.jar.sha1 from Proxied Repository 1 if updated
 WARN|main|10344|RepositoryProxyConnectors:default - Resource does not exist: File: /export/home/build/data/continuum/checkouts/282/src/test/repositories/proxied1/org/apache/maven/test/get-in-both-proxies/1.0/get-in-both-proxies-1.0.jar.sha1 does not exist
DEBUG|main|10344|RepositoryProxyConnectors:default - Checksum.sha1 Not Download: File: /export/home/build/data/continuum/checkouts/282/src/test/repositories/proxied1/org/apache/maven/test/get-in-both-proxies/1.0/get-in-both-proxies-1.0.jar.sha1 does not exist
DEBUG|main|10344|RepositoryProxyConnectors:default - Retrieving org/apache/maven/test/get-in-both-proxies/1.0/get-in-both-proxies-1.0.jar.md5 from Proxied Repository 1 if updated
 WARN|main|10344|RepositoryProxyConnectors:default - Resource does not exist: File: /export/home/build/data/continuum/checkouts/282/src/test/repositories/proxied1/org/apache/maven/test/get-in-both-proxies/1.0/get-in-both-proxies-1.0.jar.md5 does not exist
DEBUG|main|10344|RepositoryProxyConnectors:default - Checksum.md5 Not Download: File: /export/home/build/data/continuum/checkouts/282/src/test/repositories/proxied1/org/apache/maven/test/get-in-both-proxies/1.0/get-in-both-proxies-1.0.jar.md5 does not exist
DEBUG|main|10345|RepositoryProxyConnectors:default - Applying [checksum] policy with [fix]
 INFO|main|10345|RepositoryProxyConnectors:default - Successfully transfered: /export/home/build/data/continuum/checkouts/282/target/test-repository/managed/org/apache/maven/test/get-in-both-proxies/1.0/get-in-both-proxies-1.0.jar
 INFO|main|10474|Cache:url-failures-cache       - Disposing cache: [  name = cache status = STATUS_ALIVE eternal = false overflowToDisk = false maxElementsInMemory = 1000 maxElementsOnDisk = 0 memoryStoreEvictionPolicy = LRU timeToLiveSeconds = 1800 timeToIdleSeconds = 2700 diskPersistent = true diskExpiryThreadIntervalSeconds = 600 cacheEventListeners:  hitCount = 0 memoryStoreHitCount = 0 diskStoreHitCount = 0 missCountNotFound = 0 missCountExpired = 0 ]
DEBUG|main|10506|Registry:commons-configuration - Creating a default configuration - no configuration was provided
DEBUG|main|10513|Registry:commons-configuration - Creating a default configuration - no configuration was provided
DEBUG|main|10619|CacheManager                   - Attempting to create an existing singleton. Existing singleton returned.
DEBUG|main|10619|MemoryStore                    - Initialized net.sf.ehcache.store.LruMemoryStore for cache
DEBUG|main|10620|LruMemoryStore                 - cache Cache: Using SpoolingLinkedHashMap implementation
DEBUG|main|10620|Cache                          - Initialised cache: cache

.\ testGetInSecondProxiedRepo() \._________________________________________

DEBUG|main|10622|RepositoryProxyConnectors:default - Attempting connector: ProxyConnector[
  source:ArchivaRepository[default-managed-repository,file:/export/home/build/data/continuum/checkouts/282/target/test-repository/managed/]
  target:ArchivaRepository[proxied1,file:/export/home/build/data/continuum/checkouts/282/src/test/repositories/proxied1/]
  proxyId:null
  policy[releases]:ignored
  policy[snapshots]:ignored
  policy[cache-failures]:ignored
  policy[checksum]:fix
]
DEBUG|main|10623|RepositoryProxyConnectors:default - Using target repository: proxied1 - layout: default - targetPath: org/apache/maven/test/get-in-second-proxy/1.0/get-in-second-proxy-1.0.jar
DEBUG|main|10623|RepositoryProxyConnectors:default - Applying [releases] policy with [ignored]
DEBUG|main|10623|PreDownloadPolicy:releases     - OK to update, releases policy set to IGNORED.
DEBUG|main|10623|RepositoryProxyConnectors:default - Applying [snapshots] policy with [ignored]
DEBUG|main|10623|PreDownloadPolicy:snapshots    - OK to update, snapshots policy set to IGNORED.
DEBUG|main|10624|RepositoryProxyConnectors:default - Applying [cache-failures] policy with [ignored]
DEBUG|main|10624|PreDownloadPolicy:cache-failures - OK to fetch, check-failures policy set to IGNORED.
DEBUG|main|10624|RepositoryProxyConnectors:default - Retrieving org/apache/maven/test/get-in-second-proxy/1.0/get-in-second-proxy-1.0.jar from Proxied Repository 1 if updated
 WARN|main|10624|RepositoryProxyConnectors:default - Resource does not exist: File: /export/home/build/data/continuum/checkouts/282/src/test/repositories/proxied1/org/apache/maven/test/get-in-second-proxy/1.0/get-in-second-proxy-1.0.jar does not exist
DEBUG|main|10625|RepositoryProxyConnectors:default - Attempting connector: ProxyConnector[
  source:ArchivaRepository[default-managed-repository,file:/export/home/build/data/continuum/checkouts/282/target/test-repository/managed/]
  target:ArchivaRepository[proxied2,file:/export/home/build/data/continuum/checkouts/282/src/test/repositories/proxied2/]
  proxyId:null
  policy[releases]:ignored
  policy[snapshots]:ignored
  policy[cache-failures]:ignored
  policy[checksum]:fix
]
DEBUG|main|10625|RepositoryProxyConnectors:default - Using target repository: proxied2 - layout: default - targetPath: org/apache/maven/test/get-in-second-proxy/1.0/get-in-second-proxy-1.0.jar
DEBUG|main|10625|RepositoryProxyConnectors:default - Applying [releases] policy with [ignored]
DEBUG|main|10625|PreDownloadPolicy:releases     - OK to update, releases policy set to IGNORED.
DEBUG|main|10626|RepositoryProxyConnectors:default - Applying [snapshots] policy with [ignored]
DEBUG|main|10626|PreDownloadPolicy:snapshots    - OK to update, snapshots policy set to IGNORED.
DEBUG|main|10626|RepositoryProxyConnectors:default - Applying [cache-failures] policy with [ignored]
DEBUG|main|10626|PreDownloadPolicy:cache-failures - OK to fetch, check-failures policy set to IGNORED.
DEBUG|main|10626|RepositoryProxyConnectors:default - Retrieving org/apache/maven/test/get-in-second-proxy/1.0/get-in-second-proxy-1.0.jar from Proxied Repository 2 if updated
DEBUG|main|10627|RepositoryProxyConnectors:default - Downloaded successfully.
DEBUG|main|10627|RepositoryProxyConnectors:default - Retrieving org/apache/maven/test/get-in-second-proxy/1.0/get-in-second-proxy-1.0.jar.sha1 from Proxied Repository 2
 WARN|main|10628|RepositoryProxyConnectors:default - Resource does not exist: File: /export/home/build/data/continuum/checkouts/282/src/test/repositories/proxied2/org/apache/maven/test/get-in-second-proxy/1.0/get-in-second-proxy-1.0.jar.sha1 does not exist
DEBUG|main|10628|RepositoryProxyConnectors:default - Checksum.sha1 Not Download: File: /export/home/build/data/continuum/checkouts/282/src/test/repositories/proxied2/org/apache/maven/test/get-in-second-proxy/1.0/get-in-second-proxy-1.0.jar.sha1 does not exist
DEBUG|main|10628|RepositoryProxyConnectors:default - Retrieving org/apache/maven/test/get-in-second-proxy/1.0/get-in-second-proxy-1.0.jar.md5 from Proxied Repository 2
 WARN|main|10628|RepositoryProxyConnectors:default - Resource does not exist: File: /export/home/build/data/continuum/checkouts/282/src/test/repositories/proxied2/org/apache/maven/test/get-in-second-proxy/1.0/get-in-second-proxy-1.0.jar.md5 does not exist
DEBUG|main|10628|RepositoryProxyConnectors:default - Checksum.md5 Not Download: File: /export/home/build/data/continuum/checkouts/282/src/test/repositories/proxied2/org/apache/maven/test/get-in-second-proxy/1.0/get-in-second-proxy-1.0.jar.md5 does not exist
DEBUG|main|10628|RepositoryProxyConnectors:default - Applying [checksum] policy with [fix]
DEBUG|main|10629|PostDownloadPolicy:checksum    - Valid checksum: /export/home/build/data/continuum/checkouts/282/target/test-repository/managed/org/apache/maven/test/get-in-second-proxy/1.0/get-in-second-proxy-1.0.jar.sha1
DEBUG|main|10630|PostDownloadPolicy:checksum    - Valid checksum: /export/home/build/data/continuum/checkouts/282/target/test-repository/managed/org/apache/maven/test/get-in-second-proxy/1.0/get-in-second-proxy-1.0.jar.md5
 INFO|main|10630|RepositoryProxyConnectors:default - Successfully transfered: /export/home/build/data/continuum/checkouts/282/target/test-repository/managed/org/apache/maven/test/get-in-second-proxy/1.0/get-in-second-proxy-1.0.jar
 INFO|main|10630|Cache:url-failures-cache       - Disposing cache: [  name = cache status = STATUS_ALIVE eternal = false overflowToDisk = false maxElementsInMemory = 1000 maxElementsOnDisk = 0 memoryStoreEvictionPolicy = LRU timeToLiveSeconds = 1800 timeToIdleSeconds = 2700 diskPersistent = true diskExpiryThreadIntervalSeconds = 600 cacheEventListeners:  hitCount = 0 memoryStoreHitCount = 0 diskStoreHitCount = 0 missCountNotFound = 0 missCountExpired = 0 ]
DEBUG|main|10648|Registry:commons-configuration - Creating a default configuration - no configuration was provided
DEBUG|main|10655|Registry:commons-configuration - Creating a default configuration - no configuration was provided
DEBUG|main|10675|CacheManager                   - Attempting to create an existing singleton. Existing singleton returned.
DEBUG|main|10675|MemoryStore                    - Initialized net.sf.ehcache.store.LruMemoryStore for cache
DEBUG|main|10676|LruMemoryStore                 - cache Cache: Using SpoolingLinkedHashMap implementation
DEBUG|main|10676|Cache                          - Initialised cache: cache

.\ testNotFoundInAnyProxies() \._________________________________________

DEBUG|main|10679|RepositoryProxyConnectors:default - Attempting connector: ProxyConnector[
  source:ArchivaRepository[default-managed-repository,file:/export/home/build/data/continuum/checkouts/282/target/test-repository/managed/]
  target:ArchivaRepository[proxied1,file:/export/home/build/data/continuum/checkouts/282/src/test/repositories/proxied1/]
  proxyId:null
  policy[releases]:ignored
  policy[snapshots]:ignored
  policy[cache-failures]:ignored
  policy[checksum]:fix
]
DEBUG|main|10679|RepositoryProxyConnectors:default - Using target repository: proxied1 - layout: default - targetPath: org/apache/maven/test/does-not-exist/1.0/does-not-exist-1.0.jar
DEBUG|main|10680|RepositoryProxyConnectors:default - Applying [releases] policy with [ignored]
DEBUG|main|10680|PreDownloadPolicy:releases     - OK to update, releases policy set to IGNORED.
DEBUG|main|10680|RepositoryProxyConnectors:default - Applying [snapshots] policy with [ignored]
DEBUG|main|10680|PreDownloadPolicy:snapshots    - OK to update, snapshots policy set to IGNORED.
DEBUG|main|10680|RepositoryProxyConnectors:default - Applying [cache-failures] policy with [ignored]
DEBUG|main|10680|PreDownloadPolicy:cache-failures - OK to fetch, check-failures policy set to IGNORED.
DEBUG|main|10681|RepositoryProxyConnectors:default - Retrieving org/apache/maven/test/does-not-exist/1.0/does-not-exist-1.0.jar from Proxied Repository 1 if updated
 WARN|main|10681|RepositoryProxyConnectors:default - Resource does not exist: File: /export/home/build/data/continuum/checkouts/282/src/test/repositories/proxied1/org/apache/maven/test/does-not-exist/1.0/does-not-exist-1.0.jar does not exist
DEBUG|main|10681|RepositoryProxyConnectors:default - Attempting connector: ProxyConnector[
  source:ArchivaRepository[default-managed-repository,file:/export/home/build/data/continuum/checkouts/282/target/test-repository/managed/]
  target:ArchivaRepository[proxied2,file:/export/home/build/data/continuum/checkouts/282/src/test/repositories/proxied2/]
  proxyId:null
  policy[releases]:ignored
  policy[snapshots]:ignored
  policy[cache-failures]:ignored
  policy[checksum]:fix
]
DEBUG|main|10681|RepositoryProxyConnectors:default - Using target repository: proxied2 - layout: default - targetPath: org/apache/maven/test/does-not-exist/1.0/does-not-exist-1.0.jar
DEBUG|main|10682|RepositoryProxyConnectors:default - Applying [releases] policy with [ignored]
DEBUG|main|10682|PreDownloadPolicy:releases     - OK to update, releases policy set to IGNORED.
DEBUG|main|10682|RepositoryProxyConnectors:default - Applying [snapshots] policy with [ignored]
DEBUG|main|10682|PreDownloadPolicy:snapshots    - OK to update, snapshots policy set to IGNORED.
DEBUG|main|10682|RepositoryProxyConnectors:default - Applying [cache-failures] policy with [ignored]
DEBUG|main|10682|PreDownloadPolicy:cache-failures - OK to fetch, check-failures policy set to IGNORED.
DEBUG|main|10683|RepositoryProxyConnectors:default - Retrieving org/apache/maven/test/does-not-exist/1.0/does-not-exist-1.0.jar from Proxied Repository 2 if updated
 WARN|main|10683|RepositoryProxyConnectors:default - Resource does not exist: File: /export/home/build/data/continuum/checkouts/282/src/test/repositories/proxied2/org/apache/maven/test/does-not-exist/1.0/does-not-exist-1.0.jar does not exist
DEBUG|main|10683|RepositoryProxyConnectors:default - Attempting connector: ProxyConnector[
  source:ArchivaRepository[default-managed-repository,file:/export/home/build/data/continuum/checkouts/282/target/test-repository/managed/]
  target:ArchivaRepository[legacy-proxied,file:/export/home/build/data/continuum/checkouts/282/src/test/repositories/legacy-proxied/]
  proxyId:null
  policy[releases]:ignored
  policy[snapshots]:ignored
  policy[cache-failures]:ignored
  policy[checksum]:fix
]
DEBUG|main|10684|RepositoryProxyConnectors:default - Using target repository: legacy-proxied - layout: legacy - targetPath: org.apache.maven.test/jars/does-not-exist-1.0.jar
DEBUG|main|10684|RepositoryProxyConnectors:default - Applying [releases] policy with [ignored]
DEBUG|main|10684|PreDownloadPolicy:releases     - OK to update, releases policy set to IGNORED.
DEBUG|main|10684|RepositoryProxyConnectors:default - Applying [snapshots] policy with [ignored]
DEBUG|main|10684|PreDownloadPolicy:snapshots    - OK to update, snapshots policy set to IGNORED.
DEBUG|main|10684|RepositoryProxyConnectors:default - Applying [cache-failures] policy with [ignored]
DEBUG|main|10685|PreDownloadPolicy:cache-failures - OK to fetch, check-failures policy set to IGNORED.
DEBUG|main|10685|RepositoryProxyConnectors:default - Retrieving org.apache.maven.test/jars/does-not-exist-1.0.jar from Proxied Legacy Repository if updated
 WARN|main|10685|RepositoryProxyConnectors:default - Resource does not exist: File: /export/home/build/data/continuum/checkouts/282/src/test/repositories/legacy-proxied/org.apache.maven.test/jars/does-not-exist-1.0.jar does not exist
 INFO|main|10685|Cache:url-failures-cache       - Disposing cache: [  name = cache status = STATUS_ALIVE eternal = false overflowToDisk = false maxElementsInMemory = 1000 maxElementsOnDisk = 0 memoryStoreEvictionPolicy = LRU timeToLiveSeconds = 1800 timeToIdleSeconds = 2700 diskPersistent = true diskExpiryThreadIntervalSeconds = 600 cacheEventListeners:  hitCount = 0 memoryStoreHitCount = 0 diskStoreHitCount = 0 missCountNotFound = 0 missCountExpired = 0 ]
DEBUG|main|10702|Registry:commons-configuration - Creating a default configuration - no configuration was provided
DEBUG|main|10710|Registry:commons-configuration - Creating a default configuration - no configuration was provided
DEBUG|main|10790|CacheManager                   - Attempting to create an existing singleton. Existing singleton returned.
DEBUG|main|10794|MemoryStore                    - Initialized net.sf.ehcache.store.LruMemoryStore for cache
DEBUG|main|10795|LruMemoryStore                 - cache Cache: Using SpoolingLinkedHashMap implementation
DEBUG|main|10795|Cache                          - Initialised cache: cache

.\ testGetInSecondProxiedRepoFirstFails() \._________________________________________

DEBUG|main|10832|RepositoryProxyConnectors:default - Attempting connector: ProxyConnector[
  source:ArchivaRepository[default-managed-repository,file:/export/home/build/data/continuum/checkouts/282/target/test-repository/managed/]
  target:ArchivaRepository[badproxied,test://bad.machine.com/repo/]
  proxyId:null
  policy[releases]:ignored
  policy[snapshots]:ignored
  policy[cache-failures]:ignored
  policy[checksum]:fix
]
DEBUG|main|10834|RepositoryProxyConnectors:default - Using target repository: badproxied - layout: default - targetPath: org/apache/maven/test/get-in-second-proxy/1.0/get-in-second-proxy-1.0.jar
DEBUG|main|10834|RepositoryProxyConnectors:default - Applying [releases] policy with [ignored]
DEBUG|main|10834|PreDownloadPolicy:releases     - OK to update, releases policy set to IGNORED.
DEBUG|main|10834|RepositoryProxyConnectors:default - Applying [snapshots] policy with [ignored]
DEBUG|main|10834|PreDownloadPolicy:snapshots    - OK to update, snapshots policy set to IGNORED.
DEBUG|main|10834|RepositoryProxyConnectors:default - Applying [cache-failures] policy with [ignored]
DEBUG|main|10835|PreDownloadPolicy:cache-failures - OK to fetch, check-failures policy set to IGNORED.
DEBUG|main|10835|RepositoryProxyConnectors:default - Retrieving org/apache/maven/test/get-in-second-proxy/1.0/get-in-second-proxy-1.0.jar from Bad Proxied if updated
DEBUG|main|10835|Wagon:test                     - .getIfNewer(org/apache/maven/test/get-in-second-proxy/1.0/get-in-second-proxy-1.0.jar, /export/home/build/data/continuum/checkouts/282/target/test-repository/managed/org/apache/maven/test/get-in-second-proxy/1.0/get-in-second-proxy-1.0.jar.tmp, 0)
 WARN|main|10835|RepositoryProxyConnectors:default - Download failure:transfer failed
org.apache.maven.wagon.TransferFailedException: transfer failed
	at org.easymock.MockControl$4.invoke(MockControl.java:150)
	at org.easymock.internal.ObjectMethodsFilter.invoke(ObjectMethodsFilter.java:44)
	at $Proxy2.getIfNewer(Unknown Source)
	at org.apache.maven.archiva.proxy.WagonDelegate.getIfNewer(WagonDelegate.java:66)
	at org.apache.maven.archiva.proxy.DefaultRepositoryProxyConnectors.transferSimpleFile(DefaultRepositoryProxyConnectors.java:463)
	at org.apache.maven.archiva.proxy.DefaultRepositoryProxyConnectors.transferFile(DefaultRepositoryProxyConnectors.java:357)
	at org.apache.maven.archiva.proxy.DefaultRepositoryProxyConnectors.fetchFromProxies(DefaultRepositoryProxyConnectors.java:150)
	at org.apache.maven.archiva.proxy.ManagedDefaultTransferTest.testGetInSecondProxiedRepoFirstFails(ManagedDefaultTransferTest.java:278)
	at sun.reflect.NativeMethodAccessorImpl.invoke0(Native Method)
	at sun.reflect.NativeMethodAccessorImpl.invoke(NativeMethodAccessorImpl.java:39)
	at sun.reflect.DelegatingMethodAccessorImpl.invoke(DelegatingMethodAccessorImpl.java:25)
	at java.lang.reflect.Method.invoke(Method.java:585)
	at junit.framework.TestCase.runTest(TestCase.java:154)
	at junit.framework.TestCase.runBare(TestCase.java:127)
	at junit.framework.TestResult$1.protect(TestResult.java:106)
	at junit.framework.TestResult.runProtected(TestResult.java:124)
	at junit.framework.TestResult.run(TestResult.java:109)
	at junit.framework.TestCase.run(TestCase.java:118)
	at junit.framework.TestSuite.runTest(TestSuite.java:208)
	at junit.framework.TestSuite.run(TestSuite.java:203)
	at sun.reflect.NativeMethodAccessorImpl.invoke0(Native Method)
	at sun.reflect.NativeMethodAccessorImpl.invoke(NativeMethodAccessorImpl.java:39)
	at sun.reflect.DelegatingMethodAccessorImpl.invoke(DelegatingMethodAccessorImpl.java:25)
	at java.lang.reflect.Method.invoke(Method.java:585)
	at org.apache.maven.surefire.junit.JUnitTestSet.execute(JUnitTestSet.java:210)
	at org.apache.maven.surefire.suite.AbstractDirectoryTestSuite.executeTestSet(AbstractDirectoryTestSuite.java:135)
	at org.apache.maven.surefire.suite.AbstractDirectoryTestSuite.execute(AbstractDirectoryTestSuite.java:122)
	at org.apache.maven.surefire.Surefire.run(Surefire.java:129)
	at sun.reflect.NativeMethodAccessorImpl.invoke0(Native Method)
	at sun.reflect.NativeMethodAccessorImpl.invoke(NativeMethodAccessorImpl.java:39)
	at sun.reflect.DelegatingMethodAccessorImpl.invoke(DelegatingMethodAccessorImpl.java:25)
	at java.lang.reflect.Method.invoke(Method.java:585)
	at org.apache.maven.surefire.booter.SurefireBooter.runSuitesInProcess(SurefireBooter.java:225)
	at org.apache.maven.surefire.booter.SurefireBooter.main(SurefireBooter.java:747)
DEBUG|main|10840|RepositoryProxyConnectors:default - Attempting connector: ProxyConnector[
  source:ArchivaRepository[default-managed-repository,file:/export/home/build/data/continuum/checkouts/282/target/test-repository/managed/]
  target:ArchivaRepository[proxied2,file:/export/home/build/data/continuum/checkouts/282/src/test/repositories/proxied2/]
  proxyId:null
  policy[releases]:ignored
  policy[snapshots]:ignored
  policy[cache-failures]:ignored
  policy[checksum]:fix
]
DEBUG|main|10841|RepositoryProxyConnectors:default - Using target repository: proxied2 - layout: default - targetPath: org/apache/maven/test/get-in-second-proxy/1.0/get-in-second-proxy-1.0.jar
DEBUG|main|10841|RepositoryProxyConnectors:default - Applying [releases] policy with [ignored]
DEBUG|main|10841|PreDownloadPolicy:releases     - OK to update, releases policy set to IGNORED.
DEBUG|main|10841|RepositoryProxyConnectors:default - Applying [snapshots] policy with [ignored]
DEBUG|main|10841|PreDownloadPolicy:snapshots    - OK to update, snapshots policy set to IGNORED.
DEBUG|main|10841|RepositoryProxyConnectors:default - Applying [cache-failures] policy with [ignored]
DEBUG|main|10841|PreDownloadPolicy:cache-failures - OK to fetch, check-failures policy set to IGNORED.
DEBUG|main|10842|RepositoryProxyConnectors:default - Retrieving org/apache/maven/test/get-in-second-proxy/1.0/get-in-second-proxy-1.0.jar from Proxied Repository 2 if updated
DEBUG|main|10842|RepositoryProxyConnectors:default - Downloaded successfully.
DEBUG|main|10843|RepositoryProxyConnectors:default - Retrieving org/apache/maven/test/get-in-second-proxy/1.0/get-in-second-proxy-1.0.jar.sha1 from Proxied Repository 2
 WARN|main|10843|RepositoryProxyConnectors:default - Resource does not exist: File: /export/home/build/data/continuum/checkouts/282/src/test/repositories/proxied2/org/apache/maven/test/get-in-second-proxy/1.0/get-in-second-proxy-1.0.jar.sha1 does not exist
DEBUG|main|10844|RepositoryProxyConnectors:default - Checksum.sha1 Not Download: File: /export/home/build/data/continuum/checkouts/282/src/test/repositories/proxied2/org/apache/maven/test/get-in-second-proxy/1.0/get-in-second-proxy-1.0.jar.sha1 does not exist
DEBUG|main|10844|RepositoryProxyConnectors:default - Retrieving org/apache/maven/test/get-in-second-proxy/1.0/get-in-second-proxy-1.0.jar.md5 from Proxied Repository 2
 WARN|main|10846|RepositoryProxyConnectors:default - Resource does not exist: File: /export/home/build/data/continuum/checkouts/282/src/test/repositories/proxied2/org/apache/maven/test/get-in-second-proxy/1.0/get-in-second-proxy-1.0.jar.md5 does not exist
DEBUG|main|10846|RepositoryProxyConnectors:default - Checksum.md5 Not Download: File: /export/home/build/data/continuum/checkouts/282/src/test/repositories/proxied2/org/apache/maven/test/get-in-second-proxy/1.0/get-in-second-proxy-1.0.jar.md5 does not exist
DEBUG|main|10846|RepositoryProxyConnectors:default - Applying [checksum] policy with [fix]
DEBUG|main|10847|PostDownloadPolicy:checksum    - Valid checksum: /export/home/build/data/continuum/checkouts/282/target/test-repository/managed/org/apache/maven/test/get-in-second-proxy/1.0/get-in-second-proxy-1.0.jar.sha1
DEBUG|main|10847|PostDownloadPolicy:checksum    - Valid checksum: /export/home/build/data/continuum/checkouts/282/target/test-repository/managed/org/apache/maven/test/get-in-second-proxy/1.0/get-in-second-proxy-1.0.jar.md5
 INFO|main|10847|RepositoryProxyConnectors:default - Successfully transfered: /export/home/build/data/continuum/checkouts/282/target/test-repository/managed/org/apache/maven/test/get-in-second-proxy/1.0/get-in-second-proxy-1.0.jar
 INFO|main|10848|Cache:url-failures-cache       - Disposing cache: [  name = cache status = STATUS_ALIVE eternal = false overflowToDisk = false maxElementsInMemory = 1000 maxElementsOnDisk = 0 memoryStoreEvictionPolicy = LRU timeToLiveSeconds = 1800 timeToIdleSeconds = 2700 diskPersistent = true diskExpiryThreadIntervalSeconds = 600 cacheEventListeners:  hitCount = 0 memoryStoreHitCount = 0 diskStoreHitCount = 0 missCountNotFound = 0 missCountExpired = 0 ]
DEBUG|main|11523|Registry:commons-configuration - Creating a default configuration - no configuration was provided
DEBUG|main|11530|Registry:commons-configuration - Creating a default configuration - no configuration was provided
DEBUG|main|12009|CacheManager                   - Attempting to create an existing singleton. Existing singleton returned.
DEBUG|main|12010|MemoryStore                    - Initialized net.sf.ehcache.store.LruMemoryStore for cache
DEBUG|main|12010|LruMemoryStore                 - cache Cache: Using SpoolingLinkedHashMap implementation
DEBUG|main|12010|Cache                          - Initialised cache: cache

.\ testGetAllRepositoriesFail() \._________________________________________

DEBUG|main|12013|RepositoryProxyConnectors:default - Attempting connector: ProxyConnector[
  source:ArchivaRepository[default-managed-repository,file:/export/home/build/data/continuum/checkouts/282/target/test-repository/managed/]
  target:ArchivaRepository[badproxied1,test://bad.machine.com/repo/]
  proxyId:null
  policy[releases]:ignored
  policy[snapshots]:ignored
  policy[cache-failures]:ignored
  policy[checksum]:fix
]
DEBUG|main|12014|RepositoryProxyConnectors:default - Using target repository: badproxied1 - layout: default - targetPath: org/apache/maven/test/get-in-second-proxy/1.0/get-in-second-proxy-1.0.jar
DEBUG|main|12014|RepositoryProxyConnectors:default - Applying [releases] policy with [ignored]
DEBUG|main|12015|PreDownloadPolicy:releases     - OK to update, releases policy set to IGNORED.
DEBUG|main|12015|RepositoryProxyConnectors:default - Applying [snapshots] policy with [ignored]
DEBUG|main|12015|PreDownloadPolicy:snapshots    - OK to update, snapshots policy set to IGNORED.
DEBUG|main|12015|RepositoryProxyConnectors:default - Applying [cache-failures] policy with [ignored]
DEBUG|main|12015|PreDownloadPolicy:cache-failures - OK to fetch, check-failures policy set to IGNORED.
DEBUG|main|12015|RepositoryProxyConnectors:default - Retrieving org/apache/maven/test/get-in-second-proxy/1.0/get-in-second-proxy-1.0.jar from Bad Proxied 1 if updated
DEBUG|main|12016|Wagon:test                     - .getIfNewer(org/apache/maven/test/get-in-second-proxy/1.0/get-in-second-proxy-1.0.jar, /export/home/build/data/continuum/checkouts/282/target/test-repository/managed/org/apache/maven/test/get-in-second-proxy/1.0/get-in-second-proxy-1.0.jar.tmp, 0)
 WARN|main|12016|RepositoryProxyConnectors:default - Download failure:transfer failed
org.apache.maven.wagon.TransferFailedException: transfer failed
	at org.easymock.MockControl$4.invoke(MockControl.java:150)
	at org.easymock.internal.ObjectMethodsFilter.invoke(ObjectMethodsFilter.java:44)
	at $Proxy2.getIfNewer(Unknown Source)
	at org.apache.maven.archiva.proxy.WagonDelegate.getIfNewer(WagonDelegate.java:66)
	at org.apache.maven.archiva.proxy.DefaultRepositoryProxyConnectors.transferSimpleFile(DefaultRepositoryProxyConnectors.java:463)
	at org.apache.maven.archiva.proxy.DefaultRepositoryProxyConnectors.transferFile(DefaultRepositoryProxyConnectors.java:357)
	at org.apache.maven.archiva.proxy.DefaultRepositoryProxyConnectors.fetchFromProxies(DefaultRepositoryProxyConnectors.java:150)
	at org.apache.maven.archiva.proxy.ManagedDefaultTransferTest.testGetAllRepositoriesFail(ManagedDefaultTransferTest.java:315)
	at sun.reflect.NativeMethodAccessorImpl.invoke0(Native Method)
	at sun.reflect.NativeMethodAccessorImpl.invoke(NativeMethodAccessorImpl.java:39)
	at sun.reflect.DelegatingMethodAccessorImpl.invoke(DelegatingMethodAccessorImpl.java:25)
	at java.lang.reflect.Method.invoke(Method.java:585)
	at junit.framework.TestCase.runTest(TestCase.java:154)
	at junit.framework.TestCase.runBare(TestCase.java:127)
	at junit.framework.TestResult$1.protect(TestResult.java:106)
	at junit.framework.TestResult.runProtected(TestResult.java:124)
	at junit.framework.TestResult.run(TestResult.java:109)
	at junit.framework.TestCase.run(TestCase.java:118)
	at junit.framework.TestSuite.runTest(TestSuite.java:208)
	at junit.framework.TestSuite.run(TestSuite.java:203)
	at sun.reflect.NativeMethodAccessorImpl.invoke0(Native Method)
	at sun.reflect.NativeMethodAccessorImpl.invoke(NativeMethodAccessorImpl.java:39)
	at sun.reflect.DelegatingMethodAccessorImpl.invoke(DelegatingMethodAccessorImpl.java:25)
	at java.lang.reflect.Method.invoke(Method.java:585)
	at org.apache.maven.surefire.junit.JUnitTestSet.execute(JUnitTestSet.java:210)
	at org.apache.maven.surefire.suite.AbstractDirectoryTestSuite.executeTestSet(AbstractDirectoryTestSuite.java:135)
	at org.apache.maven.surefire.suite.AbstractDirectoryTestSuite.execute(AbstractDirectoryTestSuite.java:122)
	at org.apache.maven.surefire.Surefire.run(Surefire.java:129)
	at sun.reflect.NativeMethodAccessorImpl.invoke0(Native Method)
	at sun.reflect.NativeMethodAccessorImpl.invoke(NativeMethodAccessorImpl.java:39)
	at sun.reflect.DelegatingMethodAccessorImpl.invoke(DelegatingMethodAccessorImpl.java:25)
	at java.lang.reflect.Method.invoke(Method.java:585)
	at org.apache.maven.surefire.booter.SurefireBooter.runSuitesInProcess(SurefireBooter.java:225)
	at org.apache.maven.surefire.booter.SurefireBooter.main(SurefireBooter.java:747)
DEBUG|main|12019|RepositoryProxyConnectors:default - Attempting connector: ProxyConnector[
  source:ArchivaRepository[default-managed-repository,file:/export/home/build/data/continuum/checkouts/282/target/test-repository/managed/]
  target:ArchivaRepository[badproxied2,test://dead.machine.com/repo/]
  proxyId:null
  policy[releases]:ignored
  policy[snapshots]:ignored
  policy[cache-failures]:ignored
  policy[checksum]:fix
]
DEBUG|main|12019|RepositoryProxyConnectors:default - Using target repository: badproxied2 - layout: default - targetPath: org/apache/maven/test/get-in-second-proxy/1.0/get-in-second-proxy-1.0.jar
DEBUG|main|12020|RepositoryProxyConnectors:default - Applying [releases] policy with [ignored]
DEBUG|main|12020|PreDownloadPolicy:releases     - OK to update, releases policy set to IGNORED.
DEBUG|main|12020|RepositoryProxyConnectors:default - Applying [snapshots] policy with [ignored]
DEBUG|main|12020|PreDownloadPolicy:snapshots    - OK to update, snapshots policy set to IGNORED.
DEBUG|main|12020|RepositoryProxyConnectors:default - Applying [cache-failures] policy with [ignored]
DEBUG|main|12020|PreDownloadPolicy:cache-failures - OK to fetch, check-failures policy set to IGNORED.
DEBUG|main|12021|RepositoryProxyConnectors:default - Retrieving org/apache/maven/test/get-in-second-proxy/1.0/get-in-second-proxy-1.0.jar from Bad Proxied 2 if updated
DEBUG|main|12021|Wagon:test                     - .getIfNewer(org/apache/maven/test/get-in-second-proxy/1.0/get-in-second-proxy-1.0.jar, /export/home/build/data/continuum/checkouts/282/target/test-repository/managed/org/apache/maven/test/get-in-second-proxy/1.0/get-in-second-proxy-1.0.jar.tmp, 0)
 WARN|main|12021|RepositoryProxyConnectors:default - Download failure:transfer failed
org.apache.maven.wagon.TransferFailedException: transfer failed
	at org.easymock.MockControl$4.invoke(MockControl.java:150)
	at org.easymock.internal.ObjectMethodsFilter.invoke(ObjectMethodsFilter.java:44)
	at $Proxy2.getIfNewer(Unknown Source)
	at org.apache.maven.archiva.proxy.WagonDelegate.getIfNewer(WagonDelegate.java:66)
	at org.apache.maven.archiva.proxy.DefaultRepositoryProxyConnectors.transferSimpleFile(DefaultRepositoryProxyConnectors.java:463)
	at org.apache.maven.archiva.proxy.DefaultRepositoryProxyConnectors.transferFile(DefaultRepositoryProxyConnectors.java:357)
	at org.apache.maven.archiva.proxy.DefaultRepositoryProxyConnectors.fetchFromProxies(DefaultRepositoryProxyConnectors.java:150)
	at org.apache.maven.archiva.proxy.ManagedDefaultTransferTest.testGetAllRepositoriesFail(ManagedDefaultTransferTest.java:315)
	at sun.reflect.NativeMethodAccessorImpl.invoke0(Native Method)
	at sun.reflect.NativeMethodAccessorImpl.invoke(NativeMethodAccessorImpl.java:39)
	at sun.reflect.DelegatingMethodAccessorImpl.invoke(DelegatingMethodAccessorImpl.java:25)
	at java.lang.reflect.Method.invoke(Method.java:585)
	at junit.framework.TestCase.runTest(TestCase.java:154)
	at junit.framework.TestCase.runBare(TestCase.java:127)
	at junit.framework.TestResult$1.protect(TestResult.java:106)
	at junit.framework.TestResult.runProtected(TestResult.java:124)
	at junit.framework.TestResult.run(TestResult.java:109)
	at junit.framework.TestCase.run(TestCase.java:118)
	at junit.framework.TestSuite.runTest(TestSuite.java:208)
	at junit.framework.TestSuite.run(TestSuite.java:203)
	at sun.reflect.NativeMethodAccessorImpl.invoke0(Native Method)
	at sun.reflect.NativeMethodAccessorImpl.invoke(NativeMethodAccessorImpl.java:39)
	at sun.reflect.DelegatingMethodAccessorImpl.invoke(DelegatingMethodAccessorImpl.java:25)
	at java.lang.reflect.Method.invoke(Method.java:585)
	at org.apache.maven.surefire.junit.JUnitTestSet.execute(JUnitTestSet.java:210)
	at org.apache.maven.surefire.suite.AbstractDirectoryTestSuite.executeTestSet(AbstractDirectoryTestSuite.java:135)
	at org.apache.maven.surefire.suite.AbstractDirectoryTestSuite.execute(AbstractDirectoryTestSuite.java:122)
	at org.apache.maven.surefire.Surefire.run(Surefire.java:129)
	at sun.reflect.NativeMethodAccessorImpl.invoke0(Native Method)
	at sun.reflect.NativeMethodAccessorImpl.invoke(NativeMethodAccessorImpl.java:39)
	at sun.reflect.DelegatingMethodAccessorImpl.invoke(DelegatingMethodAccessorImpl.java:25)
	at java.lang.reflect.Method.invoke(Method.java:585)
	at org.apache.maven.surefire.booter.SurefireBooter.runSuitesInProcess(SurefireBooter.java:225)
	at org.apache.maven.surefire.booter.SurefireBooter.main(SurefireBooter.java:747)
 INFO|main|12025|Cache:url-failures-cache       - Disposing cache: [  name = cache status = STATUS_ALIVE eternal = false overflowToDisk = false maxElementsInMemory = 1000 maxElementsOnDisk = 0 memoryStoreEvictionPolicy = LRU timeToLiveSeconds = 1800 timeToIdleSeconds = 2700 diskPersistent = true diskExpiryThreadIntervalSeconds = 600 cacheEventListeners:  hitCount = 0 memoryStoreHitCount = 0 diskStoreHitCount = 0 missCountNotFound = 0 missCountExpired = 0 ]
DEBUG|main|12043|Registry:commons-configuration - Creating a default configuration - no configuration was provided
DEBUG|main|12069|Registry:commons-configuration - Creating a default configuration - no configuration was provided
DEBUG|main|12111|CacheManager                   - Attempting to create an existing singleton. Existing singleton returned.
DEBUG|main|12112|MemoryStore                    - Initialized net.sf.ehcache.store.LruMemoryStore for cache
DEBUG|main|12112|LruMemoryStore                 - cache Cache: Using SpoolingLinkedHashMap implementation
DEBUG|main|12112|Cache                          - Initialised cache: cache

.\ testLegacyProxyRepoGetAlreadyPresent() \._________________________________________

DEBUG|main|12114|RepositoryProxyConnectors:default - Attempting connector: ProxyConnector[
  source:ArchivaRepository[default-managed-repository,file:/export/home/build/data/continuum/checkouts/282/target/test-repository/managed/]
  target:ArchivaRepository[legacy-proxied,file:/export/home/build/data/continuum/checkouts/282/src/test/repositories/legacy-proxied/]
  proxyId:null
  policy[releases]:ignored
  policy[snapshots]:ignored
  policy[cache-failures]:ignored
  policy[checksum]:ignored
]
DEBUG|main|12115|RepositoryProxyConnectors:default - Using target repository: legacy-proxied - layout: legacy - targetPath: org.apache.maven.test/jars/get-default-layout-present-1.0.jar
DEBUG|main|12115|RepositoryProxyConnectors:default - Applying [releases] policy with [ignored]
DEBUG|main|12115|PreDownloadPolicy:releases     - OK to update, releases policy set to IGNORED.
DEBUG|main|12116|RepositoryProxyConnectors:default - Applying [snapshots] policy with [ignored]
DEBUG|main|12116|PreDownloadPolicy:snapshots    - OK to update, snapshots policy set to IGNORED.
DEBUG|main|12116|RepositoryProxyConnectors:default - Applying [cache-failures] policy with [ignored]
DEBUG|main|12116|PreDownloadPolicy:cache-failures - OK to fetch, check-failures policy set to IGNORED.
DEBUG|main|12116|RepositoryProxyConnectors:default - Retrieving org.apache.maven.test/jars/get-default-layout-present-1.0.jar from Proxied Legacy Repository
DEBUG|main|12118|RepositoryProxyConnectors:default - Downloaded successfully.
DEBUG|main|12119|RepositoryProxyConnectors:default - Retrieving org.apache.maven.test/jars/get-default-layout-present-1.0.jar.sha1 from Proxied Legacy Repository
 WARN|main|12119|RepositoryProxyConnectors:default - Resource does not exist: File: /export/home/build/data/continuum/checkouts/282/src/test/repositories/legacy-proxied/org.apache.maven.test/jars/get-default-layout-present-1.0.jar.sha1 does not exist
DEBUG|main|12123|RepositoryProxyConnectors:default - Checksum.sha1 Not Download: File: /export/home/build/data/continuum/checkouts/282/src/test/repositories/legacy-proxied/org.apache.maven.test/jars/get-default-layout-present-1.0.jar.sha1 does not exist
DEBUG|main|12123|RepositoryProxyConnectors:default - Retrieving org.apache.maven.test/jars/get-default-layout-present-1.0.jar.md5 from Proxied Legacy Repository
 WARN|main|12124|RepositoryProxyConnectors:default - Resource does not exist: File: /export/home/build/data/continuum/checkouts/282/src/test/repositories/legacy-proxied/org.apache.maven.test/jars/get-default-layout-present-1.0.jar.md5 does not exist
DEBUG|main|12124|RepositoryProxyConnectors:default - Checksum.md5 Not Download: File: /export/home/build/data/continuum/checkouts/282/src/test/repositories/legacy-proxied/org.apache.maven.test/jars/get-default-layout-present-1.0.jar.md5 does not exist
DEBUG|main|12124|RepositoryProxyConnectors:default - Applying [checksum] policy with [ignored]
 INFO|main|12124|RepositoryProxyConnectors:default - Successfully transfered: /export/home/build/data/continuum/checkouts/282/target/test-repository/managed/org/apache/maven/test/get-default-layout-present/1.0/get-default-layout-present-1.0.jar
 INFO|main|12126|Cache:url-failures-cache       - Disposing cache: [  name = cache status = STATUS_ALIVE eternal = false overflowToDisk = false maxElementsInMemory = 1000 maxElementsOnDisk = 0 memoryStoreEvictionPolicy = LRU timeToLiveSeconds = 1800 timeToIdleSeconds = 2700 diskPersistent = true diskExpiryThreadIntervalSeconds = 600 cacheEventListeners:  hitCount = 0 memoryStoreHitCount = 0 diskStoreHitCount = 0 missCountNotFound = 0 missCountExpired = 0 ]
DEBUG|main|12199|Registry:commons-configuration - Creating a default configuration - no configuration was provided
DEBUG|main|12206|Registry:commons-configuration - Creating a default configuration - no configuration was provided
DEBUG|main|12224|CacheManager                   - Attempting to create an existing singleton. Existing singleton returned.
DEBUG|main|12225|MemoryStore                    - Initialized net.sf.ehcache.store.LruMemoryStore for cache
DEBUG|main|12225|LruMemoryStore                 - cache Cache: Using SpoolingLinkedHashMap implementation
DEBUG|main|12225|Cache                          - Initialised cache: cache

.\ testLegacyRequestConvertedToDefaultPathInManagedRepo() \._________________________________________

DEBUG|main|12236|RepositoryProxyConnectors:default - Attempting connector: ProxyConnector[
  source:ArchivaRepository[default-managed-repository,file:/export/home/build/data/continuum/checkouts/282/target/test-repository/managed/]
  target:ArchivaRepository[legacy-proxied,file:/export/home/build/data/continuum/checkouts/282/src/test/repositories/legacy-proxied/]
  proxyId:null
  policy[releases]:ignored
  policy[snapshots]:ignored
  policy[cache-failures]:ignored
  policy[checksum]:ignored
]
DEBUG|main|12237|RepositoryProxyConnectors:default - Using target repository: legacy-proxied - layout: legacy - targetPath: org.apache.maven.test/jars/get-default-layout-present-1.0.jar
DEBUG|main|12237|RepositoryProxyConnectors:default - Applying [releases] policy with [ignored]
DEBUG|main|12237|PreDownloadPolicy:releases     - OK to update, releases policy set to IGNORED.
DEBUG|main|12238|RepositoryProxyConnectors:default - Applying [snapshots] policy with [ignored]
DEBUG|main|12238|PreDownloadPolicy:snapshots    - OK to update, snapshots policy set to IGNORED.
DEBUG|main|12238|RepositoryProxyConnectors:default - Applying [cache-failures] policy with [ignored]
DEBUG|main|12238|PreDownloadPolicy:cache-failures - OK to fetch, check-failures policy set to IGNORED.
DEBUG|main|12238|RepositoryProxyConnectors:default - Retrieving org.apache.maven.test/jars/get-default-layout-present-1.0.jar from Proxied Legacy Repository if updated
DEBUG|main|12239|RepositoryProxyConnectors:default - Downloaded successfully.
DEBUG|main|12239|RepositoryProxyConnectors:default - Retrieving org.apache.maven.test/jars/get-default-layout-present-1.0.jar.sha1 from Proxied Legacy Repository
 WARN|main|12240|RepositoryProxyConnectors:default - Resource does not exist: File: /export/home/build/data/continuum/checkouts/282/src/test/repositories/legacy-proxied/org.apache.maven.test/jars/get-default-layout-present-1.0.jar.sha1 does not exist
DEBUG|main|12240|RepositoryProxyConnectors:default - Checksum.sha1 Not Download: File: /export/home/build/data/continuum/checkouts/282/src/test/repositories/legacy-proxied/org.apache.maven.test/jars/get-default-layout-present-1.0.jar.sha1 does not exist
DEBUG|main|12240|RepositoryProxyConnectors:default - Retrieving org.apache.maven.test/jars/get-default-layout-present-1.0.jar.md5 from Proxied Legacy Repository
 WARN|main|12240|RepositoryProxyConnectors:default - Resource does not exist: File: /export/home/build/data/continuum/checkouts/282/src/test/repositories/legacy-proxied/org.apache.maven.test/jars/get-default-layout-present-1.0.jar.md5 does not exist
DEBUG|main|12240|RepositoryProxyConnectors:default - Checksum.md5 Not Download: File: /export/home/build/data/continuum/checkouts/282/src/test/repositories/legacy-proxied/org.apache.maven.test/jars/get-default-layout-present-1.0.jar.md5 does not exist
DEBUG|main|12240|RepositoryProxyConnectors:default - Applying [checksum] policy with [ignored]
 INFO|main|12240|RepositoryProxyConnectors:default - Successfully transfered: /export/home/build/data/continuum/checkouts/282/target/test-repository/managed/org/apache/maven/test/get-default-layout-present/1.0/get-default-layout-present-1.0.jar
 INFO|main|12241|Cache:url-failures-cache       - Disposing cache: [  name = cache status = STATUS_ALIVE eternal = false overflowToDisk = false maxElementsInMemory = 1000 maxElementsOnDisk = 0 memoryStoreEvictionPolicy = LRU timeToLiveSeconds = 1800 timeToIdleSeconds = 2700 diskPersistent = true diskExpiryThreadIntervalSeconds = 600 cacheEventListeners:  hitCount = 0 memoryStoreHitCount = 0 diskStoreHitCount = 0 missCountNotFound = 0 missCountExpired = 0 ]
DEBUG|main|12528|Registry:commons-configuration - Creating a default configuration - no configuration was provided
DEBUG|main|12532|Registry:commons-configuration - Creating a default configuration - no configuration was provided
DEBUG|main|13086|CacheManager                   - Attempting to create an existing singleton. Existing singleton returned.
DEBUG|main|13086|MemoryStore                    - Initialized net.sf.ehcache.store.LruMemoryStore for cache
DEBUG|main|13086|LruMemoryStore                 - cache Cache: Using SpoolingLinkedHashMap implementation
DEBUG|main|13086|Cache                          - Initialised cache: cache

.\ testLegacyProxyRepoGetNotPresent() \._________________________________________

DEBUG|main|13089|RepositoryProxyConnectors:default - Attempting connector: ProxyConnector[
  source:ArchivaRepository[default-managed-repository,file:/export/home/build/data/continuum/checkouts/282/target/test-repository/managed/]
  target:ArchivaRepository[legacy-proxied,file:/export/home/build/data/continuum/checkouts/282/src/test/repositories/legacy-proxied/]
  proxyId:null
  policy[releases]:ignored
  policy[snapshots]:ignored
  policy[cache-failures]:ignored
  policy[checksum]:ignored
]
DEBUG|main|13090|RepositoryProxyConnectors:default - Using target repository: legacy-proxied - layout: legacy - targetPath: org.apache.maven.test/jars/get-default-layout-1.0.jar
DEBUG|main|13090|RepositoryProxyConnectors:default - Applying [releases] policy with [ignored]
DEBUG|main|13090|PreDownloadPolicy:releases     - OK to update, releases policy set to IGNORED.
DEBUG|main|13090|RepositoryProxyConnectors:default - Applying [snapshots] policy with [ignored]
DEBUG|main|13090|PreDownloadPolicy:snapshots    - OK to update, snapshots policy set to IGNORED.
DEBUG|main|13090|RepositoryProxyConnectors:default - Applying [cache-failures] policy with [ignored]
DEBUG|main|13091|PreDownloadPolicy:cache-failures - OK to fetch, check-failures policy set to IGNORED.
DEBUG|main|13091|RepositoryProxyConnectors:default - Retrieving org.apache.maven.test/jars/get-default-layout-1.0.jar from Proxied Legacy Repository if updated
DEBUG|main|13091|RepositoryProxyConnectors:default - Downloaded successfully.
DEBUG|main|13092|RepositoryProxyConnectors:default - Retrieving org.apache.maven.test/jars/get-default-layout-1.0.jar.sha1 from Proxied Legacy Repository
 WARN|main|13092|RepositoryProxyConnectors:default - Resource does not exist: File: /export/home/build/data/continuum/checkouts/282/src/test/repositories/legacy-proxied/org.apache.maven.test/jars/get-default-layout-1.0.jar.sha1 does not exist
DEBUG|main|13092|RepositoryProxyConnectors:default - Checksum.sha1 Not Download: File: /export/home/build/data/continuum/checkouts/282/src/test/repositories/legacy-proxied/org.apache.maven.test/jars/get-default-layout-1.0.jar.sha1 does not exist
DEBUG|main|13093|RepositoryProxyConnectors:default - Retrieving org.apache.maven.test/jars/get-default-layout-1.0.jar.md5 from Proxied Legacy Repository
 WARN|main|13093|RepositoryProxyConnectors:default - Resource does not exist: File: /export/home/build/data/continuum/checkouts/282/src/test/repositories/legacy-proxied/org.apache.maven.test/jars/get-default-layout-1.0.jar.md5 does not exist
DEBUG|main|13093|RepositoryProxyConnectors:default - Checksum.md5 Not Download: File: /export/home/build/data/continuum/checkouts/282/src/test/repositories/legacy-proxied/org.apache.maven.test/jars/get-default-layout-1.0.jar.md5 does not exist
DEBUG|main|13093|RepositoryProxyConnectors:default - Applying [checksum] policy with [ignored]
 INFO|main|13093|RepositoryProxyConnectors:default - Successfully transfered: /export/home/build/data/continuum/checkouts/282/target/test-repository/managed/org/apache/maven/test/get-default-layout/1.0/get-default-layout-1.0.jar
 INFO|main|13094|Cache:url-failures-cache       - Disposing cache: [  name = cache status = STATUS_ALIVE eternal = false overflowToDisk = false maxElementsInMemory = 1000 maxElementsOnDisk = 0 memoryStoreEvictionPolicy = LRU timeToLiveSeconds = 1800 timeToIdleSeconds = 2700 diskPersistent = true diskExpiryThreadIntervalSeconds = 600 cacheEventListeners:  hitCount = 0 memoryStoreHitCount = 0 diskStoreHitCount = 0 missCountNotFound = 0 missCountExpired = 0 ]
Tests run: 12, Failures: 1, Errors: 0, Skipped: 0, Time elapsed: 3.459 sec <<< FAILURE!

Results :
Tests run: 47, Failures: 1, Errors: 0, Skipped: 0

 INFO|Thread-0|13382|CacheManager                   - VM shutting down with the CacheManager still active. Calling shutdown.
[INFO] ------------------------------------------------------------------------
[ERROR] BUILD FAILURE
[INFO] ------------------------------------------------------------------------
[INFO] There are test failures.
[INFO] ------------------------------------------------------------------------
[INFO] For more information, run Maven with the -e switch
[INFO] ------------------------------------------------------------------------
[INFO] Total time: 41 seconds
[INFO] Finished at: Tue Jul 24 09:15:50 GMT 2007
[INFO] Final Memory: 17M/330M
[INFO] ------------------------------------------------------------------------

****************************************************************************



Mime
View raw message