maven-notifications mailing list archives

Site index · List index
Message view « Date » · « Thread »
Top « Date » · « Thread »
From "Continuum@maven.zones.apache.org" <contin...@maven.zones.apache.org>
Subject [continuum] BUILD FAILURE: Maven Project Info Reports Plugin
Date Thu, 12 Jul 2007 00:46:58 GMT
Online report : http://maven.zones.apache.org/continuum/buildResult.action?buildId=11807&projectId=28
Build statistics:
  State: Failed
  Previous State: Failed
  Started at: Thu 12 Jul 2007 00:46:05 +0000
  Finished at: Thu 12 Jul 2007 00:46:57 +0000
  Total time: 52s
  Build Trigger: Forced
  Build Number: 42
  Exit code: 1
  Building machine hostname: maven.zones.apache.org
  Operating system : SunOS(unknown)
  Java version : 1.5.0_12(Sun Microsystems Inc.)

****************************************************************************
SCM Changes:
****************************************************************************
No files changed

****************************************************************************
SCM Changes since last success:
****************************************************************************
Changed: no author @ no date
Comment: no comment
Files changed:
  pom.xml ( no revision )

****************************************************************************
Dependencies Changes:
****************************************************************************
No dependencies changed

****************************************************************************
Test Summary:
****************************************************************************
Tests: 64
Failures: 11
Total time: 16478

****************************************************************************
Output:
****************************************************************************
[INFO] Scanning for projects...
[INFO] ----------------------------------------------------------------------------
[INFO] Building Maven Project Info Reports Plugin
[INFO]    task-segment: [clean, install]
[INFO] ----------------------------------------------------------------------------
[INFO] snapshot org.apache.maven.shared:file-management:1.2-SNAPSHOT: checking for updates
from codehaus.org
[INFO] [clean:clean]
[INFO] Deleting directory /export/home/build/data/continuum/checkouts/28/target
[INFO] [plugin:descriptor]
[INFO] Using 2 extractors.
[INFO] Applying extractor for language: java
[INFO] Extractor for language: java found 10 mojo descriptors.
[INFO] Applying extractor for language: bsh
[INFO] Extractor for language: bsh found 0 mojo descriptors.
[INFO] [resources:resources]
[INFO] Using default encoding to copy filtered resources.
[INFO] Copying 14 resources
Downloading: http://repo1.maven.org/maven2/org/apache/maven/shared/maven-shared-jar/1.0/maven-shared-jar-1.0.pom
4K downloaded
Downloading: http://repo1.maven.org/maven2/org/apache/maven/maven-model/2.0.7/maven-model-2.0.7.pom
2K downloaded
Downloading: http://repo1.maven.org/maven2/org/apache/maven/maven/2.0.7/maven-2.0.7.pom
10K downloaded
[WARNING] *** CHECKSUM FAILED - Checksum failed on download: local = '83e17944aa31363b04e1031efad2af7195831f80';
remote = 'SHA1' - RETRYING
Downloading: http://repo1.maven.org/maven2/org/apache/maven/maven/2.0.7/maven-2.0.7.pom
10K downloaded
[WARNING] *** CHECKSUM FAILED - Checksum failed on download: local = '83e17944aa31363b04e1031efad2af7195831f80';
remote = 'SHA1' - IGNORING
Downloading: http://repo1.maven.org/maven2/org/apache/maven/maven-artifact/2.0.7/maven-artifact-2.0.7.pom
1K downloaded
Downloading: http://repo1.maven.org/maven2/org/apache/maven/maven-artifact/2.0.7/maven-artifact-2.0.7.jar
85K downloaded
Downloading: http://repo1.maven.org/maven2/org/apache/maven/shared/maven-shared-jar/1.0/maven-shared-jar-1.0.jar
36K downloaded
[INFO] [compiler:compile]
[INFO] Compiling 15 source files to /export/home/build/data/continuum/checkouts/28/target/classes
[INFO] [resources:testResources]
[INFO] Using default encoding to copy filtered resources.
[INFO] Copying 13 resources
[INFO] [compiler:testCompile]
[INFO] Compiling 27 source files to /export/home/build/data/continuum/checkouts/28/target/test-classes
[INFO] [surefire:test]
[INFO] Surefire report directory: /export/home/build/data/continuum/checkouts/28/target/surefire-reports

-------------------------------------------------------
 T E S T S
-------------------------------------------------------
Running org.apache.maven.report.projectinfo.DependenciesReportTest
[INFO] Setting property: classpath.resource.loader.class => 'org.codehaus.plexus.velocity.ContextClassLoaderResourceLoader'.
[INFO] Setting property: velocimacro.messages.on => 'false'.
[INFO] Setting property: resource.loader => 'classpath'.
[INFO] Setting property: resource.manager.logwhenfound => 'false'.
[INFO] artifact org.apache.maven.skins:maven-default-skin: checking for updates from central
Tests run: 1, Failures: 0, Errors: 1, Skipped: 0, Time elapsed: 8.267 sec <<< FAILURE!
Running org.apache.maven.report.projectinfo.MailingListsReportTest
[INFO] Setting property: classpath.resource.loader.class => 'org.codehaus.plexus.velocity.ContextClassLoaderResourceLoader'.
[INFO] Setting property: velocimacro.messages.on => 'false'.
[INFO] Setting property: resource.loader => 'classpath'.
[INFO] Setting property: resource.manager.logwhenfound => 'false'.
[INFO] artifact org.apache.maven.skins:maven-default-skin: checking for updates from central
[INFO] Setting property: classpath.resource.loader.class => 'org.codehaus.plexus.velocity.ContextClassLoaderResourceLoader'.
[INFO] Setting property: velocimacro.messages.on => 'false'.
[INFO] Setting property: resource.loader => 'classpath'.
[INFO] Setting property: resource.manager.logwhenfound => 'false'.
[INFO] artifact org.apache.maven.skins:maven-default-skin: checking for updates from central
Tests run: 2, Failures: 0, Errors: 2, Skipped: 0, Time elapsed: 0.9 sec <<< FAILURE!
Running org.apache.maven.report.projectinfo.TeamListReportTest
[INFO] Setting property: classpath.resource.loader.class => 'org.codehaus.plexus.velocity.ContextClassLoaderResourceLoader'.
[INFO] Setting property: velocimacro.messages.on => 'false'.
[INFO] Setting property: resource.loader => 'classpath'.
[INFO] Setting property: resource.manager.logwhenfound => 'false'.
[INFO] artifact org.apache.maven.skins:maven-default-skin: checking for updates from central
Tests run: 1, Failures: 0, Errors: 1, Skipped: 0, Time elapsed: 0.309 sec <<< FAILURE!
Running org.apache.maven.report.projectinfo.ProjectIndexPageReportTest
[INFO] Setting property: classpath.resource.loader.class => 'org.codehaus.plexus.velocity.ContextClassLoaderResourceLoader'.
[INFO] Setting property: velocimacro.messages.on => 'false'.
[INFO] Setting property: resource.loader => 'classpath'.
[INFO] Setting property: resource.manager.logwhenfound => 'false'.
[INFO] artifact org.apache.maven.skins:maven-default-skin: checking for updates from central
Tests run: 1, Failures: 0, Errors: 1, Skipped: 0, Time elapsed: 0.306 sec <<< FAILURE!
Running org.apache.maven.report.projectinfo.ProjectSummaryReportTest
[INFO] Setting property: classpath.resource.loader.class => 'org.codehaus.plexus.velocity.ContextClassLoaderResourceLoader'.
[INFO] Setting property: velocimacro.messages.on => 'false'.
[INFO] Setting property: resource.loader => 'classpath'.
[INFO] Setting property: resource.manager.logwhenfound => 'false'.
[INFO] artifact org.apache.maven.skins:maven-default-skin: checking for updates from central
Tests run: 1, Failures: 0, Errors: 1, Skipped: 0, Time elapsed: 0.309 sec <<< FAILURE!
Running org.apache.maven.report.projectinfo.IssueTrackingReportTest
[INFO] Setting property: classpath.resource.loader.class => 'org.codehaus.plexus.velocity.ContextClassLoaderResourceLoader'.
[INFO] Setting property: velocimacro.messages.on => 'false'.
[INFO] Setting property: resource.loader => 'classpath'.
[INFO] Setting property: resource.manager.logwhenfound => 'false'.
[INFO] artifact org.apache.maven.skins:maven-default-skin: checking for updates from central
Tests run: 1, Failures: 0, Errors: 1, Skipped: 0, Time elapsed: 0.462 sec <<< FAILURE!
Running org.apache.maven.report.projectinfo.ScmReportTest
[INFO] Setting property: classpath.resource.loader.class => 'org.codehaus.plexus.velocity.ContextClassLoaderResourceLoader'.
[INFO] Setting property: velocimacro.messages.on => 'false'.
[INFO] Setting property: resource.loader => 'classpath'.
[INFO] Setting property: resource.manager.logwhenfound => 'false'.
[INFO] artifact org.apache.maven.skins:maven-default-skin: checking for updates from central
Tests run: 1, Failures: 0, Errors: 1, Skipped: 0, Time elapsed: 0.345 sec <<< FAILURE!
Running org.apache.maven.report.projectinfo.LicenseReportTest
[INFO] Setting property: classpath.resource.loader.class => 'org.codehaus.plexus.velocity.ContextClassLoaderResourceLoader'.
[INFO] Setting property: velocimacro.messages.on => 'false'.
[INFO] Setting property: resource.loader => 'classpath'.
[INFO] Setting property: resource.manager.logwhenfound => 'false'.
[INFO] artifact org.apache.maven.skins:maven-default-skin: checking for updates from central
Tests run: 1, Failures: 0, Errors: 1, Skipped: 0, Time elapsed: 0.289 sec <<< FAILURE!
Running org.apache.maven.report.projectinfo.CimReportTest
[INFO] Setting property: classpath.resource.loader.class => 'org.codehaus.plexus.velocity.ContextClassLoaderResourceLoader'.
[INFO] Setting property: velocimacro.messages.on => 'false'.
[INFO] Setting property: resource.loader => 'classpath'.
[INFO] Setting property: resource.manager.logwhenfound => 'false'.
[INFO] artifact org.apache.maven.skins:maven-default-skin: checking for updates from central
Tests run: 1, Failures: 0, Errors: 1, Skipped: 0, Time elapsed: 0.346 sec <<< FAILURE!
Running org.apache.maven.report.projectinfo.DependencyConvergenceReportTest
[INFO] Setting property: classpath.resource.loader.class => 'org.codehaus.plexus.velocity.ContextClassLoaderResourceLoader'.
[INFO] Setting property: velocimacro.messages.on => 'false'.
[INFO] Setting property: resource.loader => 'classpath'.
[INFO] Setting property: resource.manager.logwhenfound => 'false'.
[INFO] artifact org.apache.maven.skins:maven-default-skin: checking for updates from central
Tests run: 1, Failures: 0, Errors: 1, Skipped: 0, Time elapsed: 5.018 sec <<< FAILURE!

Results :
Tests run: 11, Failures: 0, Errors: 11, Skipped: 0

[INFO] ------------------------------------------------------------------------
[ERROR] BUILD FAILURE
[INFO] ------------------------------------------------------------------------
[INFO] There are test failures.
[INFO] ------------------------------------------------------------------------
[INFO] For more information, run Maven with the -e switch
[INFO] ------------------------------------------------------------------------
[INFO] Total time: 50 seconds
[INFO] Finished at: Thu Jul 12 00:46:57 GMT 2007
[INFO] Final Memory: 16M/331M
[INFO] ------------------------------------------------------------------------

****************************************************************************



Mime
View raw message