maven-notifications mailing list archives

Site index · List index
Message view « Date » · « Thread »
Top « Date » · « Thread »
From "Continuum@maven.zones.apache.org" <contin...@maven.zones.apache.org>
Subject [continuum] BUILD FAILURE: Maven Artifact
Date Wed, 04 Jul 2007 17:15:47 GMT
Online report : http://maven.zones.apache.org/continuum/buildResult.action?buildId=11207&projectId=335
Build statistics:
  State: Failed
  Previous State: Ok
  Started at: Wed 4 Jul 2007 17:15:27 +0000
  Finished at: Wed 4 Jul 2007 17:15:46 +0000
  Total time: 18s
  Build Trigger: Schedule
  Build Number: 18
  Exit code: 1
  Building machine hostname: maven.zones.apache.org
  Operating system : SunOS(unknown)
  Java version : 1.5.0_12(Sun Microsystems Inc.)

****************************************************************************
SCM Changes:
****************************************************************************
Changed: markh @ Wed 4 Jul 2007 16:19:29 +0000
Comment: Merged r553210 from 2.0.x:

Refactored createArtifact methods to createArtifactSpec to make way for some real createArtifact
methods.
Files changed:
  /maven/components/trunk/maven-artifact/src/test/java/org/apache/maven/artifact/resolver/DefaultArtifactCollectorTest.java
( 553253 )

****************************************************************************
SCM Changes since last success:
****************************************************************************
****************************************************************************
Dependencies Changes:
****************************************************************************
org.apache.maven:maven:2.1-SNAPSHOT

****************************************************************************
Test Summary:
****************************************************************************
Tests: 0
Failures: 0
Total time: 0

****************************************************************************
Output:
****************************************************************************
[INFO] Scanning for projects...
[INFO] ----------------------------------------------------------------------------
[INFO] Building Maven Artifact
[INFO]    task-segment: [clean, install]
[INFO] ----------------------------------------------------------------------------
[INFO] [clean:clean]
[INFO] Deleting directory /export/home/build/data/continuum/checkouts/335/target
[INFO] Setting property: classpath.resource.loader.class => 'org.codehaus.plexus.velocity.ContextClassLoaderResourceLoader'.
[INFO] Setting property: velocimacro.messages.on => 'false'.
[INFO] Setting property: resource.loader => 'classpath'.
[INFO] Setting property: resource.manager.logwhenfound => 'false'.
[INFO] ************************************************************** 
[INFO] Starting Jakarta Velocity v1.4
[INFO] RuntimeInstance initializing.
[INFO] Default Properties File: org/apache/velocity/runtime/defaults/velocity.properties
[INFO] Default ResourceManager initializing. (class org.apache.velocity.runtime.resource.ResourceManagerImpl)
[INFO] Resource Loader Instantiated: org.codehaus.plexus.velocity.ContextClassLoaderResourceLoader
[INFO] ClasspathResourceLoader : initialization starting.
[INFO] ClasspathResourceLoader : initialization complete.
[INFO] ResourceCache : initialized. (class org.apache.velocity.runtime.resource.ResourceCacheImpl)
[INFO] Default ResourceManager initialization complete.
[INFO] Loaded System Directive: org.apache.velocity.runtime.directive.Literal
[INFO] Loaded System Directive: org.apache.velocity.runtime.directive.Macro
[INFO] Loaded System Directive: org.apache.velocity.runtime.directive.Parse
[INFO] Loaded System Directive: org.apache.velocity.runtime.directive.Include
[INFO] Loaded System Directive: org.apache.velocity.runtime.directive.Foreach
[INFO] Created: 20 parsers.
[INFO] Velocimacro : initialization starting.
[INFO] Velocimacro : adding VMs from VM library template : VM_global_library.vm
[ERROR] ResourceManager : unable to find resource 'VM_global_library.vm' in any resource loader.
[INFO] Velocimacro : error using  VM library template VM_global_library.vm : org.apache.velocity.exception.ResourceNotFoundException:
Unable to find resource 'VM_global_library.vm'
[INFO] Velocimacro :  VM library template macro registration complete.
[INFO] Velocimacro : allowInline = true : VMs can be defined inline in templates
[INFO] Velocimacro : allowInlineToOverride = false : VMs defined inline may NOT replace previous
VM definitions
[INFO] Velocimacro : allowInlineLocal = false : VMs defined inline will be  global in scope
if allowed.
[INFO] Velocimacro : initialization complete.
[INFO] Velocity successfully started.
[INFO] [modello:java {execution: standard}]
[INFO] outputDirectory: /export/home/build/data/continuum/checkouts/335/target/generated-sources/modello
[INFO] Generating current version: 1.0.0
[INFO] [modello:xpp3-reader {execution: standard}]
[INFO] outputDirectory: /export/home/build/data/continuum/checkouts/335/target/generated-sources/modello
[INFO] Generating current version: 1.0.0
[INFO] [modello:xpp3-writer {execution: standard}]
[INFO] outputDirectory: /export/home/build/data/continuum/checkouts/335/target/generated-sources/modello
[INFO] Generating current version: 1.0.0
[INFO] [resources:resources]
[INFO] Using default encoding to copy filtered resources.
[INFO] Copying 1 resource
[INFO] [compiler:compile]
[INFO] Compiling 93 source files to /export/home/build/data/continuum/checkouts/335/target/classes
[INFO] [resources:testResources]
[INFO] Using default encoding to copy filtered resources.
[INFO] Copying 6 resources
[INFO] [compiler:testCompile]
[INFO] Compiling 19 source files to /export/home/build/data/continuum/checkouts/335/target/test-classes
[INFO] ------------------------------------------------------------------------
[ERROR] BUILD FAILURE
[INFO] ------------------------------------------------------------------------
[INFO] Compilation failure

/export/home/build/data/continuum/checkouts/335/src/test/java/org/apache/maven/artifact/resolver/DefaultArtifactCollectorTest.java:[674,25]
cannot find symbol
symbol  : method createArtifact(java.lang.String,java.lang.String)
location: class org.apache.maven.artifact.resolver.DefaultArtifactCollectorTest

/export/home/build/data/continuum/checkouts/335/src/test/java/org/apache/maven/artifact/resolver/DefaultArtifactCollectorTest.java:[676,8]
cannot find symbol
symbol  : method createArtifact(java.lang.String,java.lang.String)
location: class org.apache.maven.artifact.resolver.DefaultArtifactCollectorTest


[INFO] ------------------------------------------------------------------------
[INFO] For more information, run Maven with the -e switch
[INFO] ------------------------------------------------------------------------
[INFO] Total time: 17 seconds
[INFO] Finished at: Wed Jul 04 17:15:45 GMT 2007
[INFO] Final Memory: 12M/332M
[INFO] ------------------------------------------------------------------------

****************************************************************************



Mime
View raw message