maven-notifications mailing list archives

Site index · List index
Message view « Date » · « Thread »
Top « Date » · « Thread »
From "Continuum@maven.zones.apache.org" <contin...@maven.zones.apache.org>
Subject [continuum] BUILD FAILURE: Maven Project Info Reports Plugin
Date Sat, 14 Jul 2007 01:57:45 GMT
Online report : http://maven.zones.apache.org/continuum/buildResult.action?buildId=12133&projectId=28
Build statistics:
  State: Failed
  Previous State: Failed
  Started at: Sat 14 Jul 2007 01:57:01 +0000
  Finished at: Sat 14 Jul 2007 01:57:44 +0000
  Total time: 43s
  Build Trigger: Schedule
  Build Number: 42
  Exit code: 1
  Building machine hostname: maven.zones.apache.org
  Operating system : SunOS(unknown)
  Java version : 1.5.0_12(Sun Microsystems Inc.)

****************************************************************************
SCM Changes:
****************************************************************************
Changed: no author @ no date
Comment: no comment
Files changed:
  src/site/site.xml ( no revision )
  src/site/apt/usage.apt ( no revision )
  src/site/apt/index.apt ( no revision )
  src/site/apt/examples/selective-project-info-reports.apt ( no revision )
  src/site/apt/examples/individual-reports.apt ( no revision )
  src/site/apt/examples/scm-report.apt ( no revision )

****************************************************************************
SCM Changes since last success:
****************************************************************************
Changed: no author @ no date
Comment: no comment
Files changed:
  pom.xml ( no revision )

****************************************************************************
Dependencies Changes:
****************************************************************************
No dependencies changed

****************************************************************************
Test Summary:
****************************************************************************
Tests: 64
Failures: 11
Total time: 11940

****************************************************************************
Output:
****************************************************************************
[INFO] Scanning for projects...
[INFO] ----------------------------------------------------------------------------
[INFO] Building Maven Project Info Reports Plugin
[INFO]    task-segment: [clean, install]
[INFO] ----------------------------------------------------------------------------
[INFO] snapshot org.apache.maven.shared:file-management:1.2-SNAPSHOT: checking for updates
from codehaus.org
[INFO] [clean:clean]
[INFO] Deleting directory /export/home/build/data/continuum/checkouts/28/target
[INFO] [plugin:descriptor]
[INFO] Using 2 extractors.
[INFO] Applying extractor for language: java
[INFO] Extractor for language: java found 10 mojo descriptors.
[INFO] Applying extractor for language: bsh
[INFO] Extractor for language: bsh found 0 mojo descriptors.
[INFO] [resources:resources]
[INFO] Using default encoding to copy filtered resources.
[INFO] Copying 14 resources
[INFO] [compiler:compile]
[INFO] Compiling 15 source files to /export/home/build/data/continuum/checkouts/28/target/classes
[INFO] [resources:testResources]
[INFO] Using default encoding to copy filtered resources.
[INFO] Copying 13 resources
[INFO] [compiler:testCompile]
[INFO] Compiling 27 source files to /export/home/build/data/continuum/checkouts/28/target/test-classes
[INFO] [surefire:test]
[INFO] Surefire report directory: /export/home/build/data/continuum/checkouts/28/target/surefire-reports

-------------------------------------------------------
 T E S T S
-------------------------------------------------------
Running org.apache.maven.report.projectinfo.DependenciesReportTest
[INFO] Setting property: classpath.resource.loader.class => 'org.codehaus.plexus.velocity.ContextClassLoaderResourceLoader'.
[INFO] Setting property: velocimacro.messages.on => 'false'.
[INFO] Setting property: resource.loader => 'classpath'.
[INFO] Setting property: resource.manager.logwhenfound => 'false'.
[INFO] artifact org.apache.maven.skins:maven-default-skin: checking for updates from central
Tests run: 1, Failures: 0, Errors: 1, Skipped: 0, Time elapsed: 2.935 sec <<< FAILURE!
Running org.apache.maven.report.projectinfo.MailingListsReportTest
[INFO] Setting property: classpath.resource.loader.class => 'org.codehaus.plexus.velocity.ContextClassLoaderResourceLoader'.
[INFO] Setting property: velocimacro.messages.on => 'false'.
[INFO] Setting property: resource.loader => 'classpath'.
[INFO] Setting property: resource.manager.logwhenfound => 'false'.
[INFO] artifact org.apache.maven.skins:maven-default-skin: checking for updates from central
[INFO] Setting property: classpath.resource.loader.class => 'org.codehaus.plexus.velocity.ContextClassLoaderResourceLoader'.
[INFO] Setting property: velocimacro.messages.on => 'false'.
[INFO] Setting property: resource.loader => 'classpath'.
[INFO] Setting property: resource.manager.logwhenfound => 'false'.
[INFO] artifact org.apache.maven.skins:maven-default-skin: checking for updates from central
Tests run: 2, Failures: 0, Errors: 2, Skipped: 0, Time elapsed: 1.434 sec <<< FAILURE!
Running org.apache.maven.report.projectinfo.TeamListReportTest
[INFO] Setting property: classpath.resource.loader.class => 'org.codehaus.plexus.velocity.ContextClassLoaderResourceLoader'.
[INFO] Setting property: velocimacro.messages.on => 'false'.
[INFO] Setting property: resource.loader => 'classpath'.
[INFO] Setting property: resource.manager.logwhenfound => 'false'.
[INFO] artifact org.apache.maven.skins:maven-default-skin: checking for updates from central
Tests run: 1, Failures: 0, Errors: 1, Skipped: 0, Time elapsed: 0.45 sec <<< FAILURE!
Running org.apache.maven.report.projectinfo.ProjectIndexPageReportTest
[INFO] Setting property: classpath.resource.loader.class => 'org.codehaus.plexus.velocity.ContextClassLoaderResourceLoader'.
[INFO] Setting property: velocimacro.messages.on => 'false'.
[INFO] Setting property: resource.loader => 'classpath'.
[INFO] Setting property: resource.manager.logwhenfound => 'false'.
[INFO] artifact org.apache.maven.skins:maven-default-skin: checking for updates from central
Tests run: 1, Failures: 0, Errors: 1, Skipped: 0, Time elapsed: 2.625 sec <<< FAILURE!
Running org.apache.maven.report.projectinfo.ProjectSummaryReportTest
[INFO] Setting property: classpath.resource.loader.class => 'org.codehaus.plexus.velocity.ContextClassLoaderResourceLoader'.
[INFO] Setting property: velocimacro.messages.on => 'false'.
[INFO] Setting property: resource.loader => 'classpath'.
[INFO] Setting property: resource.manager.logwhenfound => 'false'.
[INFO] artifact org.apache.maven.skins:maven-default-skin: checking for updates from central
Tests run: 1, Failures: 0, Errors: 1, Skipped: 0, Time elapsed: 0.554 sec <<< FAILURE!
Running org.apache.maven.report.projectinfo.IssueTrackingReportTest
[INFO] Setting property: classpath.resource.loader.class => 'org.codehaus.plexus.velocity.ContextClassLoaderResourceLoader'.
[INFO] Setting property: velocimacro.messages.on => 'false'.
[INFO] Setting property: resource.loader => 'classpath'.
[INFO] Setting property: resource.manager.logwhenfound => 'false'.
[INFO] artifact org.apache.maven.skins:maven-default-skin: checking for updates from central
Tests run: 1, Failures: 0, Errors: 1, Skipped: 0, Time elapsed: 1.114 sec <<< FAILURE!
Running org.apache.maven.report.projectinfo.ScmReportTest
[INFO] Setting property: classpath.resource.loader.class => 'org.codehaus.plexus.velocity.ContextClassLoaderResourceLoader'.
[INFO] Setting property: velocimacro.messages.on => 'false'.
[INFO] Setting property: resource.loader => 'classpath'.
[INFO] Setting property: resource.manager.logwhenfound => 'false'.
[INFO] artifact org.apache.maven.skins:maven-default-skin: checking for updates from central
Tests run: 1, Failures: 0, Errors: 1, Skipped: 0, Time elapsed: 0.482 sec <<< FAILURE!
Running org.apache.maven.report.projectinfo.LicenseReportTest
[INFO] Setting property: classpath.resource.loader.class => 'org.codehaus.plexus.velocity.ContextClassLoaderResourceLoader'.
[INFO] Setting property: velocimacro.messages.on => 'false'.
[INFO] Setting property: resource.loader => 'classpath'.
[INFO] Setting property: resource.manager.logwhenfound => 'false'.
[INFO] artifact org.apache.maven.skins:maven-default-skin: checking for updates from central
Tests run: 1, Failures: 0, Errors: 1, Skipped: 0, Time elapsed: 0.434 sec <<< FAILURE!
Running org.apache.maven.report.projectinfo.CimReportTest
[INFO] Setting property: classpath.resource.loader.class => 'org.codehaus.plexus.velocity.ContextClassLoaderResourceLoader'.
[INFO] Setting property: velocimacro.messages.on => 'false'.
[INFO] Setting property: resource.loader => 'classpath'.
[INFO] Setting property: resource.manager.logwhenfound => 'false'.
[INFO] artifact org.apache.maven.skins:maven-default-skin: checking for updates from central
Tests run: 1, Failures: 0, Errors: 1, Skipped: 0, Time elapsed: 0.292 sec <<< FAILURE!
Running org.apache.maven.report.projectinfo.DependencyConvergenceReportTest
[INFO] Setting property: classpath.resource.loader.class => 'org.codehaus.plexus.velocity.ContextClassLoaderResourceLoader'.
[INFO] Setting property: velocimacro.messages.on => 'false'.
[INFO] Setting property: resource.loader => 'classpath'.
[INFO] Setting property: resource.manager.logwhenfound => 'false'.
[INFO] artifact org.apache.maven.skins:maven-default-skin: checking for updates from central
Tests run: 1, Failures: 0, Errors: 1, Skipped: 0, Time elapsed: 1.808 sec <<< FAILURE!

Results :
Tests run: 11, Failures: 0, Errors: 11, Skipped: 0

[INFO] ------------------------------------------------------------------------
[ERROR] BUILD FAILURE
[INFO] ------------------------------------------------------------------------
[INFO] There are test failures.
[INFO] ------------------------------------------------------------------------
[INFO] For more information, run Maven with the -e switch
[INFO] ------------------------------------------------------------------------
[INFO] Total time: 41 seconds
[INFO] Finished at: Sat Jul 14 01:57:44 GMT 2007
[INFO] Final Memory: 16M/334M
[INFO] ------------------------------------------------------------------------

****************************************************************************



Mime
View raw message