maven-notifications mailing list archives

Site index · List index
Message view « Date » · « Thread »
Top « Date » · « Thread »
From "Continuum@maven.zones.apache.org" <contin...@maven.zones.apache.org>
Subject [continuum] BUILD FAILURE: Maven Toolchain
Date Tue, 24 Jul 2007 16:17:15 GMT
Online report : http://maven.zones.apache.org/continuum/buildResult.action?buildId=12645&projectId=396
Build statistics:
  State: Failed
  Previous State: Failed
  Started at: Tue 24 Jul 2007 16:17:02 +0000
  Finished at: Tue 24 Jul 2007 16:17:15 +0000
  Total time: 12s
  Build Trigger: Schedule
  Build Number: 0
  Exit code: 1
  Building machine hostname: maven.zones.apache.org
  Operating system : SunOS(unknown)
  Java version : 1.5.0_12(Sun Microsystems Inc.)

****************************************************************************
SCM Changes:
****************************************************************************
No files changed

****************************************************************************
SCM Changes since last success:
****************************************************************************
Changed: no author @ no date
Comment: no comment
Files changed:
  396/src/main/java/org/apache/maven/Toolchain.java ( no revision )
  396/src/main/java/org/apache/maven/toolchain/java/JavaToolChain.java ( no revision )
  396/src/main/java/org/apache/maven/toolchain/java/sun/AbstractSunJavaToolChain.java ( no
revision )
  396/src/main/java/org/apache/maven/toolchain/java/AbstractJavaToolChain.java ( no revision
)
  396/src/main/java/org/apache/maven/toolchain/java/bea/AbstractBeaJavaToolChain.java ( no
revision )
  396/src/main/java/org/apache/maven/toolchain/java/ibm/AbstractIbmJavaToolChain.java ( no
revision )
  396/src/main/java/org/apache/maven/toolchain/dotnet/DotNetToolChain.java ( no revision )
  396/pom.xml ( no revision )

****************************************************************************
Dependencies Changes:
****************************************************************************
org.apache.maven:maven:2.1-SNAPSHOT

****************************************************************************
Test Summary:
****************************************************************************
Tests: 0
Failures: 0
Total time: 0

****************************************************************************
Output:
****************************************************************************
[INFO] Scanning for projects...
[INFO] ----------------------------------------------------------------------------
[INFO] Building Maven Toolchain
[INFO]    task-segment: [clean, install]
[INFO] ----------------------------------------------------------------------------
[INFO] [clean:clean]
[INFO] Deleting directory /export/home/build/data/continuum/checkouts/396/target
[INFO] [resources:resources]
[INFO] Using default encoding to copy filtered resources.
[INFO] Resource directory does not exist: /export/home/build/data/continuum/checkouts/396/src/main/resources
[INFO] [compiler:compile]
[INFO] Compiling 7 source files to /export/home/build/data/continuum/checkouts/396/target/classes
[INFO] ------------------------------------------------------------------------
[ERROR] BUILD FAILURE
[INFO] ------------------------------------------------------------------------
[INFO] Compilation failure

/export/home/build/data/continuum/checkouts/396/src/main/java/org/apache/maven/toolchain/java/JavaToolChain.java:[3,34]
cannot find symbol
symbol  : class ToolChain
location: package org.apache.maven.toolchain

/export/home/build/data/continuum/checkouts/396/src/main/java/org/apache/maven/toolchain/java/JavaToolChain.java:[11,12]
cannot find symbol
symbol: class ToolChain
    extends ToolChain

/export/home/build/data/continuum/checkouts/396/src/main/java/org/apache/maven/Toolchain.java:[25,4]
cannot find symbol
symbol  : class Map
location: interface org.apache.maven.Toolchain

/export/home/build/data/continuum/checkouts/396/src/main/java/org/apache/maven/Toolchain.java:[27,4]
cannot find symbol
symbol  : class Map
location: interface org.apache.maven.Toolchain

/export/home/build/data/continuum/checkouts/396/src/main/java/org/apache/maven/Toolchain.java:[45,4]
cannot find symbol
symbol  : class List
location: interface org.apache.maven.Toolchain

/export/home/build/data/continuum/checkouts/396/src/main/java/org/apache/maven/Toolchain.java:[52,4]
cannot find symbol
symbol  : class List
location: interface org.apache.maven.Toolchain

/export/home/build/data/continuum/checkouts/396/src/main/java/org/apache/maven/Toolchain.java:[61,4]
cannot find symbol
symbol  : class List
location: interface org.apache.maven.Toolchain

/export/home/build/data/continuum/checkouts/396/src/main/java/org/apache/maven/Toolchain.java:[70,4]
cannot find symbol
symbol  : class List
location: interface org.apache.maven.Toolchain

/export/home/build/data/continuum/checkouts/396/src/main/java/org/apache/maven/toolchain/dotnet/DotNetToolChain.java:[3,34]
cannot find symbol
symbol  : class ToolChain
location: package org.apache.maven.toolchain

/export/home/build/data/continuum/checkouts/396/src/main/java/org/apache/maven/toolchain/dotnet/DotNetToolChain.java:[9,12]
cannot find symbol
symbol: class ToolChain
    extends ToolChain


[INFO] ------------------------------------------------------------------------
[INFO] For more information, run Maven with the -e switch
[INFO] ------------------------------------------------------------------------
[INFO] Total time: 8 seconds
[INFO] Finished at: Tue Jul 24 16:17:15 GMT 2007
[INFO] Final Memory: 6M/276M
[INFO] ------------------------------------------------------------------------

****************************************************************************



Mime
View raw message