maven-notifications mailing list archives

Site index · List index
Message view « Date » · « Thread »
Top « Date » · « Thread »
From "Continuum@maven.zones.apache.org" <contin...@maven.zones.apache.org>
Subject [continuum] BUILD FAILURE: Maven Eclipse Plugin
Date Wed, 04 Jul 2007 02:26:52 GMT
Online report : http://maven.zones.apache.org/continuum/buildResult.action?buildId=11067&projectId=17
Build statistics:
  State: Failed
  Previous State: Failed
  Started at: Wed 4 Jul 2007 02:17:26 +0000
  Finished at: Wed 4 Jul 2007 02:26:23 +0000
  Total time: 8m 57s
  Build Trigger: Forced
  Build Number: 0
  Exit code: 1
  Building machine hostname: maven.zones.apache.org
  Operating system : SunOS(unknown)
  Java version : 1.5.0_12(Sun Microsystems Inc.)

****************************************************************************
SCM Changes:
****************************************************************************
Changed: no author @ no date
Comment: no comment
Files changed:
  pom.xml ( no revision )

****************************************************************************
SCM Changes since last success:
****************************************************************************
Changed: no author @ no date
Comment: no comment
Files changed:
  src/test/java/org/apache/maven/plugin/eclipse/EclipsePluginTest.java ( no revision )
  src/test/resources/projects/project-12/expected/.settings/.component ( no revision )
  src/test/resources/projects/project-31/pom.xml ( no revision )
  src/test/resources/projects/project-32/expected/.project ( no revision )
  src/test/resources/projects/project-32/expected/.settings/.component ( no revision )
  src/test/resources/projects/project-32/pom.xml ( no revision )
  src/main/java/org/apache/maven/plugin/ide/AbstractIdeSupportMojo.java ( no revision )
  src/main/java/org/apache/maven/plugin/eclipse/EclipsePlugin.java ( no revision )
  src/main/java/org/apache/maven/plugin/eclipse/writers/rad/RadEjbClasspathWriter.java ( no
revision )
  src/main/java/org/apache/maven/plugin/eclipse/writers/rad/RadApplicationXMLWriter.java (
no revision )
  src/main/java/org/apache/maven/plugin/eclipse/writers/rad/RadJ2EEWriter.java ( no revision
)
  src/main/java/org/apache/maven/plugin/eclipse/writers/rad/RadManifestWriter.java ( no revision
)
  src/main/java/org/apache/maven/plugin/eclipse/writers/rad/RadWebsiteConfigWriter.java (
no revision )
  src/main/java/org/apache/maven/plugin/eclipse/writers/wtp/EclipseWtpComponentWriter.java
( no revision )
  src/main/java/org/apache/maven/plugin/eclipse/writers/wtp/EclipseWtpFacetsWriter.java (
no revision )
  src/main/java/org/apache/maven/plugin/eclipse/writers/wtp/AbstractWtpResourceWriter.java
( no revision )
  src/main/java/org/apache/maven/plugin/eclipse/writers/wtp/EclipseWtpComponent15Writer.java
( no revision )
  src/main/java/org/apache/maven/plugin/eclipse/writers/wtp/EclipseWtpmodulesWriter.java (
no revision )
  src/main/java/org/apache/maven/plugin/eclipse/RadPlugin.java ( no revision )
  pom.xml ( no revision )

Changed: no author @ no date
Comment: no comment
Files changed:
  src/main/java/org/apache/maven/plugin/eclipse/EclipsePlugin.java ( no revision )

Changed: no author @ no date
Comment: no comment
Files changed:
  src/main/java/org/apache/maven/plugin/ide/IdeUtils.java ( no revision )
  src/main/java/org/apache/maven/plugin/ide/AbstractIdeSupportMojo.java ( no revision )
  src/main/java/org/apache/maven/plugin/eclipse/EclipsePlugin.java ( no revision )
  src/main/java/org/apache/maven/plugin/eclipse/writers/EclipseWriterConfig.java ( no revision
)
  src/main/java/org/apache/maven/plugin/eclipse/writers/EclipseProjectWriter.java ( no revision
)
  src/main/java/org/apache/maven/plugin/eclipse/writers/EclipseClasspathWriter.java ( no revision
)

Changed: no author @ no date
Comment: no comment
Files changed:
  src/main/java/org/apache/maven/plugin/eclipse/EclipseToMavenMojo.java ( no revision )

****************************************************************************
Dependencies Changes:
****************************************************************************
No dependencies changed

****************************************************************************
Test Summary:
****************************************************************************
Tests: 63
Failures: 1
Total time: 474391

****************************************************************************
Output:
****************************************************************************
[INFO] Scanning for projects...
[INFO] ----------------------------------------------------------------------------
[INFO] Building Maven Eclipse Plugin
[INFO]    task-segment: [clean, install]
[INFO] ----------------------------------------------------------------------------
[INFO] [clean:clean]
[INFO] Deleting directory /export/home/build/data/continuum/checkouts/17/target
[INFO] [plugin:descriptor]
[INFO] Using 2 extractors.
[INFO] Applying extractor for language: java
[INFO] Extractor for language: java found 9 mojo descriptors.
[INFO] Applying extractor for language: bsh
[INFO] Extractor for language: bsh found 0 mojo descriptors.
[INFO] [resources:resources]
[INFO] Using default encoding to copy filtered resources.
[INFO] Copying 3 resources
[INFO] snapshot org.apache.maven.shared:maven-test-tools:1.0-alpha-2-SNAPSHOT: checking for
updates from apache.snapshots
[INFO] [compiler:compile]
[INFO] Compiling 46 source files to /export/home/build/data/continuum/checkouts/17/target/classes
[INFO] [resources:testResources]
[INFO] Using default encoding to copy filtered resources.
[INFO] Copying 245 resources
[INFO] [compiler:testCompile]
[INFO] Compiling 15 source files to /export/home/build/data/continuum/checkouts/17/target/test-classes
[INFO] [surefire:test]
[INFO] Surefire report directory: /export/home/build/data/continuum/checkouts/17/target/surefire-reports

-------------------------------------------------------
 T E S T S
-------------------------------------------------------
Running org.apache.maven.plugin.eclipse.AddMavenRepoMojoTest
Tests run: 1, Failures: 0, Errors: 0, Skipped: 0, Time elapsed: 0.989 sec
Running org.apache.maven.plugin.eclipse.RadPluginTest
*** Running test builds; output will be directed to: target/surefire-reports/build-output

[INFO] Installing target/maven-eclipse-plugin-test.jar to /export/home/build/data/continuum/checkouts/17/target/test-classes/m2repo/org/apache/maven/plugins/maven-eclipse-plugin/test/maven-eclipse-plugin-test.jar
*** Installed test-version of the Eclipse plugin to: /export/home/build/data/continuum/checkouts/17/target/test-classes/m2repo

Tests run: 6, Failures: 0, Errors: 0, Skipped: 0, Time elapsed: 130.509 sec
Running org.apache.maven.plugin.eclipse.writers.EclipseOSGiManifestWriterTest
Tests run: 3, Failures: 0, Errors: 0, Skipped: 0, Time elapsed: 0.015 sec
Running org.apache.maven.plugin.ide.IdeUtilsTest
Tests run: 1, Failures: 0, Errors: 0, Skipped: 0, Time elapsed: 0.007 sec
Running org.apache.maven.plugin.eclipse.EclipsePluginMasterProjectTest
Tests run: 6, Failures: 0, Errors: 1, Skipped: 0, Time elapsed: 41.049 sec <<< FAILURE!
Running org.apache.maven.plugin.eclipse.writers.EclipseClasspathWriterUnitTest
[debug] Processing resource src/main/resources: output=target/classes; default output=target/classes
[debug] Processing resource src/test/resources: output=target/classes/test-resources; default
output=target/classes
[debug] Marking as special to prevent output folder nesting: src/test/resources (output=target/classes/test-resources)
[info] Creating maven-eclipse.xml Ant file to handle resources
[info] Creating external launcher file
Tests run: 1, Failures: 0, Errors: 0, Skipped: 0, Time elapsed: 0.352 sec
Running org.apache.maven.plugin.eclipse.writers.testutils.TestEclipseWriterConfig
Tests run: 0, Failures: 0, Errors: 0, Skipped: 0, Time elapsed: 0.004 sec
Running org.apache.maven.plugin.eclipse.EclipsePluginTest
Tests run: 29, Failures: 0, Errors: 0, Skipped: 0, Time elapsed: 300.892 sec
Running org.apache.maven.plugin.eclipse.BuildCommandTest
Tests run: 1, Failures: 0, Errors: 0, Skipped: 0, Time elapsed: 0.009 sec
Running org.apache.maven.plugin.eclipse.EclipsePluginUnitTest
[debug] testOutput toRelativeAndFixSeparator /var/tmp/EclipsePlugin.unitTest.1183515982337
, target/main-output
[debug] testOutput after toRelative : /export/home/build/data/continuum/checkouts/17/target/main-output
[debug] Processing resource dir: src/main/resources
[debug] Making relative and fixing separator: { /var/tmp/EclipsePlugin.unitTest.1183515982337,
/export/home/build/data/continuum/checkouts/17/target/main-output, false }.
[debug] Adding eclipse source dir: { /export/home/build/data/continuum/checkouts/17/src/main/resources,
/export/home/build/data/continuum/checkouts/17/target/main-output, true, true, null, null
}.
[debug] Processing resource dir: src/main/resources
[debug] Making relative and fixing separator: { /var/tmp/EclipsePlugin.unitTest.1183515982627,
/var/tmp/EclipsePlugin.unitTest.1183515982627/target/classes/main-output, false }.
[debug] Adding eclipse source dir: { /export/home/build/data/continuum/checkouts/17/src/main/resources,
target/classes/main-output, true, false, null, null }.
[debug] Processing resource dir: src/main/resources
[debug] Making relative and fixing separator: { /var/tmp/EclipsePlugin.unitTest.1183515982657,
/var/tmp/EclipsePlugin.unitTest.1183515982657/target/main-output, false }.
[debug] Adding eclipse source dir: { /export/home/build/data/continuum/checkouts/17/src/main/resources,
target/main-output, true, false, null, null }.
[debug] Processing resource dir: src/main/resources
[debug] Making relative and fixing separator: { /var/tmp/EclipsePlugin.unitTest.1183515982688,
/var/tmp/EclipsePlugin.unitTest.1183515982688/target/classes, false }.
[debug] Adding eclipse source dir: { /export/home/build/data/continuum/checkouts/17/src/main/resources,
target/classes, true, false, null, null }.
[debug] Processing resource dir: src/test/resources
[debug] Making relative and fixing separator: { /var/tmp/EclipsePlugin.unitTest.1183515982688,
/var/tmp/EclipsePlugin.unitTest.1183515982688/target/test-classes, false }.
[debug] Adding eclipse source dir: { /export/home/build/data/continuum/checkouts/17/src/test/resources,
target/test-classes, true, false, null, null }.
[debug] Processing resource dir: src/main/resources
[debug] Making relative and fixing separator: { /var/tmp/EclipsePlugin.unitTest.1183515982757,
/var/tmp/EclipsePlugin.unitTest.1183515982757/target/classes, false }.
[debug] Adding eclipse source dir: { -export-home-build-data-continuum-checkouts-17-src-main-resources,
target/classes, true, false, null, null }.
[debug] Processing resource dir: src/test/resources
[debug] Making relative and fixing separator: { /var/tmp/EclipsePlugin.unitTest.1183515982757,
/var/tmp/EclipsePlugin.unitTest.1183515982757/target/test-classes, false }.
[debug] Adding eclipse source dir: { -export-home-build-data-continuum-checkouts-17-src-test-resources,
target/test-classes, true, false, null, null }.
Tests run: 5, Failures: 0, Errors: 0, Skipped: 0, Time elapsed: 0.456 sec
Running org.apache.maven.plugin.eclipse.EclipseToMavenTest
Tests run: 5, Failures: 0, Errors: 0, Skipped: 0, Time elapsed: 0.072 sec
Running org.apache.maven.plugin.eclipse.MakeArtifactsTest
Tests run: 5, Failures: 0, Errors: 0, Skipped: 0, Time elapsed: 0.016 sec

Results :

Tests in error: 
  testModule1Project(org.apache.maven.plugin.eclipse.EclipsePluginMasterProjectTest)

Tests run: 63, Failures: 0, Errors: 1, Skipped: 0

[INFO] ------------------------------------------------------------------------
[ERROR] BUILD FAILURE
[INFO] ------------------------------------------------------------------------
[INFO] There are test failures.
[INFO] ------------------------------------------------------------------------
[INFO] For more information, run Maven with the -e switch
[INFO] ------------------------------------------------------------------------
[INFO] Total time: 8 minutes 55 seconds
[INFO] Finished at: Wed Jul 04 02:26:23 GMT 2007
[INFO] Final Memory: 16M/330M
[INFO] ------------------------------------------------------------------------

****************************************************************************



Mime
View raw message