maven-notifications mailing list archives

Site index · List index
Message view « Date » · « Thread »
Top « Date » · « Thread »
From "Continuum@maven.zones.apache.org" <contin...@maven.zones.apache.org>
Subject [continuum] BUILD FAILURE: Maven Embedder
Date Wed, 29 Aug 2007 14:18:34 GMT
Online report : http://maven.zones.apache.org/continuum/buildResult.action?buildId=18107&projectId=353

Build statistics:
  State: Failed
  Previous State: Failed
  Started at: Wed 29 Aug 2007 14:18:04 +0000
  Finished at: Wed 29 Aug 2007 14:18:32 +0000
  Total time: 27s
  Build Trigger: Schedule
  Build Number: 85
  Exit code: 1
  Building machine hostname: maven.zones.apache.org
  Operating system : SunOS(unknown)
  Java Home version : 
          java version "1.5.0_12"
          Java(TM) 2 Runtime Environment, Standard Edition (build 1.5.0_12-b04)
          Java HotSpot(TM) Server VM (build 1.5.0_12-b04, mixed mode)
        
  Builder version :
          Maven version: 2.0.7
          Java version: 1.5.0_12
          OS name: "sunos" version: "5.10" arch: "x86"
    
****************************************************************************
SCM Changes:
****************************************************************************
No files changed

****************************************************************************
SCM Changes since last success:
****************************************************************************
Changed: carlos @ Tue 28 Aug 2007 19:53:59 +0000
Comment: buildWithDependencies in the embedder shouldn't check for distribution status by default. Add test.
Files changed:
  /maven/components/trunk/maven-embedder/src/test/java/org/apache/maven/embedder/MavenEmbedderTest.java ( 570550 )
  /maven/components/trunk/maven-embedder/src/test/resources/pom-with-distribution-status.xml ( 570550 )
  /maven/components/trunk/maven-project/src/main/java/org/apache/maven/project/DefaultMavenProjectBuilder.java ( 570550 )

Changed: carlos @ Wed 29 Aug 2007 12:53:18 +0000
Comment: improve exception message
Files changed:
  /maven/components/trunk/maven-embedder/src/main/java/org/apache/maven/embedder/MavenEmbedder.java ( 570791 )

Changed: carlos @ Wed 29 Aug 2007 13:26:29 +0000
Comment: Gather more information on settings validation
Files changed:
  /maven/components/trunk/maven-embedder/src/main/java/org/apache/maven/embedder/ConfigurationValidationResult.java ( 570805 )
  /maven/components/trunk/maven-embedder/src/main/java/org/apache/maven/embedder/DefaultConfigurationValidationResult.java ( 570805 )
  /maven/components/trunk/maven-embedder/src/main/java/org/apache/maven/embedder/MavenEmbedder.java ( 570805 )

****************************************************************************
Dependencies Changes:
****************************************************************************
org.apache.maven:maven-core:2.1-SNAPSHOT

org.apache.maven:maven:2.1-SNAPSHOT

****************************************************************************
Test Summary:
****************************************************************************
Tests: 42
Failures: 10
Total time: 18179

****************************************************************************
Output:
****************************************************************************
[INFO] Scanning for projects...
[INFO] ----------------------------------------------------------------------------
[INFO] Building Maven Embedder
[INFO]    task-segment: [clean, install]
[INFO] ----------------------------------------------------------------------------
[INFO] [clean:clean]
[INFO] Deleting directory /export/home/build/data/continuum/checkouts/353/target
[INFO] [resources:resources]
[INFO] Using default encoding to copy filtered resources.
[INFO] Copying 2 resources
[INFO] [compiler:compile]
[INFO] Compiling 23 source files to /export/home/build/data/continuum/checkouts/353/target/classes
[INFO] [resources:testResources]
[INFO] Using default encoding to copy filtered resources.
[INFO] Copying 6 resources
[INFO] [compiler:testCompile]
[INFO] Compiling 15 source files to /export/home/build/data/continuum/checkouts/353/target/test-classes
[INFO] [surefire:test]
[INFO] Surefire report directory: /export/home/build/data/continuum/checkouts/353/target/surefire-reports

-------------------------------------------------------
 T E S T S
-------------------------------------------------------
Running org.apache.maven.embedder.TestComponentOverride
Tests run: 1, Failures: 0, Errors: 0, Skipped: 0, Time elapsed: 0.708 sec
Running org.apache.maven.embedder.EmbedderUsingScmPluginTest
>>> /export/home/build/data/continuum/checkouts/353
properties = {connectionUrl=scm:svn:http://svn.apache.org/repos/asf/maven/components/trunk/maven-embedder, outputDirectory=/export/home/build/data/continuum/checkouts/353/target/scm.diff}
[ maven embedder INFO] Scanning for projects...
[ maven embedder DEBUG] Pre-scanning POM lineage of: /export/home/build/data/continuum/checkouts/353/target/scm-plugin-from-embedder/pom.xml for build extensions.
[ maven embedder DEBUG] Building model-lineage for: /export/home/build/data/continuum/checkouts/353/target/scm-plugin-from-embedder/pom.xml to pre-scan for extensions.
[ maven embedder DEBUG] Checking: org.apache.maven:embedder-test-project:jar:1.0-SNAPSHOT for extensions. (It has 0 modules.)
[ maven embedder DEBUG] Basedir is: /export/home/build/data/continuum/checkouts/353/target/scm-plugin-from-embedder
[ maven embedder DEBUG] Finished pre-scanning: /export/home/build/data/continuum/checkouts/353/target/scm-plugin-from-embedder/pom.xml for build extensions.
[ maven embedder INFO] Searching repository for plugin with prefix: 'scm'.
[ maven embedder DEBUG] Loading plugin prefixes from group: org.apache.maven.plugins
[ maven embedder DEBUG] Loading plugin prefixes from group: org.codehaus.mojo
[ maven embedder DEBUG] Resolving version for plugin: org.apache.maven.plugins:maven-scm-plugin
[ maven embedder DEBUG] Version from POM: null
[ maven embedder DEBUG] Version from another POM in the reactor: null
[ maven embedder DEBUG] maven-scm-plugin: resolved to version 1.1-SNAPSHOT from local repository
[ maven embedder DEBUG] Skipping disabled repository central
[ maven embedder DEBUG] maven-scm-plugin: using locally installed snapshot
[ maven embedder DEBUG] Skipping disabled repository central
[ maven embedder DEBUG] maven-scm: using locally installed snapshot
[ maven embedder DEBUG] Version from LATEST metadata: 1.1-SNAPSHOT
[ maven embedder DEBUG] In verifyVersionedPlugin for: org.apache.maven.plugins:maven-scm-plugin
[ maven embedder DEBUG] maven-scm-plugin: using locally installed snapshot
[ maven embedder DEBUG] org.apache.maven.plugins:maven-scm-plugin:maven-plugin:1.1-SNAPSHOT:runtime (selected for runtime)
[ maven embedder DEBUG]   org.codehaus.plexus:plexus-utils:jar:1.1:runtime (selected for runtime)
[ maven embedder DEBUG] Adding managed dependencies for unknown:maven-project
[ maven embedder DEBUG]   org.codehaus.plexus:plexus-container-default:jar:1.0-alpha-8
[ maven embedder DEBUG]   org.codehaus.plexus:plexus-utils:jar:1.0.4
[ maven embedder DEBUG]   org.apache.maven.wagon:wagon-provider-api:jar:1.0-alpha-5
[ maven embedder DEBUG]   org.apache.maven.wagon:wagon-ssh:jar:1.0-alpha-5
[ maven embedder DEBUG]   org.apache.maven.wagon:wagon-file:jar:1.0-alpha-5
[ maven embedder DEBUG]   org.apache.maven.wagon:wagon-http-lightweight:jar:1.0-alpha-5
[ maven embedder DEBUG]   org.apache.maven:maven-project:jar:2.0:runtime (selected for runtime)
[ maven embedder DEBUG] Adding managed dependencies for unknown:maven-profile
[ maven embedder DEBUG]   org.codehaus.plexus:plexus-container-default:jar:1.0-alpha-8
[ maven embedder DEBUG]   org.codehaus.plexus:plexus-utils:jar:1.0.4
[ maven embedder DEBUG]   org.apache.maven.wagon:wagon-provider-api:jar:1.0-alpha-5
[ maven embedder DEBUG]   org.apache.maven.wagon:wagon-ssh:jar:1.0-alpha-5
[ maven embedder DEBUG]   org.apache.maven.wagon:wagon-file:jar:1.0-alpha-5
[ maven embedder DEBUG]   org.apache.maven.wagon:wagon-http-lightweight:jar:1.0-alpha-5
[ maven embedder DEBUG]     org.apache.maven:maven-profile:jar:2.0:runtime (selected for runtime)
[ maven embedder DEBUG] Adding managed dependencies for org.apache.maven:maven-model
[ maven embedder DEBUG]   org.codehaus.plexus:plexus-container-default:jar:1.0-alpha-8
[ maven embedder DEBUG]   org.codehaus.plexus:plexus-utils:jar:1.0.4
[ maven embedder DEBUG]   org.apache.maven.wagon:wagon-provider-api:jar:1.0-alpha-5
[ maven embedder DEBUG]   org.apache.maven.wagon:wagon-ssh:jar:1.0-alpha-5
[ maven embedder DEBUG]   org.apache.maven.wagon:wagon-file:jar:1.0-alpha-5
[ maven embedder DEBUG]   org.apache.maven.wagon:wagon-http-lightweight:jar:1.0-alpha-5
[ maven embedder DEBUG]       org.apache.maven:maven-model:jar:2.0:runtime (selected for runtime)
[ maven embedder DEBUG]         org.codehaus.plexus:plexus-utils:jar:1.0.4:runtime (removed - nearer found: 1.1)
[ maven embedder DEBUG]       org.codehaus.plexus:plexus-utils:jar:1.0.4:runtime (removed - nearer found: 1.1)
[ maven embedder DEBUG]       org.codehaus.plexus:plexus-container-default:jar:1.0-alpha-8:runtime (selected for runtime)
[ maven embedder DEBUG]         org.codehaus.plexus:plexus-utils:jar:1.0.4:runtime (removed - nearer found: 1.1)
[ maven embedder DEBUG]         junit:junit:jar:3.8.1:runtime (selected for runtime)
[ maven embedder DEBUG]         classworlds:classworlds:jar:1.1-alpha-2:runtime (selected for runtime)
[ maven embedder DEBUG]     org.apache.maven:maven-model:jar:2.0:runtime (selected for runtime)
[ maven embedder DEBUG]       org.codehaus.plexus:plexus-utils:jar:1.0.4:runtime (removed - nearer found: 1.1)
[ maven embedder DEBUG] Adding managed dependencies for org.apache.maven:maven-artifact-manager
[ maven embedder DEBUG]   org.codehaus.plexus:plexus-container-default:jar:1.0-alpha-8
[ maven embedder DEBUG]   org.codehaus.plexus:plexus-utils:jar:1.0.4
[ maven embedder DEBUG]   org.apache.maven.wagon:wagon-provider-api:jar:1.0-alpha-5
[ maven embedder DEBUG]   org.apache.maven.wagon:wagon-ssh:jar:1.0-alpha-5
[ maven embedder DEBUG]   org.apache.maven.wagon:wagon-file:jar:1.0-alpha-5
[ maven embedder DEBUG]   org.apache.maven.wagon:wagon-http-lightweight:jar:1.0-alpha-5
[ maven embedder DEBUG]     org.apache.maven:maven-artifact-manager:jar:2.0:runtime (selected for runtime)
[ maven embedder DEBUG] Adding managed dependencies for org.apache.maven:maven-repository-metadata
[ maven embedder DEBUG]   org.codehaus.plexus:plexus-container-default:jar:1.0-alpha-8
[ maven embedder DEBUG]   org.codehaus.plexus:plexus-utils:jar:1.0.4
[ maven embedder DEBUG]   org.apache.maven.wagon:wagon-provider-api:jar:1.0-alpha-5
[ maven embedder DEBUG]   org.apache.maven.wagon:wagon-ssh:jar:1.0-alpha-5
[ maven embedder DEBUG]   org.apache.maven.wagon:wagon-file:jar:1.0-alpha-5
[ maven embedder DEBUG]   org.apache.maven.wagon:wagon-http-lightweight:jar:1.0-alpha-5
[ maven embedder DEBUG]       org.apache.maven:maven-repository-metadata:jar:2.0:runtime (selected for runtime)
[ maven embedder DEBUG]         org.codehaus.plexus:plexus-utils:jar:1.0.4:runtime (removed - nearer found: 1.1)
[ maven embedder DEBUG]       org.codehaus.plexus:plexus-utils:jar:1.0.4:runtime (removed - nearer found: 1.1)
[ maven embedder DEBUG] Adding managed dependencies for org.apache.maven:maven-artifact
[ maven embedder DEBUG]   org.codehaus.plexus:plexus-container-default:jar:1.0-alpha-8
[ maven embedder DEBUG]   org.codehaus.plexus:plexus-utils:jar:1.0.4
[ maven embedder DEBUG]   org.apache.maven.wagon:wagon-provider-api:jar:1.0-alpha-5
[ maven embedder DEBUG]   org.apache.maven.wagon:wagon-ssh:jar:1.0-alpha-5
[ maven embedder DEBUG]   org.apache.maven.wagon:wagon-file:jar:1.0-alpha-5
[ maven embedder DEBUG]   org.apache.maven.wagon:wagon-http-lightweight:jar:1.0-alpha-5
[ maven embedder DEBUG]       org.apache.maven:maven-artifact:jar:2.0:runtime (selected for runtime)
[ maven embedder DEBUG]         org.codehaus.plexus:plexus-utils:jar:1.0.4:runtime (removed - nearer found: 1.1)
[ maven embedder DEBUG]       org.apache.maven.wagon:wagon-provider-api:jar:1.0-alpha-5:runtime (selected for runtime)
[ maven embedder DEBUG]         org.codehaus.plexus:plexus-utils:jar:1.0.4:runtime (removed - nearer found: 1.1)
[ maven embedder DEBUG]     org.codehaus.plexus:plexus-utils:jar:1.0.4:runtime (removed - nearer found: 1.1)
[ maven embedder DEBUG]     org.apache.maven:maven-artifact:jar:2.0:runtime (selected for runtime)
[ maven embedder DEBUG]       org.codehaus.plexus:plexus-utils:jar:1.0.4:runtime (removed - nearer found: 1.1)
[ maven embedder DEBUG]     org.codehaus.plexus:plexus-container-default:jar:1.0-alpha-8:runtime (selected for runtime)
[ maven embedder DEBUG]       org.codehaus.plexus:plexus-utils:jar:1.0.4:runtime (removed - nearer found: 1.1)
[ maven embedder DEBUG]       junit:junit:jar:3.8.1:runtime (selected for runtime)
[ maven embedder DEBUG]       classworlds:classworlds:jar:1.1-alpha-2:runtime (selected for runtime)
[ maven embedder DEBUG] Adding managed dependencies for unknown:maven-settings
[ maven embedder DEBUG]   org.codehaus.plexus:plexus-container-default:jar:1.0-alpha-8
[ maven embedder DEBUG]   org.codehaus.plexus:plexus-utils:jar:1.0.4
[ maven embedder DEBUG]   org.apache.maven.wagon:wagon-provider-api:jar:1.0-alpha-5
[ maven embedder DEBUG]   org.apache.maven.wagon:wagon-ssh:jar:1.0-alpha-5
[ maven embedder DEBUG]   org.apache.maven.wagon:wagon-file:jar:1.0-alpha-5
[ maven embedder DEBUG]   org.apache.maven.wagon:wagon-http-lightweight:jar:1.0-alpha-5
[ maven embedder DEBUG]   org.apache.maven:maven-settings:jar:2.0:runtime (selected for runtime)
[ maven embedder DEBUG]     org.codehaus.plexus:plexus-utils:jar:1.0.4:runtime (removed - nearer found: 1.1)
[ maven embedder DEBUG] Adding managed dependencies for org.apache.maven:maven-plugin-api
[ maven embedder DEBUG]   org.codehaus.plexus:plexus-container-default:jar:1.0-alpha-8
[ maven embedder DEBUG]   org.codehaus.plexus:plexus-utils:jar:1.0.4
[ maven embedder DEBUG]   org.apache.maven.wagon:wagon-provider-api:jar:1.0-alpha-5
[ maven embedder DEBUG]   org.apache.maven.wagon:wagon-ssh:jar:1.0-alpha-5
[ maven embedder DEBUG]   org.apache.maven.wagon:wagon-file:jar:1.0-alpha-5
[ maven embedder DEBUG]   org.apache.maven.wagon:wagon-http-lightweight:jar:1.0-alpha-5
[ maven embedder DEBUG]   org.apache.maven:maven-plugin-api:jar:2.0:runtime (selected for runtime)
[ maven embedder DEBUG]   org.apache.maven.scm:maven-scm-manager-plexus:jar:1.0:runtime (selected for runtime)
[ maven embedder DEBUG]     org.apache.maven.scm:maven-scm-api:jar:1.0:runtime (selected for runtime)
[ maven embedder DEBUG]     org.codehaus.plexus:plexus-container-default:jar:1.0-alpha-9:runtime (removed - nearer found: 1.0-alpha-8)
[ maven embedder DEBUG]   org.apache.maven.scm:maven-scm-provider-bazaar:jar:1.0:runtime (selected for runtime)
[ maven embedder DEBUG]     regexp:regexp:jar:1.3:runtime (selected for runtime)
[ maven embedder DEBUG]     org.codehaus.plexus:plexus-container-default:jar:1.0-alpha-7:runtime (removed - nearer found: 1.0-alpha-8)
[ maven embedder DEBUG]   org.apache.maven.scm:maven-scm-provider-clearcase:jar:1.0:runtime (selected for runtime)
[ maven embedder DEBUG]   org.apache.maven.scm:maven-scm-provider-cvsexe:jar:1.0:runtime (selected for runtime)
[ maven embedder DEBUG]     org.apache.maven.scm:maven-scm-provider-cvs-commons:jar:1.0:runtime (selected for runtime)
[ maven embedder DEBUG]   org.apache.maven.scm:maven-scm-provider-cvsjava:jar:1.0:runtime (selected for runtime)
[ maven embedder DEBUG]     org.netbeans.lib:cvsclient:jar:20060125:runtime (selected for runtime)
[ maven embedder DEBUG]     ch.ethz.ganymed:ganymed-ssh2:jar:build210:runtime (selected for runtime)
[ maven embedder DEBUG]   org.apache.maven.scm:maven-scm-provider-hg:jar:1.0:runtime (selected for runtime)
[ maven embedder DEBUG]   org.apache.maven.scm:maven-scm-provider-local:jar:1.0:runtime (selected for runtime)
[ maven embedder DEBUG]   org.apache.maven.scm:maven-scm-provider-perforce:jar:1.0:runtime (selected for runtime)
[ maven embedder DEBUG]   org.apache.maven.scm:maven-scm-provider-starteam:jar:1.0:runtime (selected for runtime)
[ maven embedder DEBUG]   org.apache.maven.scm:maven-scm-provider-svnexe:jar:1.0:runtime (selected for runtime)
[ maven embedder DEBUG]     org.apache.maven.scm:maven-scm-provider-svn-commons:jar:1.0:runtime (selected for runtime)
[ maven embedder DEBUG]   org.apache.maven.scm:maven-scm-provider-synergy:jar:1.0:runtime (selected for runtime)
[ maven embedder DEBUG]   org.apache.maven.scm:maven-scm-provider-vss:jar:1.0:runtime (selected for runtime)
[ maven embedder DEBUG] Using the following artifacts for classpath of: org.apache.maven.plugins:maven-scm-plugin:maven-plugin:1.1-SNAPSHOT:

[org.codehaus.plexus:plexus-utils:jar:1.1:runtime
 org.apache.maven.scm:maven-scm-manager-plexus:jar:1.0:runtime
 org.apache.maven.scm:maven-scm-api:jar:1.0:runtime
 org.apache.maven.scm:maven-scm-provider-bazaar:jar:1.0:runtime
 regexp:regexp:jar:1.3:runtime
 org.apache.maven.scm:maven-scm-provider-clearcase:jar:1.0:runtime
 org.apache.maven.scm:maven-scm-provider-cvsexe:jar:1.0:runtime
 org.apache.maven.scm:maven-scm-provider-cvs-commons:jar:1.0:runtime
 org.apache.maven.scm:maven-scm-provider-cvsjava:jar:1.0:runtime
 org.netbeans.lib:cvsclient:jar:20060125:runtime
 ch.ethz.ganymed:ganymed-ssh2:jar:build210:runtime
 org.apache.maven.scm:maven-scm-provider-hg:jar:1.0:runtime
 org.apache.maven.scm:maven-scm-provider-local:jar:1.0:runtime
 org.apache.maven.scm:maven-scm-provider-perforce:jar:1.0:runtime
 org.apache.maven.scm:maven-scm-provider-starteam:jar:1.0:runtime
 org.apache.maven.scm:maven-scm-provider-svnexe:jar:1.0:runtime
 org.apache.maven.scm:maven-scm-provider-svn-commons:jar:1.0:runtime
 org.apache.maven.scm:maven-scm-provider-synergy:jar:1.0:runtime
 org.apache.maven.scm:maven-scm-provider-vss:jar:1.0:runtime]
[ maven embedder DEBUG] Checking for plugin descriptor for: org.apache.maven.plugins:maven-scm-plugin in collector: org.apache.maven.plugin.MavenPluginCollector@89cc5e
[ maven embedder DEBUG] Realm for plugin: org.apache.maven.plugins:maven-scm-plugin:
org.codehaus.plexus.classworlds.realm.ClassRealm@ff8c74
[ maven embedder DEBUG] In verifyVersionedPlugin for: org.apache.maven.plugins:maven-scm-plugin
[ maven embedder DEBUG] maven-scm-plugin: using locally installed snapshot
[ maven embedder DEBUG] org.apache.maven.plugins:maven-scm-plugin:maven-plugin:1.1-SNAPSHOT:runtime (selected for runtime)
[ maven embedder DEBUG]   org.codehaus.plexus:plexus-utils:jar:1.1:runtime (selected for runtime)
[ maven embedder DEBUG]   org.apache.maven:maven-project:jar:2.0:runtime (selected for runtime)
[ maven embedder DEBUG]     org.apache.maven:maven-profile:jar:2.0:runtime (selected for runtime)
[ maven embedder DEBUG]       org.apache.maven:maven-model:jar:2.0:runtime (selected for runtime)
[ maven embedder DEBUG]         org.codehaus.plexus:plexus-utils:jar:1.0.4:runtime (removed - nearer found: 1.1)
[ maven embedder DEBUG]       org.codehaus.plexus:plexus-utils:jar:1.0.4:runtime (removed - nearer found: 1.1)
[ maven embedder DEBUG]       org.codehaus.plexus:plexus-container-default:jar:1.0-alpha-8:runtime (selected for runtime)
[ maven embedder DEBUG]         org.codehaus.plexus:plexus-utils:jar:1.0.4:runtime (removed - nearer found: 1.1)
[ maven embedder DEBUG]         junit:junit:jar:3.8.1:runtime (selected for runtime)
[ maven embedder DEBUG]         classworlds:classworlds:jar:1.1-alpha-2:runtime (selected for runtime)
[ maven embedder DEBUG]     org.apache.maven:maven-model:jar:2.0:runtime (selected for runtime)
[ maven embedder DEBUG]       org.codehaus.plexus:plexus-utils:jar:1.0.4:runtime (removed - nearer found: 1.1)
[ maven embedder DEBUG]     org.apache.maven:maven-artifact-manager:jar:2.0:runtime (selected for runtime)
[ maven embedder DEBUG]       org.apache.maven:maven-repository-metadata:jar:2.0:runtime (selected for runtime)
[ maven embedder DEBUG]         org.codehaus.plexus:plexus-utils:jar:1.0.4:runtime (removed - nearer found: 1.1)
[ maven embedder DEBUG]       org.codehaus.plexus:plexus-utils:jar:1.0.4:runtime (removed - nearer found: 1.1)
[ maven embedder DEBUG]       org.apache.maven:maven-artifact:jar:2.0:runtime (selected for runtime)
[ maven embedder DEBUG]         org.codehaus.plexus:plexus-utils:jar:1.0.4:runtime (removed - nearer found: 1.1)
[ maven embedder DEBUG]       org.apache.maven.wagon:wagon-provider-api:jar:1.0-alpha-5:runtime (selected for runtime)
[ maven embedder DEBUG]         org.codehaus.plexus:plexus-utils:jar:1.0.4:runtime (removed - nearer found: 1.1)
[ maven embedder DEBUG]     org.codehaus.plexus:plexus-utils:jar:1.0.4:runtime (removed - nearer found: 1.1)
[ maven embedder DEBUG]     org.apache.maven:maven-artifact:jar:2.0:runtime (selected for runtime)
[ maven embedder DEBUG]       org.codehaus.plexus:plexus-utils:jar:1.0.4:runtime (removed - nearer found: 1.1)
[ maven embedder DEBUG]     org.codehaus.plexus:plexus-container-default:jar:1.0-alpha-8:runtime (selected for runtime)
[ maven embedder DEBUG]       org.codehaus.plexus:plexus-utils:jar:1.0.4:runtime (removed - nearer found: 1.1)
[ maven embedder DEBUG]       junit:junit:jar:3.8.1:runtime (selected for runtime)
[ maven embedder DEBUG]       classworlds:classworlds:jar:1.1-alpha-2:runtime (selected for runtime)
[ maven embedder DEBUG]   org.apache.maven:maven-settings:jar:2.0:runtime (selected for runtime)
[ maven embedder DEBUG]     org.codehaus.plexus:plexus-utils:jar:1.0.4:runtime (removed - nearer found: 1.1)
[ maven embedder DEBUG]   org.apache.maven:maven-plugin-api:jar:2.0:runtime (selected for runtime)
[ maven embedder DEBUG]   org.apache.maven.scm:maven-scm-manager-plexus:jar:1.0:runtime (selected for runtime)
[ maven embedder DEBUG]     org.apache.maven.scm:maven-scm-api:jar:1.0:runtime (selected for runtime)
[ maven embedder DEBUG]     org.codehaus.plexus:plexus-container-default:jar:1.0-alpha-9:runtime (removed - nearer found: 1.0-alpha-8)
[ maven embedder DEBUG]   org.apache.maven.scm:maven-scm-provider-bazaar:jar:1.0:runtime (selected for runtime)
[ maven embedder DEBUG]     regexp:regexp:jar:1.3:runtime (selected for runtime)
[ maven embedder DEBUG]     org.codehaus.plexus:plexus-container-default:jar:1.0-alpha-7:runtime (removed - nearer found: 1.0-alpha-8)
[ maven embedder DEBUG]   org.apache.maven.scm:maven-scm-provider-clearcase:jar:1.0:runtime (selected for runtime)
[ maven embedder DEBUG]   org.apache.maven.scm:maven-scm-provider-cvsexe:jar:1.0:runtime (selected for runtime)
[ maven embedder DEBUG]     org.apache.maven.scm:maven-scm-provider-cvs-commons:jar:1.0:runtime (selected for runtime)
[ maven embedder DEBUG]   org.apache.maven.scm:maven-scm-provider-cvsjava:jar:1.0:runtime (selected for runtime)
[ maven embedder DEBUG]     org.netbeans.lib:cvsclient:jar:20060125:runtime (selected for runtime)
[ maven embedder DEBUG]     ch.ethz.ganymed:ganymed-ssh2:jar:build210:runtime (selected for runtime)
[ maven embedder DEBUG]   org.apache.maven.scm:maven-scm-provider-hg:jar:1.0:runtime (selected for runtime)
[ maven embedder DEBUG]   org.apache.maven.scm:maven-scm-provider-local:jar:1.0:runtime (selected for runtime)
[ maven embedder DEBUG]   org.apache.maven.scm:maven-scm-provider-perforce:jar:1.0:runtime (selected for runtime)
[ maven embedder DEBUG]   org.apache.maven.scm:maven-scm-provider-starteam:jar:1.0:runtime (selected for runtime)
[ maven embedder DEBUG]   org.apache.maven.scm:maven-scm-provider-svnexe:jar:1.0:runtime (selected for runtime)
[ maven embedder DEBUG]     org.apache.maven.scm:maven-scm-provider-svn-commons:jar:1.0:runtime (selected for runtime)
[ maven embedder DEBUG]   org.apache.maven.scm:maven-scm-provider-synergy:jar:1.0:runtime (selected for runtime)
[ maven embedder DEBUG]   org.apache.maven.scm:maven-scm-provider-vss:jar:1.0:runtime (selected for runtime)
[ maven embedder DEBUG] Using the following artifacts for classpath of: org.apache.maven.plugins:maven-scm-plugin:maven-plugin:1.1-SNAPSHOT:

[org.codehaus.plexus:plexus-utils:jar:1.1:runtime
 org.apache.maven.scm:maven-scm-manager-plexus:jar:1.0:runtime
 org.apache.maven.scm:maven-scm-api:jar:1.0:runtime
 org.apache.maven.scm:maven-scm-provider-bazaar:jar:1.0:runtime
 regexp:regexp:jar:1.3:runtime
 org.apache.maven.scm:maven-scm-provider-clearcase:jar:1.0:runtime
 org.apache.maven.scm:maven-scm-provider-cvsexe:jar:1.0:runtime
 org.apache.maven.scm:maven-scm-provider-cvs-commons:jar:1.0:runtime
 org.apache.maven.scm:maven-scm-provider-cvsjava:jar:1.0:runtime
 org.netbeans.lib:cvsclient:jar:20060125:runtime
 ch.ethz.ganymed:ganymed-ssh2:jar:build210:runtime
 org.apache.maven.scm:maven-scm-provider-hg:jar:1.0:runtime
 org.apache.maven.scm:maven-scm-provider-local:jar:1.0:runtime
 org.apache.maven.scm:maven-scm-provider-perforce:jar:1.0:runtime
 org.apache.maven.scm:maven-scm-provider-starteam:jar:1.0:runtime
 org.apache.maven.scm:maven-scm-provider-svnexe:jar:1.0:runtime
 org.apache.maven.scm:maven-scm-provider-svn-commons:jar:1.0:runtime
 org.apache.maven.scm:maven-scm-provider-synergy:jar:1.0:runtime
 org.apache.maven.scm:maven-scm-provider-vss:jar:1.0:runtime]
[ maven embedder DEBUG] Realm already exists for: org.apache.maven.plugins:maven-scm-plugin. Skipping addition...
[ maven embedder INFO] ----------------------------------------------------------------------------
[ maven embedder INFO] Building Maven Quick Start Archetype
[ maven embedder INFO]    task-segment: [scm:diff] (aggregator-style)
[ maven embedder INFO] ----------------------------------------------------------------------------
[ maven embedder DEBUG] Constructing build plan for org.apache.maven:embedder-test-project:jar:1.0-SNAPSHOT (  task-segment: [scm:diff] (aggregator-style) )
[ maven embedder WARNING] Assuming that mojo: 'scm:diff' does NOT need configuration from the <reporting /> section of the POM.
[ maven embedder DEBUG] In verifyVersionedPlugin for: org.apache.maven.plugins:maven-scm-plugin
[ maven embedder DEBUG] maven-scm-plugin: using locally installed snapshot
[ maven embedder DEBUG] org.apache.maven.plugins:maven-scm-plugin:maven-plugin:1.1-SNAPSHOT:runtime (selected for runtime)
[ maven embedder DEBUG]   org.codehaus.plexus:plexus-utils:jar:1.1:runtime (selected for runtime)
[ maven embedder DEBUG]   org.apache.maven:maven-project:jar:2.0:runtime (selected for runtime)
[ maven embedder DEBUG]     org.apache.maven:maven-profile:jar:2.0:runtime (selected for runtime)
[ maven embedder DEBUG]       org.apache.maven:maven-model:jar:2.0:runtime (selected for runtime)
[ maven embedder DEBUG]         org.codehaus.plexus:plexus-utils:jar:1.0.4:runtime (removed - nearer found: 1.1)
[ maven embedder DEBUG]       org.codehaus.plexus:plexus-utils:jar:1.0.4:runtime (removed - nearer found: 1.1)
[ maven embedder DEBUG]       org.codehaus.plexus:plexus-container-default:jar:1.0-alpha-8:runtime (selected for runtime)
[ maven embedder DEBUG]         org.codehaus.plexus:plexus-utils:jar:1.0.4:runtime (removed - nearer found: 1.1)
[ maven embedder DEBUG]         junit:junit:jar:3.8.1:runtime (selected for runtime)
[ maven embedder DEBUG]         classworlds:classworlds:jar:1.1-alpha-2:runtime (selected for runtime)
[ maven embedder DEBUG]     org.apache.maven:maven-model:jar:2.0:runtime (selected for runtime)
[ maven embedder DEBUG]       org.codehaus.plexus:plexus-utils:jar:1.0.4:runtime (removed - nearer found: 1.1)
[ maven embedder DEBUG]     org.apache.maven:maven-artifact-manager:jar:2.0:runtime (selected for runtime)
[ maven embedder DEBUG]       org.apache.maven:maven-repository-metadata:jar:2.0:runtime (selected for runtime)
[ maven embedder DEBUG]         org.codehaus.plexus:plexus-utils:jar:1.0.4:runtime (removed - nearer found: 1.1)
[ maven embedder DEBUG]       org.codehaus.plexus:plexus-utils:jar:1.0.4:runtime (removed - nearer found: 1.1)
[ maven embedder DEBUG]       org.apache.maven:maven-artifact:jar:2.0:runtime (selected for runtime)
[ maven embedder DEBUG]         org.codehaus.plexus:plexus-utils:jar:1.0.4:runtime (removed - nearer found: 1.1)
[ maven embedder DEBUG]       org.apache.maven.wagon:wagon-provider-api:jar:1.0-alpha-5:runtime (selected for runtime)
[ maven embedder DEBUG]         org.codehaus.plexus:plexus-utils:jar:1.0.4:runtime (removed - nearer found: 1.1)
[ maven embedder DEBUG]     org.codehaus.plexus:plexus-utils:jar:1.0.4:runtime (removed - nearer found: 1.1)
[ maven embedder DEBUG]     org.apache.maven:maven-artifact:jar:2.0:runtime (selected for runtime)
[ maven embedder DEBUG]       org.codehaus.plexus:plexus-utils:jar:1.0.4:runtime (removed - nearer found: 1.1)
[ maven embedder DEBUG]     org.codehaus.plexus:plexus-container-default:jar:1.0-alpha-8:runtime (selected for runtime)
[ maven embedder DEBUG]       org.codehaus.plexus:plexus-utils:jar:1.0.4:runtime (removed - nearer found: 1.1)
[ maven embedder DEBUG]       junit:junit:jar:3.8.1:runtime (selected for runtime)
[ maven embedder DEBUG]       classworlds:classworlds:jar:1.1-alpha-2:runtime (selected for runtime)
[ maven embedder DEBUG]   org.apache.maven:maven-settings:jar:2.0:runtime (selected for runtime)
[ maven embedder DEBUG]     org.codehaus.plexus:plexus-utils:jar:1.0.4:runtime (removed - nearer found: 1.1)
[ maven embedder DEBUG]   org.apache.maven:maven-plugin-api:jar:2.0:runtime (selected for runtime)
[ maven embedder DEBUG]   org.apache.maven.scm:maven-scm-manager-plexus:jar:1.0:runtime (selected for runtime)
[ maven embedder DEBUG]     org.apache.maven.scm:maven-scm-api:jar:1.0:runtime (selected for runtime)
[ maven embedder DEBUG]     org.codehaus.plexus:plexus-container-default:jar:1.0-alpha-9:runtime (removed - nearer found: 1.0-alpha-8)
[ maven embedder DEBUG]   org.apache.maven.scm:maven-scm-provider-bazaar:jar:1.0:runtime (selected for runtime)
[ maven embedder DEBUG]     regexp:regexp:jar:1.3:runtime (selected for runtime)
[ maven embedder DEBUG]     org.codehaus.plexus:plexus-container-default:jar:1.0-alpha-7:runtime (removed - nearer found: 1.0-alpha-8)
[ maven embedder DEBUG]   org.apache.maven.scm:maven-scm-provider-clearcase:jar:1.0:runtime (selected for runtime)
[ maven embedder DEBUG]   org.apache.maven.scm:maven-scm-provider-cvsexe:jar:1.0:runtime (selected for runtime)
[ maven embedder DEBUG]     org.apache.maven.scm:maven-scm-provider-cvs-commons:jar:1.0:runtime (selected for runtime)
[ maven embedder DEBUG]   org.apache.maven.scm:maven-scm-provider-cvsjava:jar:1.0:runtime (selected for runtime)
[ maven embedder DEBUG]     org.netbeans.lib:cvsclient:jar:20060125:runtime (selected for runtime)
[ maven embedder DEBUG]     ch.ethz.ganymed:ganymed-ssh2:jar:build210:runtime (selected for runtime)
[ maven embedder DEBUG]   org.apache.maven.scm:maven-scm-provider-hg:jar:1.0:runtime (selected for runtime)
[ maven embedder DEBUG]   org.apache.maven.scm:maven-scm-provider-local:jar:1.0:runtime (selected for runtime)
[ maven embedder DEBUG]   org.apache.maven.scm:maven-scm-provider-perforce:jar:1.0:runtime (selected for runtime)
[ maven embedder DEBUG]   org.apache.maven.scm:maven-scm-provider-starteam:jar:1.0:runtime (selected for runtime)
[ maven embedder DEBUG]   org.apache.maven.scm:maven-scm-provider-svnexe:jar:1.0:runtime (selected for runtime)
[ maven embedder DEBUG]     org.apache.maven.scm:maven-scm-provider-svn-commons:jar:1.0:runtime (selected for runtime)
[ maven embedder DEBUG]   org.apache.maven.scm:maven-scm-provider-synergy:jar:1.0:runtime (selected for runtime)
[ maven embedder DEBUG]   org.apache.maven.scm:maven-scm-provider-vss:jar:1.0:runtime (selected for runtime)
[ maven embedder DEBUG] Using the following artifacts for classpath of: org.apache.maven.plugins:maven-scm-plugin:maven-plugin:1.1-SNAPSHOT:

[org.codehaus.plexus:plexus-utils:jar:1.1:runtime
 org.apache.maven.scm:maven-scm-manager-plexus:jar:1.0:runtime
 org.apache.maven.scm:maven-scm-api:jar:1.0:runtime
 org.apache.maven.scm:maven-scm-provider-bazaar:jar:1.0:runtime
 regexp:regexp:jar:1.3:runtime
 org.apache.maven.scm:maven-scm-provider-clearcase:jar:1.0:runtime
 org.apache.maven.scm:maven-scm-provider-cvsexe:jar:1.0:runtime
 org.apache.maven.scm:maven-scm-provider-cvs-commons:jar:1.0:runtime
 org.apache.maven.scm:maven-scm-provider-cvsjava:jar:1.0:runtime
 org.netbeans.lib:cvsclient:jar:20060125:runtime
 ch.ethz.ganymed:ganymed-ssh2:jar:build210:runtime
 org.apache.maven.scm:maven-scm-provider-hg:jar:1.0:runtime
 org.apache.maven.scm:maven-scm-provider-local:jar:1.0:runtime
 org.apache.maven.scm:maven-scm-provider-perforce:jar:1.0:runtime
 org.apache.maven.scm:maven-scm-provider-starteam:jar:1.0:runtime
 org.apache.maven.scm:maven-scm-provider-svnexe:jar:1.0:runtime
 org.apache.maven.scm:maven-scm-provider-svn-commons:jar:1.0:runtime
 org.apache.maven.scm:maven-scm-provider-synergy:jar:1.0:runtime
 org.apache.maven.scm:maven-scm-provider-vss:jar:1.0:runtime]
[ maven embedder DEBUG] Realm already exists for: org.apache.maven.plugins:maven-scm-plugin. Skipping addition...
[ maven embedder DEBUG] In verifyVersionedPlugin for: org.apache.maven.plugins:maven-scm-plugin
[ maven embedder DEBUG] maven-scm-plugin: using locally installed snapshot
[ maven embedder DEBUG] org.apache.maven.plugins:maven-scm-plugin:maven-plugin:1.1-SNAPSHOT:runtime (selected for runtime)
[ maven embedder DEBUG]   org.codehaus.plexus:plexus-utils:jar:1.1:runtime (selected for runtime)
[ maven embedder DEBUG]   org.apache.maven:maven-project:jar:2.0:runtime (selected for runtime)
[ maven embedder DEBUG]     org.apache.maven:maven-profile:jar:2.0:runtime (selected for runtime)
[ maven embedder DEBUG]       org.apache.maven:maven-model:jar:2.0:runtime (selected for runtime)
[ maven embedder DEBUG]         org.codehaus.plexus:plexus-utils:jar:1.0.4:runtime (removed - nearer found: 1.1)
[ maven embedder DEBUG]       org.codehaus.plexus:plexus-utils:jar:1.0.4:runtime (removed - nearer found: 1.1)
[ maven embedder DEBUG]       org.codehaus.plexus:plexus-container-default:jar:1.0-alpha-8:runtime (selected for runtime)
[ maven embedder DEBUG]         org.codehaus.plexus:plexus-utils:jar:1.0.4:runtime (removed - nearer found: 1.1)
[ maven embedder DEBUG]         junit:junit:jar:3.8.1:runtime (selected for runtime)
[ maven embedder DEBUG]         classworlds:classworlds:jar:1.1-alpha-2:runtime (selected for runtime)
[ maven embedder DEBUG]     org.apache.maven:maven-model:jar:2.0:runtime (selected for runtime)
[ maven embedder DEBUG]       org.codehaus.plexus:plexus-utils:jar:1.0.4:runtime (removed - nearer found: 1.1)
[ maven embedder DEBUG]     org.apache.maven:maven-artifact-manager:jar:2.0:runtime (selected for runtime)
[ maven embedder DEBUG]       org.apache.maven:maven-repository-metadata:jar:2.0:runtime (selected for runtime)
[ maven embedder DEBUG]         org.codehaus.plexus:plexus-utils:jar:1.0.4:runtime (removed - nearer found: 1.1)
[ maven embedder DEBUG]       org.codehaus.plexus:plexus-utils:jar:1.0.4:runtime (removed - nearer found: 1.1)
[ maven embedder DEBUG]       org.apache.maven:maven-artifact:jar:2.0:runtime (selected for runtime)
[ maven embedder DEBUG]         org.codehaus.plexus:plexus-utils:jar:1.0.4:runtime (removed - nearer found: 1.1)
[ maven embedder DEBUG]       org.apache.maven.wagon:wagon-provider-api:jar:1.0-alpha-5:runtime (selected for runtime)
[ maven embedder DEBUG]         org.codehaus.plexus:plexus-utils:jar:1.0.4:runtime (removed - nearer found: 1.1)
[ maven embedder DEBUG]     org.codehaus.plexus:plexus-utils:jar:1.0.4:runtime (removed - nearer found: 1.1)
[ maven embedder DEBUG]     org.apache.maven:maven-artifact:jar:2.0:runtime (selected for runtime)
[ maven embedder DEBUG]       org.codehaus.plexus:plexus-utils:jar:1.0.4:runtime (removed - nearer found: 1.1)
[ maven embedder DEBUG]     org.codehaus.plexus:plexus-container-default:jar:1.0-alpha-8:runtime (selected for runtime)
[ maven embedder DEBUG]       org.codehaus.plexus:plexus-utils:jar:1.0.4:runtime (removed - nearer found: 1.1)
[ maven embedder DEBUG]       junit:junit:jar:3.8.1:runtime (selected for runtime)
[ maven embedder DEBUG]       classworlds:classworlds:jar:1.1-alpha-2:runtime (selected for runtime)
[ maven embedder DEBUG]   org.apache.maven:maven-settings:jar:2.0:runtime (selected for runtime)
[ maven embedder DEBUG]     org.codehaus.plexus:plexus-utils:jar:1.0.4:runtime (removed - nearer found: 1.1)
[ maven embedder DEBUG]   org.apache.maven:maven-plugin-api:jar:2.0:runtime (selected for runtime)
[ maven embedder DEBUG]   org.apache.maven.scm:maven-scm-manager-plexus:jar:1.0:runtime (selected for runtime)
[ maven embedder DEBUG]     org.apache.maven.scm:maven-scm-api:jar:1.0:runtime (selected for runtime)
[ maven embedder DEBUG]     org.codehaus.plexus:plexus-container-default:jar:1.0-alpha-9:runtime (removed - nearer found: 1.0-alpha-8)
[ maven embedder DEBUG]   org.apache.maven.scm:maven-scm-provider-bazaar:jar:1.0:runtime (selected for runtime)
[ maven embedder DEBUG]     regexp:regexp:jar:1.3:runtime (selected for runtime)
[ maven embedder DEBUG]     org.codehaus.plexus:plexus-container-default:jar:1.0-alpha-7:runtime (removed - nearer found: 1.0-alpha-8)
[ maven embedder DEBUG]   org.apache.maven.scm:maven-scm-provider-clearcase:jar:1.0:runtime (selected for runtime)
[ maven embedder DEBUG]   org.apache.maven.scm:maven-scm-provider-cvsexe:jar:1.0:runtime (selected for runtime)
[ maven embedder DEBUG]     org.apache.maven.scm:maven-scm-provider-cvs-commons:jar:1.0:runtime (selected for runtime)
[ maven embedder DEBUG]   org.apache.maven.scm:maven-scm-provider-cvsjava:jar:1.0:runtime (selected for runtime)
[ maven embedder DEBUG]     org.netbeans.lib:cvsclient:jar:20060125:runtime (selected for runtime)
[ maven embedder DEBUG]     ch.ethz.ganymed:ganymed-ssh2:jar:build210:runtime (selected for runtime)
[ maven embedder DEBUG]   org.apache.maven.scm:maven-scm-provider-hg:jar:1.0:runtime (selected for runtime)
[ maven embedder DEBUG]   org.apache.maven.scm:maven-scm-provider-local:jar:1.0:runtime (selected for runtime)
[ maven embedder DEBUG]   org.apache.maven.scm:maven-scm-provider-perforce:jar:1.0:runtime (selected for runtime)
[ maven embedder DEBUG]   org.apache.maven.scm:maven-scm-provider-starteam:jar:1.0:runtime (selected for runtime)
[ maven embedder DEBUG]   org.apache.maven.scm:maven-scm-provider-svnexe:jar:1.0:runtime (selected for runtime)
[ maven embedder DEBUG]     org.apache.maven.scm:maven-scm-provider-svn-commons:jar:1.0:runtime (selected for runtime)
[ maven embedder DEBUG]   org.apache.maven.scm:maven-scm-provider-synergy:jar:1.0:runtime (selected for runtime)
[ maven embedder DEBUG]   org.apache.maven.scm:maven-scm-provider-vss:jar:1.0:runtime (selected for runtime)
[ maven embedder DEBUG] Using the following artifacts for classpath of: org.apache.maven.plugins:maven-scm-plugin:maven-plugin:1.1-SNAPSHOT:

[org.codehaus.plexus:plexus-utils:jar:1.1:runtime
 org.apache.maven.scm:maven-scm-manager-plexus:jar:1.0:runtime
 org.apache.maven.scm:maven-scm-api:jar:1.0:runtime
 org.apache.maven.scm:maven-scm-provider-bazaar:jar:1.0:runtime
 regexp:regexp:jar:1.3:runtime
 org.apache.maven.scm:maven-scm-provider-clearcase:jar:1.0:runtime
 org.apache.maven.scm:maven-scm-provider-cvsexe:jar:1.0:runtime
 org.apache.maven.scm:maven-scm-provider-cvs-commons:jar:1.0:runtime
 org.apache.maven.scm:maven-scm-provider-cvsjava:jar:1.0:runtime
 org.netbeans.lib:cvsclient:jar:20060125:runtime
 ch.ethz.ganymed:ganymed-ssh2:jar:build210:runtime
 org.apache.maven.scm:maven-scm-provider-hg:jar:1.0:runtime
 org.apache.maven.scm:maven-scm-provider-local:jar:1.0:runtime
 org.apache.maven.scm:maven-scm-provider-perforce:jar:1.0:runtime
 org.apache.maven.scm:maven-scm-provider-starteam:jar:1.0:runtime
 org.apache.maven.scm:maven-scm-provider-svnexe:jar:1.0:runtime
 org.apache.maven.scm:maven-scm-provider-svn-commons:jar:1.0:runtime
 org.apache.maven.scm:maven-scm-provider-synergy:jar:1.0:runtime
 org.apache.maven.scm:maven-scm-provider-vss:jar:1.0:runtime]
[ maven embedder DEBUG] Realm already exists for: org.apache.maven.plugins:maven-scm-plugin. Skipping addition...
[ maven embedder DEBUG] 

Our build plan is:

1. org.apache.maven.plugins:maven-scm-plugin:1.1-SNAPSHOT:diff [executionId: default]


[ maven embedder DEBUG] In verifyVersionedPlugin for: org.apache.maven.plugins:maven-scm-plugin
[ maven embedder DEBUG] maven-scm-plugin: using locally installed snapshot
[ maven embedder DEBUG] org.apache.maven.plugins:maven-scm-plugin:maven-plugin:1.1-SNAPSHOT:runtime (selected for runtime)
[ maven embedder DEBUG]   org.codehaus.plexus:plexus-utils:jar:1.1:runtime (selected for runtime)
[ maven embedder DEBUG]   org.apache.maven:maven-project:jar:2.0:runtime (selected for runtime)
[ maven embedder DEBUG]     org.apache.maven:maven-profile:jar:2.0:runtime (selected for runtime)
[ maven embedder DEBUG]       org.apache.maven:maven-model:jar:2.0:runtime (selected for runtime)
[ maven embedder DEBUG]         org.codehaus.plexus:plexus-utils:jar:1.0.4:runtime (removed - nearer found: 1.1)
[ maven embedder DEBUG]       org.codehaus.plexus:plexus-utils:jar:1.0.4:runtime (removed - nearer found: 1.1)
[ maven embedder DEBUG]       org.codehaus.plexus:plexus-container-default:jar:1.0-alpha-8:runtime (selected for runtime)
[ maven embedder DEBUG]         org.codehaus.plexus:plexus-utils:jar:1.0.4:runtime (removed - nearer found: 1.1)
[ maven embedder DEBUG]         junit:junit:jar:3.8.1:runtime (selected for runtime)
[ maven embedder DEBUG]         classworlds:classworlds:jar:1.1-alpha-2:runtime (selected for runtime)
[ maven embedder DEBUG]     org.apache.maven:maven-model:jar:2.0:runtime (selected for runtime)
[ maven embedder DEBUG]       org.codehaus.plexus:plexus-utils:jar:1.0.4:runtime (removed - nearer found: 1.1)
[ maven embedder DEBUG]     org.apache.maven:maven-artifact-manager:jar:2.0:runtime (selected for runtime)
[ maven embedder DEBUG]       org.apache.maven:maven-repository-metadata:jar:2.0:runtime (selected for runtime)
[ maven embedder DEBUG]         org.codehaus.plexus:plexus-utils:jar:1.0.4:runtime (removed - nearer found: 1.1)
[ maven embedder DEBUG]       org.codehaus.plexus:plexus-utils:jar:1.0.4:runtime (removed - nearer found: 1.1)
[ maven embedder DEBUG]       org.apache.maven:maven-artifact:jar:2.0:runtime (selected for runtime)
[ maven embedder DEBUG]         org.codehaus.plexus:plexus-utils:jar:1.0.4:runtime (removed - nearer found: 1.1)
[ maven embedder DEBUG]       org.apache.maven.wagon:wagon-provider-api:jar:1.0-alpha-5:runtime (selected for runtime)
[ maven embedder DEBUG]         org.codehaus.plexus:plexus-utils:jar:1.0.4:runtime (removed - nearer found: 1.1)
[ maven embedder DEBUG]     org.codehaus.plexus:plexus-utils:jar:1.0.4:runtime (removed - nearer found: 1.1)
[ maven embedder DEBUG]     org.apache.maven:maven-artifact:jar:2.0:runtime (selected for runtime)
[ maven embedder DEBUG]       org.codehaus.plexus:plexus-utils:jar:1.0.4:runtime (removed - nearer found: 1.1)
[ maven embedder DEBUG]     org.codehaus.plexus:plexus-container-default:jar:1.0-alpha-8:runtime (selected for runtime)
[ maven embedder DEBUG]       org.codehaus.plexus:plexus-utils:jar:1.0.4:runtime (removed - nearer found: 1.1)
[ maven embedder DEBUG]       junit:junit:jar:3.8.1:runtime (selected for runtime)
[ maven embedder DEBUG]       classworlds:classworlds:jar:1.1-alpha-2:runtime (selected for runtime)
[ maven embedder DEBUG]   org.apache.maven:maven-settings:jar:2.0:runtime (selected for runtime)
[ maven embedder DEBUG]     org.codehaus.plexus:plexus-utils:jar:1.0.4:runtime (removed - nearer found: 1.1)
[ maven embedder DEBUG]   org.apache.maven:maven-plugin-api:jar:2.0:runtime (selected for runtime)
[ maven embedder DEBUG]   org.apache.maven.scm:maven-scm-manager-plexus:jar:1.0:runtime (selected for runtime)
[ maven embedder DEBUG]     org.apache.maven.scm:maven-scm-api:jar:1.0:runtime (selected for runtime)
[ maven embedder DEBUG]     org.codehaus.plexus:plexus-container-default:jar:1.0-alpha-9:runtime (removed - nearer found: 1.0-alpha-8)
[ maven embedder DEBUG]   org.apache.maven.scm:maven-scm-provider-bazaar:jar:1.0:runtime (selected for runtime)
[ maven embedder DEBUG]     regexp:regexp:jar:1.3:runtime (selected for runtime)
[ maven embedder DEBUG]     org.codehaus.plexus:plexus-container-default:jar:1.0-alpha-7:runtime (removed - nearer found: 1.0-alpha-8)
[ maven embedder DEBUG]   org.apache.maven.scm:maven-scm-provider-clearcase:jar:1.0:runtime (selected for runtime)
[ maven embedder DEBUG]   org.apache.maven.scm:maven-scm-provider-cvsexe:jar:1.0:runtime (selected for runtime)
[ maven embedder DEBUG]     org.apache.maven.scm:maven-scm-provider-cvs-commons:jar:1.0:runtime (selected for runtime)
[ maven embedder DEBUG]   org.apache.maven.scm:maven-scm-provider-cvsjava:jar:1.0:runtime (selected for runtime)
[ maven embedder DEBUG]     org.netbeans.lib:cvsclient:jar:20060125:runtime (selected for runtime)
[ maven embedder DEBUG]     ch.ethz.ganymed:ganymed-ssh2:jar:build210:runtime (selected for runtime)
[ maven embedder DEBUG]   org.apache.maven.scm:maven-scm-provider-hg:jar:1.0:runtime (selected for runtime)
[ maven embedder DEBUG]   org.apache.maven.scm:maven-scm-provider-local:jar:1.0:runtime (selected for runtime)
[ maven embedder DEBUG]   org.apache.maven.scm:maven-scm-provider-perforce:jar:1.0:runtime (selected for runtime)
[ maven embedder DEBUG]   org.apache.maven.scm:maven-scm-provider-starteam:jar:1.0:runtime (selected for runtime)
[ maven embedder DEBUG]   org.apache.maven.scm:maven-scm-provider-svnexe:jar:1.0:runtime (selected for runtime)
[ maven embedder DEBUG]     org.apache.maven.scm:maven-scm-provider-svn-commons:jar:1.0:runtime (selected for runtime)
[ maven embedder DEBUG]   org.apache.maven.scm:maven-scm-provider-synergy:jar:1.0:runtime (selected for runtime)
[ maven embedder DEBUG]   org.apache.maven.scm:maven-scm-provider-vss:jar:1.0:runtime (selected for runtime)
[ maven embedder DEBUG] Using the following artifacts for classpath of: org.apache.maven.plugins:maven-scm-plugin:maven-plugin:1.1-SNAPSHOT:

[org.codehaus.plexus:plexus-utils:jar:1.1:runtime
 org.apache.maven.scm:maven-scm-manager-plexus:jar:1.0:runtime
 org.apache.maven.scm:maven-scm-api:jar:1.0:runtime
 org.apache.maven.scm:maven-scm-provider-bazaar:jar:1.0:runtime
 regexp:regexp:jar:1.3:runtime
 org.apache.maven.scm:maven-scm-provider-clearcase:jar:1.0:runtime
 org.apache.maven.scm:maven-scm-provider-cvsexe:jar:1.0:runtime
 org.apache.maven.scm:maven-scm-provider-cvs-commons:jar:1.0:runtime
 org.apache.maven.scm:maven-scm-provider-cvsjava:jar:1.0:runtime
 org.netbeans.lib:cvsclient:jar:20060125:runtime
 ch.ethz.ganymed:ganymed-ssh2:jar:build210:runtime
 org.apache.maven.scm:maven-scm-provider-hg:jar:1.0:runtime
 org.apache.maven.scm:maven-scm-provider-local:jar:1.0:runtime
 org.apache.maven.scm:maven-scm-provider-perforce:jar:1.0:runtime
 org.apache.maven.scm:maven-scm-provider-starteam:jar:1.0:runtime
 org.apache.maven.scm:maven-scm-provider-svnexe:jar:1.0:runtime
 org.apache.maven.scm:maven-scm-provider-svn-commons:jar:1.0:runtime
 org.apache.maven.scm:maven-scm-provider-synergy:jar:1.0:runtime
 org.apache.maven.scm:maven-scm-provider-vss:jar:1.0:runtime]
[ maven embedder DEBUG] Realm already exists for: org.apache.maven.plugins:maven-scm-plugin. Skipping addition...
[ maven embedder DEBUG] Looking up mojo org.apache.maven.plugins:maven-scm-plugin:1.1-SNAPSHOT:diff in realm org.apache.maven.plugins:maven-scm-plugin - descRealmId=org.apache.maven.plugins:maven-scm-plugin
[ maven embedder DEBUG] Looked up - org.apache.maven.scm.plugin.DiffMojo@134ce4a - org.codehaus.plexus.classworlds.realm.ClassRealm@ff8c74
[ maven embedder DEBUG] Configuring mojo 'org.apache.maven.plugins:maven-scm-plugin:1.1-SNAPSHOT:diff' -->
[ maven embedder DEBUG]   (f) basedir = /export/home/build/data/continuum/checkouts/353/target/scm-plugin-from-embedder
[ maven embedder DEBUG]   (f) connectionType = connection
[ maven embedder DEBUG]   (s) connectionUrl = scm:svn:http://svn.apache.org/repos/asf/maven/components/trunk/maven-embedder
[ maven embedder DEBUG]   (f) developerConnectionUrl = scm:svn:http://svn.apache.org/repos/asf/maven/components/trunk/maven-embedder
[ maven embedder DEBUG]   (f) outputFile = /export/home/build/data/continuum/checkouts/353/target/scm-plugin-from-embedder/embedder-test-project.diff
[ maven embedder DEBUG]   (f) settings = org.apache.maven.settings.Settings@383118
[ maven embedder DEBUG] -- end configuration --
[ maven embedder INFO] [scm:diff]
[ maven embedder INFO] Executing: svn --non-interactive diff
[ maven embedder INFO] Working directory: /export/home/build/data/continuum/checkouts/353/target/scm-plugin-from-embedder
[ maven embedder INFO] 
[ maven embedder INFO] ------------------------------------------------------------------------
[ maven embedder INFO] BUILD SUCCESSFUL
[ maven embedder INFO] ------------------------------------------------------------------------
[ maven embedder INFO] Total time: 2 seconds
[ maven embedder INFO] Finished at: Wed Aug 29 14:18:17 GMT+00:00 2007
[ maven embedder INFO] Final Memory: 9M/321M
[ maven embedder INFO] ------------------------------------------------------------------------
Tests run: 1, Failures: 0, Errors: 0, Skipped: 0, Time elapsed: 3.631 sec
Running org.apache.maven.cli.BatchModeDownloadMonitorTest
url = null://nullnull
Downloading: null://nullnull/null
97K downloaded
java.lang.RuntimeException
	at org.apache.maven.cli.AbstractConsoleDownloadMonitorTest.testTransferError(AbstractConsoleDownloadMonitorTest.java:86)
	at sun.reflect.NativeMethodAccessorImpl.invoke0(Native Method)
	at sun.reflect.NativeMethodAccessorImpl.invoke(NativeMethodAccessorImpl.java:39)
	at sun.reflect.DelegatingMethodAccessorImpl.invoke(DelegatingMethodAccessorImpl.java:25)
	at java.lang.reflect.Method.invoke(Method.java:585)
	at junit.framework.TestCase.runTest(TestCase.java:154)
	at junit.framework.TestCase.runBare(TestCase.java:127)
	at junit.framework.TestResult$1.protect(TestResult.java:106)
	at junit.framework.TestResult.runProtected(TestResult.java:124)
	at junit.framework.TestResult.run(TestResult.java:109)
	at junit.framework.TestCase.run(TestCase.java:118)
	at junit.framework.TestSuite.runTest(TestSuite.java:208)
	at junit.framework.TestSuite.run(TestSuite.java:203)
	at sun.reflect.NativeMethodAccessorImpl.invoke0(Native Method)
	at sun.reflect.NativeMethodAccessorImpl.invoke(NativeMethodAccessorImpl.java:39)
	at sun.reflect.DelegatingMethodAccessorImpl.invoke(DelegatingMethodAccessorImpl.java:25)
	at java.lang.reflect.Method.invoke(Method.java:585)
	at org.apache.maven.surefire.junit.JUnitTestSet.execute(JUnitTestSet.java:213)
	at org.apache.maven.surefire.suite.AbstractDirectoryTestSuite.executeTestSet(AbstractDirectoryTestSuite.java:138)
	at org.apache.maven.surefire.suite.AbstractDirectoryTestSuite.execute(AbstractDirectoryTestSuite.java:125)
	at org.apache.maven.surefire.Surefire.run(Surefire.java:132)
	at sun.reflect.NativeMethodAccessorImpl.invoke0(Native Method)
	at sun.reflect.NativeMethodAccessorImpl.invoke(NativeMethodAccessorImpl.java:39)
	at sun.reflect.DelegatingMethodAccessorImpl.invoke(DelegatingMethodAccessorImpl.java:25)
	at java.lang.reflect.Method.invoke(Method.java:585)
	at org.apache.maven.surefire.booter.SurefireBooter.runSuitesInProcess(SurefireBooter.java:290)
	at org.apache.maven.surefire.booter.SurefireBooter.main(SurefireBooter.java:818)
Tests run: 6, Failures: 0, Errors: 0, Skipped: 0, Time elapsed: 0.013 sec
Running org.apache.maven.embedder.EmbedderUsingEclipsePluginTest
>>> /export/home/build/data/continuum/checkouts/353
properties = null
[ maven embedder INFO] Scanning for projects...
[ maven embedder DEBUG] Pre-scanning POM lineage of: /export/home/build/data/continuum/checkouts/353/target/eclipse-from-embedder/pom.xml for build extensions.
[ maven embedder DEBUG] Building model-lineage for: /export/home/build/data/continuum/checkouts/353/target/eclipse-from-embedder/pom.xml to pre-scan for extensions.
[ maven embedder DEBUG] Checking: org.apache.maven:embedder-test-project:jar:1.0-SNAPSHOT for extensions. (It has 0 modules.)
[ maven embedder DEBUG] Basedir is: /export/home/build/data/continuum/checkouts/353/target/eclipse-from-embedder
[ maven embedder DEBUG] Finished pre-scanning: /export/home/build/data/continuum/checkouts/353/target/eclipse-from-embedder/pom.xml for build extensions.
[ maven embedder INFO] Searching repository for plugin with prefix: 'eclipse'.
[ maven embedder DEBUG] Loading plugin prefixes from group: org.apache.maven.plugins
[ maven embedder DEBUG] Loading plugin prefixes from group: org.codehaus.mojo
[ maven embedder DEBUG] Resolving version for plugin: org.apache.maven.plugins:maven-eclipse-plugin
[ maven embedder DEBUG] Version from POM: null
[ maven embedder DEBUG] Version from another POM in the reactor: null
[ maven embedder DEBUG] maven-eclipse-plugin: resolved to version 2.5-SNAPSHOT from local repository
[ maven embedder DEBUG] Skipping disabled repository central
[ maven embedder DEBUG] maven-eclipse-plugin: using locally installed snapshot
[ maven embedder DEBUG] Version from LATEST metadata: 2.5-SNAPSHOT
[ maven embedder DEBUG] In verifyVersionedPlugin for: org.apache.maven.plugins:maven-eclipse-plugin
[ maven embedder DEBUG] maven-eclipse-plugin: using locally installed snapshot
[ maven embedder DEBUG] org.apache.maven.plugins:maven-eclipse-plugin:maven-plugin:2.5-SNAPSHOT:runtime (selected for runtime)
[ maven embedder DEBUG]   org.codehaus.plexus:plexus-archiver:jar:1.0-alpha-7:runtime (selected for runtime)
[ maven embedder DEBUG]     org.codehaus.plexus:plexus-container-default:jar:1.0-alpha-8:runtime (selected for runtime)
[ maven embedder DEBUG]       org.codehaus.plexus:plexus-utils:jar:1.0.4:runtime (selected for runtime)
[ maven embedder DEBUG]       junit:junit:jar:3.8.1:runtime (selected for runtime)
[ maven embedder DEBUG]       classworlds:classworlds:jar:1.1-alpha-2:runtime (selected for runtime)
[ maven embedder DEBUG]     org.codehaus.plexus:plexus-utils:jar:1.0.4:runtime (removed - nearer found: 1.2)
[ maven embedder DEBUG]     org.codehaus.plexus:plexus-utils:jar:1.2:runtime (selected for runtime)
[ maven embedder DEBUG] Adding managed dependencies for unknown:maven-project
[ maven embedder DEBUG]   org.apache.maven:maven-model:jar:2.0.6
[ maven embedder DEBUG]   org.apache.maven:maven-project:jar:2.0.6
[ maven embedder DEBUG]   org.apache.maven.reporting:maven-reporting-api:jar:2.0.6
[ maven embedder DEBUG]   org.apache.maven:maven-repository-metadata:jar:2.0.6
[ maven embedder DEBUG]   org.apache.maven:maven-artifact:jar:2.0.6
[ maven embedder DEBUG]   org.apache.maven:maven-artifact-manager:jar:2.0.6
[ maven embedder DEBUG]   org.apache.maven:maven-artifact-test:jar:2.0.6
[ maven embedder DEBUG]   org.apache.maven:maven-settings:jar:2.0.6
[ maven embedder DEBUG]   org.apache.maven:maven-plugin-parameter-documenter:jar:2.0.6
[ maven embedder DEBUG]   org.apache.maven:maven-profile:jar:2.0.6
[ maven embedder DEBUG]   org.apache.maven:maven-plugin-registry:jar:2.0.6
[ maven embedder DEBUG]   org.apache.maven:maven-plugin-api:jar:2.0.6
[ maven embedder DEBUG]   org.apache.maven:maven-monitor:jar:2.0.6
[ maven embedder DEBUG]   org.codehaus.plexus:plexus-container-default:jar:1.0-alpha-9-stable-1
[ maven embedder DEBUG]   org.codehaus.plexus:plexus-utils:jar:1.4.1
[ maven embedder DEBUG]   org.apache.maven.wagon:wagon-provider-api:jar:1.0-beta-2
[ maven embedder DEBUG]   org.apache.maven.wagon:wagon-ssh:jar:1.0-beta-2
[ maven embedder DEBUG]   org.apache.maven.wagon:wagon-ssh-external:jar:1.0-beta-2
[ maven embedder DEBUG]   org.apache.maven.wagon:wagon-file:jar:1.0-beta-2
[ maven embedder DEBUG]   org.apache.maven.wagon:wagon-http-lightweight:jar:1.0-beta-2
[ maven embedder DEBUG]   easymock:easymock:jar:1.2_Java1.3:test
[ maven embedder DEBUG]   classworlds:classworlds:jar:1.1
[ maven embedder DEBUG]   org.apache.maven:maven-project:jar:2.0.6:runtime (selected for runtime)
[ maven embedder DEBUG] Adding managed dependencies for unknown:maven-settings
[ maven embedder DEBUG]   org.apache.maven:maven-model:jar:2.0.6
[ maven embedder DEBUG]   org.apache.maven:maven-project:jar:2.0.6
[ maven embedder DEBUG]   org.apache.maven.reporting:maven-reporting-api:jar:2.0.6
[ maven embedder DEBUG]   org.apache.maven:maven-repository-metadata:jar:2.0.6
[ maven embedder DEBUG]   org.apache.maven:maven-artifact:jar:2.0.6
[ maven embedder DEBUG]   org.apache.maven:maven-artifact-manager:jar:2.0.6
[ maven embedder DEBUG]   org.apache.maven:maven-artifact-test:jar:2.0.6
[ maven embedder DEBUG]   org.apache.maven:maven-settings:jar:2.0.6
[ maven embedder DEBUG]   org.apache.maven:maven-plugin-parameter-documenter:jar:2.0.6
[ maven embedder DEBUG]   org.apache.maven:maven-profile:jar:2.0.6
[ maven embedder DEBUG]   org.apache.maven:maven-plugin-registry:jar:2.0.6
[ maven embedder DEBUG]   org.apache.maven:maven-plugin-api:jar:2.0.6
[ maven embedder DEBUG]   org.apache.maven:maven-monitor:jar:2.0.6
[ maven embedder DEBUG]   org.codehaus.plexus:plexus-container-default:jar:1.0-alpha-9-stable-1
[ maven embedder DEBUG]   org.codehaus.plexus:plexus-utils:jar:1.4.1
[ maven embedder DEBUG]   org.apache.maven.wagon:wagon-provider-api:jar:1.0-beta-2
[ maven embedder DEBUG]   org.apache.maven.wagon:wagon-ssh:jar:1.0-beta-2
[ maven embedder DEBUG]   org.apache.maven.wagon:wagon-ssh-external:jar:1.0-beta-2
[ maven embedder DEBUG]   org.apache.maven.wagon:wagon-file:jar:1.0-beta-2
[ maven embedder DEBUG]   org.apache.maven.wagon:wagon-http-lightweight:jar:1.0-beta-2
[ maven embedder DEBUG]   easymock:easymock:jar:1.2_Java1.3:test
[ maven embedder DEBUG]   classworlds:classworlds:jar:1.1
[ maven embedder DEBUG]     org.apache.maven:maven-settings:jar:2.0.6:runtime (selected for runtime)
[ maven embedder DEBUG] Adding managed dependencies for unknown:maven-model
[ maven embedder DEBUG]   org.apache.maven:maven-model:jar:2.0.6
[ maven embedder DEBUG]   org.apache.maven:maven-project:jar:2.0.6
[ maven embedder DEBUG]   org.apache.maven.reporting:maven-reporting-api:jar:2.0.6
[ maven embedder DEBUG]   org.apache.maven:maven-repository-metadata:jar:2.0.6
[ maven embedder DEBUG]   org.apache.maven:maven-artifact:jar:2.0.6
[ maven embedder DEBUG]   org.apache.maven:maven-artifact-manager:jar:2.0.6
[ maven embedder DEBUG]   org.apache.maven:maven-artifact-test:jar:2.0.6
[ maven embedder DEBUG]   org.apache.maven:maven-settings:jar:2.0.6
[ maven embedder DEBUG]   org.apache.maven:maven-plugin-parameter-documenter:jar:2.0.6
[ maven embedder DEBUG]   org.apache.maven:maven-profile:jar:2.0.6
[ maven embedder DEBUG]   org.apache.maven:maven-plugin-registry:jar:2.0.6
[ maven embedder DEBUG]   org.apache.maven:maven-plugin-api:jar:2.0.6
[ maven embedder DEBUG]   org.apache.maven:maven-monitor:jar:2.0.6
[ maven embedder DEBUG]   org.codehaus.plexus:plexus-container-default:jar:1.0-alpha-9-stable-1
[ maven embedder DEBUG]   org.codehaus.plexus:plexus-utils:jar:1.4.1
[ maven embedder DEBUG]   org.apache.maven.wagon:wagon-provider-api:jar:1.0-beta-2
[ maven embedder DEBUG]   org.apache.maven.wagon:wagon-ssh:jar:1.0-beta-2
[ maven embedder DEBUG]   org.apache.maven.wagon:wagon-ssh-external:jar:1.0-beta-2
[ maven embedder DEBUG]   org.apache.maven.wagon:wagon-file:jar:1.0-beta-2
[ maven embedder DEBUG]   org.apache.maven.wagon:wagon-http-lightweight:jar:1.0-beta-2
[ maven embedder DEBUG]   easymock:easymock:jar:1.2_Java1.3:test
[ maven embedder DEBUG]   classworlds:classworlds:jar:1.1
[ maven embedder DEBUG]       org.apache.maven:maven-model:jar:2.0.6:runtime (selected for runtime)
[ maven embedder DEBUG]         org.codehaus.plexus:plexus-utils:jar:1.4.1:runtime (removed - nearer found: 1.2)
[ maven embedder DEBUG]       org.codehaus.plexus:plexus-utils:jar:1.4.1:runtime (removed - nearer found: 1.2)
[ maven embedder DEBUG]       org.codehaus.plexus:plexus-container-default:jar:1.0-alpha-9-stable-1:runtime (removed - nearer found: 1.0-alpha-8)
[ maven embedder DEBUG] Adding managed dependencies for unknown:maven-profile
[ maven embedder DEBUG]   org.apache.maven:maven-model:jar:2.0.6
[ maven embedder DEBUG]   org.apache.maven:maven-project:jar:2.0.6
[ maven embedder DEBUG]   org.apache.maven.reporting:maven-reporting-api:jar:2.0.6
[ maven embedder DEBUG]   org.apache.maven:maven-repository-metadata:jar:2.0.6
[ maven embedder DEBUG]   org.apache.maven:maven-artifact:jar:2.0.6
[ maven embedder DEBUG]   org.apache.maven:maven-artifact-manager:jar:2.0.6
[ maven embedder DEBUG]   org.apache.maven:maven-artifact-test:jar:2.0.6
[ maven embedder DEBUG]   org.apache.maven:maven-settings:jar:2.0.6
[ maven embedder DEBUG]   org.apache.maven:maven-plugin-parameter-documenter:jar:2.0.6
[ maven embedder DEBUG]   org.apache.maven:maven-profile:jar:2.0.6
[ maven embedder DEBUG]   org.apache.maven:maven-plugin-registry:jar:2.0.6
[ maven embedder DEBUG]   org.apache.maven:maven-plugin-api:jar:2.0.6
[ maven embedder DEBUG]   org.apache.maven:maven-monitor:jar:2.0.6
[ maven embedder DEBUG]   org.codehaus.plexus:plexus-container-default:jar:1.0-alpha-9-stable-1
[ maven embedder DEBUG]   org.codehaus.plexus:plexus-utils:jar:1.4.1
[ maven embedder DEBUG]   org.apache.maven.wagon:wagon-provider-api:jar:1.0-beta-2
[ maven embedder DEBUG]   org.apache.maven.wagon:wagon-ssh:jar:1.0-beta-2
[ maven embedder DEBUG]   org.apache.maven.wagon:wagon-ssh-external:jar:1.0-beta-2
[ maven embedder DEBUG]   org.apache.maven.wagon:wagon-file:jar:1.0-beta-2
[ maven embedder DEBUG]   org.apache.maven.wagon:wagon-http-lightweight:jar:1.0-beta-2
[ maven embedder DEBUG]   easymock:easymock:jar:1.2_Java1.3:test
[ maven embedder DEBUG]   classworlds:classworlds:jar:1.1
[ maven embedder DEBUG]     org.apache.maven:maven-profile:jar:2.0.6:runtime (selected for runtime)
[ maven embedder DEBUG]       org.codehaus.plexus:plexus-utils:jar:1.4.1:runtime (removed - nearer found: 1.2)
[ maven embedder DEBUG]       org.codehaus.plexus:plexus-container-default:jar:1.0-alpha-9-stable-1:runtime (removed - nearer found: 1.0-alpha-8)
[ maven embedder DEBUG]     org.apache.maven:maven-model:jar:2.0.6:runtime (selected for runtime)
[ maven embedder DEBUG]       org.codehaus.plexus:plexus-utils:jar:1.4.1:runtime (removed - nearer found: 1.2)
[ maven embedder DEBUG] Adding managed dependencies for unknown:maven-artifact-manager
[ maven embedder DEBUG]   org.apache.maven:maven-model:jar:2.0.6
[ maven embedder DEBUG]   org.apache.maven:maven-project:jar:2.0.6
[ maven embedder DEBUG]   org.apache.maven.reporting:maven-reporting-api:jar:2.0.6
[ maven embedder DEBUG]   org.apache.maven:maven-repository-metadata:jar:2.0.6
[ maven embedder DEBUG]   org.apache.maven:maven-artifact:jar:2.0.6
[ maven embedder DEBUG]   org.apache.maven:maven-artifact-manager:jar:2.0.6
[ maven embedder DEBUG]   org.apache.maven:maven-artifact-test:jar:2.0.6
[ maven embedder DEBUG]   org.apache.maven:maven-settings:jar:2.0.6
[ maven embedder DEBUG]   org.apache.maven:maven-plugin-parameter-documenter:jar:2.0.6
[ maven embedder DEBUG]   org.apache.maven:maven-profile:jar:2.0.6
[ maven embedder DEBUG]   org.apache.maven:maven-plugin-registry:jar:2.0.6
[ maven embedder DEBUG]   org.apache.maven:maven-plugin-api:jar:2.0.6
[ maven embedder DEBUG]   org.apache.maven:maven-monitor:jar:2.0.6
[ maven embedder DEBUG]   org.codehaus.plexus:plexus-container-default:jar:1.0-alpha-9-stable-1
[ maven embedder DEBUG]   org.codehaus.plexus:plexus-utils:jar:1.4.1
[ maven embedder DEBUG]   org.apache.maven.wagon:wagon-provider-api:jar:1.0-beta-2
[ maven embedder DEBUG]   org.apache.maven.wagon:wagon-ssh:jar:1.0-beta-2
[ maven embedder DEBUG]   org.apache.maven.wagon:wagon-ssh-external:jar:1.0-beta-2
[ maven embedder DEBUG]   org.apache.maven.wagon:wagon-file:jar:1.0-beta-2
[ maven embedder DEBUG]   org.apache.maven.wagon:wagon-http-lightweight:jar:1.0-beta-2
[ maven embedder DEBUG]   easymock:easymock:jar:1.2_Java1.3:test
[ maven embedder DEBUG]   classworlds:classworlds:jar:1.1
[ maven embedder DEBUG]     org.apache.maven:maven-artifact-manager:jar:2.0.6:runtime (selected for runtime)
[ maven embedder DEBUG] Adding managed dependencies for unknown:maven-repository-metadata
[ maven embedder DEBUG]   org.apache.maven:maven-model:jar:2.0.6
[ maven embedder DEBUG]   org.apache.maven:maven-project:jar:2.0.6
[ maven embedder DEBUG]   org.apache.maven.reporting:maven-reporting-api:jar:2.0.6
[ maven embedder DEBUG]   org.apache.maven:maven-repository-metadata:jar:2.0.6
[ maven embedder DEBUG]   org.apache.maven:maven-artifact:jar:2.0.6
[ maven embedder DEBUG]   org.apache.maven:maven-artifact-manager:jar:2.0.6
[ maven embedder DEBUG]   org.apache.maven:maven-artifact-test:jar:2.0.6
[ maven embedder DEBUG]   org.apache.maven:maven-settings:jar:2.0.6
[ maven embedder DEBUG]   org.apache.maven:maven-plugin-parameter-documenter:jar:2.0.6
[ maven embedder DEBUG]   org.apache.maven:maven-profile:jar:2.0.6
[ maven embedder DEBUG]   org.apache.maven:maven-plugin-registry:jar:2.0.6
[ maven embedder DEBUG]   org.apache.maven:maven-plugin-api:jar:2.0.6
[ maven embedder DEBUG]   org.apache.maven:maven-monitor:jar:2.0.6
[ maven embedder DEBUG]   org.codehaus.plexus:plexus-container-default:jar:1.0-alpha-9-stable-1
[ maven embedder DEBUG]   org.codehaus.plexus:plexus-utils:jar:1.4.1
[ maven embedder DEBUG]   org.apache.maven.wagon:wagon-provider-api:jar:1.0-beta-2
[ maven embedder DEBUG]   org.apache.maven.wagon:wagon-ssh:jar:1.0-beta-2
[ maven embedder DEBUG]   org.apache.maven.wagon:wagon-ssh-external:jar:1.0-beta-2
[ maven embedder DEBUG]   org.apache.maven.wagon:wagon-file:jar:1.0-beta-2
[ maven embedder DEBUG]   org.apache.maven.wagon:wagon-http-lightweight:jar:1.0-beta-2
[ maven embedder DEBUG]   easymock:easymock:jar:1.2_Java1.3:test
[ maven embedder DEBUG]   classworlds:classworlds:jar:1.1
[ maven embedder DEBUG]       org.apache.maven:maven-repository-metadata:jar:2.0.6:runtime (selected for runtime)
[ maven embedder DEBUG]         org.codehaus.plexus:plexus-utils:jar:1.4.1:runtime (removed - nearer found: 1.2)
[ maven embedder DEBUG]       org.codehaus.plexus:plexus-utils:jar:1.4.1:runtime (removed - nearer found: 1.2)
[ maven embedder DEBUG] Adding managed dependencies for unknown:maven-artifact
[ maven embedder DEBUG]   org.apache.maven:maven-model:jar:2.0.6
[ maven embedder DEBUG]   org.apache.maven:maven-project:jar:2.0.6
[ maven embedder DEBUG]   org.apache.maven.reporting:maven-reporting-api:jar:2.0.6
[ maven embedder DEBUG]   org.apache.maven:maven-repository-metadata:jar:2.0.6
[ maven embedder DEBUG]   org.apache.maven:maven-artifact:jar:2.0.6
[ maven embedder DEBUG]   org.apache.maven:maven-artifact-manager:jar:2.0.6
[ maven embedder DEBUG]   org.apache.maven:maven-artifact-test:jar:2.0.6
[ maven embedder DEBUG]   org.apache.maven:maven-settings:jar:2.0.6
[ maven embedder DEBUG]   org.apache.maven:maven-plugin-parameter-documenter:jar:2.0.6
[ maven embedder DEBUG]   org.apache.maven:maven-profile:jar:2.0.6
[ maven embedder DEBUG]   org.apache.maven:maven-plugin-registry:jar:2.0.6
[ maven embedder DEBUG]   org.apache.maven:maven-plugin-api:jar:2.0.6
[ maven embedder DEBUG]   org.apache.maven:maven-monitor:jar:2.0.6
[ maven embedder DEBUG]   org.codehaus.plexus:plexus-container-default:jar:1.0-alpha-9-stable-1
[ maven embedder DEBUG]   org.codehaus.plexus:plexus-utils:jar:1.4.1
[ maven embedder DEBUG]   org.apache.maven.wagon:wagon-provider-api:jar:1.0-beta-2
[ maven embedder DEBUG]   org.apache.maven.wagon:wagon-ssh:jar:1.0-beta-2
[ maven embedder DEBUG]   org.apache.maven.wagon:wagon-ssh-external:jar:1.0-beta-2
[ maven embedder DEBUG]   org.apache.maven.wagon:wagon-file:jar:1.0-beta-2
[ maven embedder DEBUG]   org.apache.maven.wagon:wagon-http-lightweight:jar:1.0-beta-2
[ maven embedder DEBUG]   easymock:easymock:jar:1.2_Java1.3:test
[ maven embedder DEBUG]   classworlds:classworlds:jar:1.1
[ maven embedder DEBUG]       org.apache.maven:maven-artifact:jar:2.0.6:runtime (selected for runtime)
[ maven embedder DEBUG]         org.codehaus.plexus:plexus-utils:jar:1.4.1:runtime (removed - nearer found: 1.2)
[ maven embedder DEBUG]       org.codehaus.plexus:plexus-container-default:jar:1.0-alpha-9-stable-1:runtime (removed - nearer found: 1.0-alpha-8)
[ maven embedder DEBUG] Adding managed dependencies for unknown:wagon-provider-api
[ maven embedder DEBUG]   org.apache.maven.wagon:wagon-provider-api:jar:1.0-beta-2
[ maven embedder DEBUG]   org.apache.maven.wagon:wagon-provider-test:jar:1.0-beta-2
[ maven embedder DEBUG]   org.apache.maven.wagon:wagon-ssh-common-test:jar:1.0-beta-2
[ maven embedder DEBUG]   org.apache.maven.wagon:wagon-ssh-common:jar:1.0-beta-2
[ maven embedder DEBUG]   junit:junit:jar:3.8.1
[ maven embedder DEBUG]   org.codehaus.plexus:plexus-interactivity-api:jar:1.0-alpha-4
[ maven embedder DEBUG]   org.codehaus.plexus:plexus-container-default:jar:1.0-alpha-8
[ maven embedder DEBUG]   org.codehaus.plexus:plexus-utils:jar:1.0.4
[ maven embedder DEBUG]       org.apache.maven.wagon:wagon-provider-api:jar:1.0-beta-2:runtime (selected for runtime)
[ maven embedder DEBUG]         org.codehaus.plexus:plexus-utils:jar:1.0.4:runtime (removed - nearer found: 1.2)
[ maven embedder DEBUG] Adding managed dependencies for org.apache.maven:maven-plugin-registry
[ maven embedder DEBUG]   org.apache.maven:maven-model:jar:2.0.6
[ maven embedder DEBUG]   org.apache.maven:maven-project:jar:2.0.6
[ maven embedder DEBUG]   org.apache.maven.reporting:maven-reporting-api:jar:2.0.6
[ maven embedder DEBUG]   org.apache.maven:maven-repository-metadata:jar:2.0.6
[ maven embedder DEBUG]   org.apache.maven:maven-artifact:jar:2.0.6
[ maven embedder DEBUG]   org.apache.maven:maven-artifact-manager:jar:2.0.6
[ maven embedder DEBUG]   org.apache.maven:maven-artifact-test:jar:2.0.6
[ maven embedder DEBUG]   org.apache.maven:maven-settings:jar:2.0.6
[ maven embedder DEBUG]   org.apache.maven:maven-plugin-parameter-documenter:jar:2.0.6
[ maven embedder DEBUG]   org.apache.maven:maven-profile:jar:2.0.6
[ maven embedder DEBUG]   org.apache.maven:maven-plugin-registry:jar:2.0.6
[ maven embedder DEBUG]   org.apache.maven:maven-plugin-api:jar:2.0.6
[ maven embedder DEBUG]   org.apache.maven:maven-monitor:jar:2.0.6
[ maven embedder DEBUG]   org.codehaus.plexus:plexus-container-default:jar:1.0-alpha-9-stable-1
[ maven embedder DEBUG]   org.codehaus.plexus:plexus-utils:jar:1.4.1
[ maven embedder DEBUG]   org.apache.maven.wagon:wagon-provider-api:jar:1.0-beta-2
[ maven embedder DEBUG]   org.apache.maven.wagon:wagon-ssh:jar:1.0-beta-2
[ maven embedder DEBUG]   org.apache.maven.wagon:wagon-ssh-external:jar:1.0-beta-2
[ maven embedder DEBUG]   org.apache.maven.wagon:wagon-file:jar:1.0-beta-2
[ maven embedder DEBUG]   org.apache.maven.wagon:wagon-http-lightweight:jar:1.0-beta-2
[ maven embedder DEBUG]   easymock:easymock:jar:1.2_Java1.3:test
[ maven embedder DEBUG]   classworlds:classworlds:jar:1.1
[ maven embedder DEBUG]     org.apache.maven:maven-plugin-registry:jar:2.0.6:runtime (selected for runtime)
[ maven embedder DEBUG]       org.codehaus.plexus:plexus-utils:jar:1.4.1:runtime (removed - nearer found: 1.2)
[ maven embedder DEBUG]       org.codehaus.plexus:plexus-container-default:jar:1.0-alpha-9-stable-1:runtime (removed - nearer found: 1.0-alpha-8)
[ maven embedder DEBUG]     org.codehaus.plexus:plexus-utils:jar:1.4.1:runtime (removed - nearer found: 1.2)
[ maven embedder DEBUG]     org.apache.maven:maven-artifact:jar:2.0.6:runtime (selected for runtime)
[ maven embedder DEBUG]       org.codehaus.plexus:plexus-utils:jar:1.4.1:runtime (removed - nearer found: 1.2)
[ maven embedder DEBUG]     org.codehaus.plexus:plexus-container-default:jar:1.0-alpha-9-stable-1:runtime (removed - nearer found: 1.0-alpha-8)
[ maven embedder DEBUG] Adding managed dependencies for unknown:maven-plugin-api
[ maven embedder DEBUG]   org.apache.maven:maven-model:jar:2.0.6
[ maven embedder DEBUG]   org.apache.maven:maven-project:jar:2.0.6
[ maven embedder DEBUG]   org.apache.maven.reporting:maven-reporting-api:jar:2.0.6
[ maven embedder DEBUG]   org.apache.maven:maven-repository-metadata:jar:2.0.6
[ maven embedder DEBUG]   org.apache.maven:maven-artifact:jar:2.0.6
[ maven embedder DEBUG]   org.apache.maven:maven-artifact-manager:jar:2.0.6
[ maven embedder DEBUG]   org.apache.maven:maven-artifact-test:jar:2.0.6
[ maven embedder DEBUG]   org.apache.maven:maven-settings:jar:2.0.6
[ maven embedder DEBUG]   org.apache.maven:maven-plugin-parameter-documenter:jar:2.0.6
[ maven embedder DEBUG]   org.apache.maven:maven-profile:jar:2.0.6
[ maven embedder DEBUG]   org.apache.maven:maven-plugin-registry:jar:2.0.6
[ maven embedder DEBUG]   org.apache.maven:maven-plugin-api:jar:2.0.6
[ maven embedder DEBUG]   org.apache.maven:maven-monitor:jar:2.0.6
[ maven embedder DEBUG]   org.codehaus.plexus:plexus-container-default:jar:1.0-alpha-9-stable-1
[ maven embedder DEBUG]   org.codehaus.plexus:plexus-utils:jar:1.4.1
[ maven embedder DEBUG]   org.apache.maven.wagon:wagon-provider-api:jar:1.0-beta-2
[ maven embedder DEBUG]   org.apache.maven.wagon:wagon-ssh:jar:1.0-beta-2
[ maven embedder DEBUG]   org.apache.maven.wagon:wagon-ssh-external:jar:1.0-beta-2
[ maven embedder DEBUG]   org.apache.maven.wagon:wagon-file:jar:1.0-beta-2
[ maven embedder DEBUG]   org.apache.maven.wagon:wagon-http-lightweight:jar:1.0-beta-2
[ maven embedder DEBUG]   easymock:easymock:jar:1.2_Java1.3:test
[ maven embedder DEBUG]   classworlds:classworlds:jar:1.1
[ maven embedder DEBUG]   org.apache.maven:maven-plugin-api:jar:2.0.6:runtime (selected for runtime)
[ maven embedder DEBUG]   org.apache.maven:maven-model:jar:2.0.6:runtime (selected for runtime)
[ maven embedder DEBUG]     org.codehaus.plexus:plexus-utils:jar:1.4.1:runtime (removed - nearer found: 1.2)
[ maven embedder DEBUG]   org.apache.maven:maven-artifact-manager:jar:2.0.6:runtime (selected for runtime)
[ maven embedder DEBUG]     org.apache.maven:maven-repository-metadata:jar:2.0.6:runtime (selected for runtime)
[ maven embedder DEBUG]       org.codehaus.plexus:plexus-utils:jar:1.4.1:runtime (removed - nearer found: 1.2)
[ maven embedder DEBUG]     org.codehaus.plexus:plexus-utils:jar:1.4.1:runtime (removed - nearer found: 1.2)
[ maven embedder DEBUG]     org.codehaus.plexus:plexus-container-default:jar:1.0-alpha-9-stable-1:runtime (removed - nearer found: 1.0-alpha-8)
[ maven embedder DEBUG]     org.apache.maven.wagon:wagon-provider-api:jar:1.0-beta-2:runtime (selected for runtime)
[ maven embedder DEBUG]       org.codehaus.plexus:plexus-utils:jar:1.0.4:runtime (removed - nearer found: 1.2)
[ maven embedder DEBUG]   org.apache.maven:maven-artifact:jar:2.0.6:runtime (selected for runtime)
[ maven embedder DEBUG]     org.codehaus.plexus:plexus-utils:jar:1.4.1:runtime (removed - nearer found: 1.2)
[ maven embedder DEBUG]   org.codehaus.plexus:plexus-utils:jar:1.2:runtime (removed - nearer found: 1.4.2)
[ maven embedder DEBUG]   org.codehaus.plexus:plexus-utils:jar:1.4.2:runtime (selected for runtime)
[ maven embedder DEBUG]   org.codehaus.plexus:plexus-interactivity-jline:jar:1.0-alpha-5:runtime (selected for runtime)
[ maven embedder DEBUG]     jline:jline:jar:0.9.1:runtime (selected for runtime)
[ maven embedder DEBUG]     org.codehaus.plexus:plexus-interactivity-api:jar:1.0-alpha-5:runtime (selected for runtime)
[ maven embedder DEBUG]   org.apache.maven:maven-archiver:jar:2.2:runtime (selected for runtime)
[ maven embedder DEBUG] Adding managed dependencies for unknown:maven-project
[ maven embedder DEBUG]   org.codehaus.plexus:plexus-container-default:jar:1.0-alpha-8
[ maven embedder DEBUG]   org.codehaus.plexus:plexus-utils:jar:1.0.4
[ maven embedder DEBUG]   org.apache.maven.wagon:wagon-provider-api:jar:1.0-alpha-5
[ maven embedder DEBUG]   org.apache.maven.wagon:wagon-ssh:jar:1.0-alpha-5
[ maven embedder DEBUG]   org.apache.maven.wagon:wagon-file:jar:1.0-alpha-5
[ maven embedder DEBUG]   org.apache.maven.wagon:wagon-http-lightweight:jar:1.0-alpha-5
[ maven embedder DEBUG]     org.apache.maven:maven-project:jar:2.0:runtime (removed - nearer found: 2.0.6)
[ maven embedder DEBUG] Adding managed dependencies for org.apache.maven:maven-artifact
[ maven embedder DEBUG]   org.codehaus.plexus:plexus-container-default:jar:1.0-alpha-8
[ maven embedder DEBUG]   org.codehaus.plexus:plexus-utils:jar:1.0.4
[ maven embedder DEBUG]   org.apache.maven.wagon:wagon-provider-api:jar:1.0-alpha-5
[ maven embedder DEBUG]   org.apache.maven.wagon:wagon-ssh:jar:1.0-alpha-5
[ maven embedder DEBUG]   org.apache.maven.wagon:wagon-file:jar:1.0-alpha-5
[ maven embedder DEBUG]   org.apache.maven.wagon:wagon-http-lightweight:jar:1.0-alpha-5
[ maven embedder DEBUG]     org.apache.maven:maven-artifact:jar:2.0:runtime (removed - nearer found: 2.0.6)
[ maven embedder DEBUG]   biz.aQute:bndlib:jar:0.0.145:runtime (selected for runtime)
[ maven embedder DEBUG] Using the following artifacts for classpath of: org.apache.maven.plugins:maven-eclipse-plugin:maven-plugin:2.5-SNAPSHOT:

[org.codehaus.plexus:plexus-archiver:jar:1.0-alpha-7:runtime
 org.codehaus.plexus:plexus-utils:jar:1.4.2:runtime
 org.codehaus.plexus:plexus-interactivity-jline:jar:1.0-alpha-5:runtime
 jline:jline:jar:0.9.1:runtime
 org.apache.maven:maven-archiver:jar:2.2:runtime
 biz.aQute:bndlib:jar:0.0.145:runtime]
[ maven embedder DEBUG] Checking for plugin descriptor for: org.apache.maven.plugins:maven-eclipse-plugin in collector: org.apache.maven.plugin.MavenPluginCollector@1636e4e
[ maven embedder DEBUG] Realm for plugin: org.apache.maven.plugins:maven-eclipse-plugin:
org.codehaus.plexus.classworlds.realm.ClassRealm@1fc1a6
[ maven embedder DEBUG] In verifyVersionedPlugin for: org.apache.maven.plugins:maven-eclipse-plugin
[ maven embedder DEBUG] maven-eclipse-plugin: using locally installed snapshot
[ maven embedder DEBUG] org.apache.maven.plugins:maven-eclipse-plugin:maven-plugin:2.5-SNAPSHOT:runtime (selected for runtime)
[ maven embedder DEBUG]   org.codehaus.plexus:plexus-archiver:jar:1.0-alpha-7:runtime (selected for runtime)
[ maven embedder DEBUG]     org.codehaus.plexus:plexus-container-default:jar:1.0-alpha-8:runtime (selected for runtime)
[ maven embedder DEBUG]       org.codehaus.plexus:plexus-utils:jar:1.0.4:runtime (selected for runtime)
[ maven embedder DEBUG]       junit:junit:jar:3.8.1:runtime (selected for runtime)
[ maven embedder DEBUG]       classworlds:classworlds:jar:1.1-alpha-2:runtime (selected for runtime)
[ maven embedder DEBUG]     org.codehaus.plexus:plexus-utils:jar:1.0.4:runtime (removed - nearer found: 1.2)
[ maven embedder DEBUG]     org.codehaus.plexus:plexus-utils:jar:1.2:runtime (selected for runtime)
[ maven embedder DEBUG]   org.apache.maven:maven-project:jar:2.0.6:runtime (selected for runtime)
[ maven embedder DEBUG]     org.apache.maven:maven-settings:jar:2.0.6:runtime (selected for runtime)
[ maven embedder DEBUG]       org.apache.maven:maven-model:jar:2.0.6:runtime (selected for runtime)
[ maven embedder DEBUG]         org.codehaus.plexus:plexus-utils:jar:1.4.1:runtime (removed - nearer found: 1.2)
[ maven embedder DEBUG]       org.codehaus.plexus:plexus-utils:jar:1.4.1:runtime (removed - nearer found: 1.2)
[ maven embedder DEBUG]       org.codehaus.plexus:plexus-container-default:jar:1.0-alpha-9-stable-1:runtime (removed - nearer found: 1.0-alpha-8)
[ maven embedder DEBUG]     org.apache.maven:maven-profile:jar:2.0.6:runtime (selected for runtime)
[ maven embedder DEBUG]       org.codehaus.plexus:plexus-utils:jar:1.4.1:runtime (removed - nearer found: 1.2)
[ maven embedder DEBUG]       org.codehaus.plexus:plexus-container-default:jar:1.0-alpha-9-stable-1:runtime (removed - nearer found: 1.0-alpha-8)
[ maven embedder DEBUG]     org.apache.maven:maven-model:jar:2.0.6:runtime (selected for runtime)
[ maven embedder DEBUG]       org.codehaus.plexus:plexus-utils:jar:1.4.1:runtime (removed - nearer found: 1.2)
[ maven embedder DEBUG]     org.apache.maven:maven-artifact-manager:jar:2.0.6:runtime (selected for runtime)
[ maven embedder DEBUG]       org.apache.maven:maven-repository-metadata:jar:2.0.6:runtime (selected for runtime)
[ maven embedder DEBUG]         org.codehaus.plexus:plexus-utils:jar:1.4.1:runtime (removed - nearer found: 1.2)
[ maven embedder DEBUG]       org.codehaus.plexus:plexus-utils:jar:1.4.1:runtime (removed - nearer found: 1.2)
[ maven embedder DEBUG]       org.apache.maven:maven-artifact:jar:2.0.6:runtime (selected for runtime)
[ maven embedder DEBUG]         org.codehaus.plexus:plexus-utils:jar:1.4.1:runtime (removed - nearer found: 1.2)
[ maven embedder DEBUG]       org.codehaus.plexus:plexus-container-default:jar:1.0-alpha-9-stable-1:runtime (removed - nearer found: 1.0-alpha-8)
[ maven embedder DEBUG]       org.apache.maven.wagon:wagon-provider-api:jar:1.0-beta-2:runtime (selected for runtime)
[ maven embedder DEBUG]         org.codehaus.plexus:plexus-utils:jar:1.0.4:runtime (removed - nearer found: 1.2)
[ maven embedder DEBUG]     org.apache.maven:maven-plugin-registry:jar:2.0.6:runtime (selected for runtime)
[ maven embedder DEBUG]       org.codehaus.plexus:plexus-utils:jar:1.4.1:runtime (removed - nearer found: 1.2)
[ maven embedder DEBUG]       org.codehaus.plexus:plexus-container-default:jar:1.0-alpha-9-stable-1:runtime (removed - nearer found: 1.0-alpha-8)
[ maven embedder DEBUG]     org.codehaus.plexus:plexus-utils:jar:1.4.1:runtime (removed - nearer found: 1.2)
[ maven embedder DEBUG]     org.apache.maven:maven-artifact:jar:2.0.6:runtime (selected for runtime)
[ maven embedder DEBUG]       org.codehaus.plexus:plexus-utils:jar:1.4.1:runtime (removed - nearer found: 1.2)
[ maven embedder DEBUG]     org.codehaus.plexus:plexus-container-default:jar:1.0-alpha-9-stable-1:runtime (removed - nearer found: 1.0-alpha-8)
[ maven embedder DEBUG]   org.apache.maven:maven-plugin-api:jar:2.0.6:runtime (selected for runtime)
[ maven embedder DEBUG]   org.apache.maven:maven-model:jar:2.0.6:runtime (selected for runtime)
[ maven embedder DEBUG]     org.codehaus.plexus:plexus-utils:jar:1.4.1:runtime (removed - nearer found: 1.2)
[ maven embedder DEBUG]   org.apache.maven:maven-artifact-manager:jar:2.0.6:runtime (selected for runtime)
[ maven embedder DEBUG]     org.apache.maven:maven-repository-metadata:jar:2.0.6:runtime (selected for runtime)
[ maven embedder DEBUG]       org.codehaus.plexus:plexus-utils:jar:1.4.1:runtime (removed - nearer found: 1.2)
[ maven embedder DEBUG]     org.codehaus.plexus:plexus-utils:jar:1.4.1:runtime (removed - nearer found: 1.2)
[ maven embedder DEBUG]     org.codehaus.plexus:plexus-container-default:jar:1.0-alpha-9-stable-1:runtime (removed - nearer found: 1.0-alpha-8)
[ maven embedder DEBUG]     org.apache.maven.wagon:wagon-provider-api:jar:1.0-beta-2:runtime (selected for runtime)
[ maven embedder DEBUG]       org.codehaus.plexus:plexus-utils:jar:1.0.4:runtime (removed - nearer found: 1.2)
[ maven embedder DEBUG]   org.apache.maven:maven-artifact:jar:2.0.6:runtime (selected for runtime)
[ maven embedder DEBUG]     org.codehaus.plexus:plexus-utils:jar:1.4.1:runtime (removed - nearer found: 1.2)
[ maven embedder DEBUG]   org.codehaus.plexus:plexus-utils:jar:1.2:runtime (removed - nearer found: 1.4.2)
[ maven embedder DEBUG]   org.codehaus.plexus:plexus-utils:jar:1.4.2:runtime (selected for runtime)
[ maven embedder DEBUG]   org.codehaus.plexus:plexus-interactivity-jline:jar:1.0-alpha-5:runtime (selected for runtime)
[ maven embedder DEBUG]     jline:jline:jar:0.9.1:runtime (selected for runtime)
[ maven embedder DEBUG]     org.codehaus.plexus:plexus-interactivity-api:jar:1.0-alpha-5:runtime (selected for runtime)
[ maven embedder DEBUG]   org.apache.maven:maven-archiver:jar:2.2:runtime (selected for runtime)
[ maven embedder DEBUG]     org.apache.maven:maven-project:jar:2.0:runtime (removed - nearer found: 2.0.6)
[ maven embedder DEBUG]     org.apache.maven:maven-artifact:jar:2.0:runtime (removed - nearer found: 2.0.6)
[ maven embedder DEBUG]   biz.aQute:bndlib:jar:0.0.145:runtime (selected for runtime)
[ maven embedder DEBUG] Using the following artifacts for classpath of: org.apache.maven.plugins:maven-eclipse-plugin:maven-plugin:2.5-SNAPSHOT:

[org.codehaus.plexus:plexus-archiver:jar:1.0-alpha-7:runtime
 org.codehaus.plexus:plexus-utils:jar:1.4.2:runtime
 org.codehaus.plexus:plexus-interactivity-jline:jar:1.0-alpha-5:runtime
 jline:jline:jar:0.9.1:runtime
 org.apache.maven:maven-archiver:jar:2.2:runtime
 biz.aQute:bndlib:jar:0.0.145:runtime]
[ maven embedder DEBUG] Realm already exists for: org.apache.maven.plugins:maven-eclipse-plugin. Skipping addition...
[ maven embedder INFO] ----------------------------------------------------------------------------
[ maven embedder INFO] Building Maven Quick Start Archetype
[ maven embedder INFO]    task-segment: [eclipse:eclipse]
[ maven embedder INFO] ----------------------------------------------------------------------------
[ maven embedder WARNING] Assuming that mojo: 'eclipse:eclipse' does NOT need configuration from the <reporting /> section of the POM.
[ maven embedder DEBUG] In verifyVersionedPlugin for: org.apache.maven.plugins:maven-eclipse-plugin
[ maven embedder DEBUG] maven-eclipse-plugin: using locally installed snapshot
[ maven embedder DEBUG] org.apache.maven.plugins:maven-eclipse-plugin:maven-plugin:2.5-SNAPSHOT:runtime (selected for runtime)
[ maven embedder DEBUG]   org.codehaus.plexus:plexus-archiver:jar:1.0-alpha-7:runtime (selected for runtime)
[ maven embedder DEBUG]     org.codehaus.plexus:plexus-container-default:jar:1.0-alpha-8:runtime (selected for runtime)
[ maven embedder DEBUG]       org.codehaus.plexus:plexus-utils:jar:1.0.4:runtime (selected for runtime)
[ maven embedder DEBUG]       junit:junit:jar:3.8.1:runtime (selected for runtime)
[ maven embedder DEBUG]       classworlds:classworlds:jar:1.1-alpha-2:runtime (selected for runtime)
[ maven embedder DEBUG]     org.codehaus.plexus:plexus-utils:jar:1.0.4:runtime (removed - nearer found: 1.2)
[ maven embedder DEBUG]     org.codehaus.plexus:plexus-utils:jar:1.2:runtime (selected for runtime)
[ maven embedder DEBUG]   org.apache.maven:maven-project:jar:2.0.6:runtime (selected for runtime)
[ maven embedder DEBUG]     org.apache.maven:maven-settings:jar:2.0.6:runtime (selected for runtime)
[ maven embedder DEBUG]       org.apache.maven:maven-model:jar:2.0.6:runtime (selected for runtime)
[ maven embedder DEBUG]         org.codehaus.plexus:plexus-utils:jar:1.4.1:runtime (removed - nearer found: 1.2)
[ maven embedder DEBUG]       org.codehaus.plexus:plexus-utils:jar:1.4.1:runtime (removed - nearer found: 1.2)
[ maven embedder DEBUG]       org.codehaus.plexus:plexus-container-default:jar:1.0-alpha-9-stable-1:runtime (removed - nearer found: 1.0-alpha-8)
[ maven embedder DEBUG]     org.apache.maven:maven-profile:jar:2.0.6:runtime (selected for runtime)
[ maven embedder DEBUG]       org.codehaus.plexus:plexus-utils:jar:1.4.1:runtime (removed - nearer found: 1.2)
[ maven embedder DEBUG]       org.codehaus.plexus:plexus-container-default:jar:1.0-alpha-9-stable-1:runtime (removed - nearer found: 1.0-alpha-8)
[ maven embedder DEBUG]     org.apache.maven:maven-model:jar:2.0.6:runtime (selected for runtime)
[ maven embedder DEBUG]       org.codehaus.plexus:plexus-utils:jar:1.4.1:runtime (removed - nearer found: 1.2)
[ maven embedder DEBUG]     org.apache.maven:maven-artifact-manager:jar:2.0.6:runtime (selected for runtime)
[ maven embedder DEBUG]       org.apache.maven:maven-repository-metadata:jar:2.0.6:runtime (selected for runtime)
[ maven embedder DEBUG]         org.codehaus.plexus:plexus-utils:jar:1.4.1:runtime (removed - nearer found: 1.2)
[ maven embedder DEBUG]       org.codehaus.plexus:plexus-utils:jar:1.4.1:runtime (removed - nearer found: 1.2)
[ maven embedder DEBUG]       org.apache.maven:maven-artifact:jar:2.0.6:runtime (selected for runtime)
[ maven embedder DEBUG]         org.codehaus.plexus:plexus-utils:jar:1.4.1:runtime (removed - nearer found: 1.2)
[ maven embedder DEBUG]       org.codehaus.plexus:plexus-container-default:jar:1.0-alpha-9-stable-1:runtime (removed - nearer found: 1.0-alpha-8)
[ maven embedder DEBUG]       org.apache.maven.wagon:wagon-provider-api:jar:1.0-beta-2:runtime (selected for runtime)
[ maven embedder DEBUG]         org.codehaus.plexus:plexus-utils:jar:1.0.4:runtime (removed - nearer found: 1.2)
[ maven embedder DEBUG]     org.apache.maven:maven-plugin-registry:jar:2.0.6:runtime (selected for runtime)
[ maven embedder DEBUG]       org.codehaus.plexus:plexus-utils:jar:1.4.1:runtime (removed - nearer found: 1.2)
[ maven embedder DEBUG]       org.codehaus.plexus:plexus-container-default:jar:1.0-alpha-9-stable-1:runtime (removed - nearer found: 1.0-alpha-8)
[ maven embedder DEBUG]     org.codehaus.plexus:plexus-utils:jar:1.4.1:runtime (removed - nearer found: 1.2)
[ maven embedder DEBUG]     org.apache.maven:maven-artifact:jar:2.0.6:runtime (selected for runtime)
[ maven embedder DEBUG]       org.codehaus.plexus:plexus-utils:jar:1.4.1:runtime (removed - nearer found: 1.2)
[ maven embedder DEBUG]     org.codehaus.plexus:plexus-container-default:jar:1.0-alpha-9-stable-1:runtime (removed - nearer found: 1.0-alpha-8)
[ maven embedder DEBUG]   org.apache.maven:maven-plugin-api:jar:2.0.6:runtime (selected for runtime)
[ maven embedder DEBUG]   org.apache.maven:maven-model:jar:2.0.6:runtime (selected for runtime)
[ maven embedder DEBUG]     org.codehaus.plexus:plexus-utils:jar:1.4.1:runtime (removed - nearer found: 1.2)
[ maven embedder DEBUG]   org.apache.maven:maven-artifact-manager:jar:2.0.6:runtime (selected for runtime)
[ maven embedder DEBUG]     org.apache.maven:maven-repository-metadata:jar:2.0.6:runtime (selected for runtime)
[ maven embedder DEBUG]       org.codehaus.plexus:plexus-utils:jar:1.4.1:runtime (removed - nearer found: 1.2)
[ maven embedder DEBUG]     org.codehaus.plexus:plexus-utils:jar:1.4.1:runtime (removed - nearer found: 1.2)
[ maven embedder DEBUG]     org.codehaus.plexus:plexus-container-default:jar:1.0-alpha-9-stable-1:runtime (removed - nearer found: 1.0-alpha-8)
[ maven embedder DEBUG]     org.apache.maven.wagon:wagon-provider-api:jar:1.0-beta-2:runtime (selected for runtime)
[ maven embedder DEBUG]       org.codehaus.plexus:plexus-utils:jar:1.0.4:runtime (removed - nearer found: 1.2)
[ maven embedder DEBUG]   org.apache.maven:maven-artifact:jar:2.0.6:runtime (selected for runtime)
[ maven embedder DEBUG]     org.codehaus.plexus:plexus-utils:jar:1.4.1:runtime (removed - nearer found: 1.2)
[ maven embedder DEBUG]   org.codehaus.plexus:plexus-utils:jar:1.2:runtime (removed - nearer found: 1.4.2)
[ maven embedder DEBUG]   org.codehaus.plexus:plexus-utils:jar:1.4.2:runtime (selected for runtime)
[ maven embedder DEBUG]   org.codehaus.plexus:plexus-interactivity-jline:jar:1.0-alpha-5:runtime (selected for runtime)
[ maven embedder DEBUG]     jline:jline:jar:0.9.1:runtime (selected for runtime)
[ maven embedder DEBUG]     org.codehaus.plexus:plexus-interactivity-api:jar:1.0-alpha-5:runtime (selected for runtime)
[ maven embedder DEBUG]   org.apache.maven:maven-archiver:jar:2.2:runtime (selected for runtime)
[ maven embedder DEBUG]     org.apache.maven:maven-project:jar:2.0:runtime (removed - nearer found: 2.0.6)
[ maven embedder DEBUG]     org.apache.maven:maven-artifact:jar:2.0:runtime (removed - nearer found: 2.0.6)
[ maven embedder DEBUG]   biz.aQute:bndlib:jar:0.0.145:runtime (selected for runtime)
[ maven embedder DEBUG] Using the following artifacts for classpath of: org.apache.maven.plugins:maven-eclipse-plugin:maven-plugin:2.5-SNAPSHOT:

[org.codehaus.plexus:plexus-archiver:jar:1.0-alpha-7:runtime
 org.codehaus.plexus:plexus-utils:jar:1.4.2:runtime
 org.codehaus.plexus:plexus-interactivity-jline:jar:1.0-alpha-5:runtime
 jline:jline:jar:0.9.1:runtime
 org.apache.maven:maven-archiver:jar:2.2:runtime
 biz.aQute:bndlib:jar:0.0.145:runtime]
[ maven embedder DEBUG] Realm already exists for: org.apache.maven.plugins:maven-eclipse-plugin. Skipping addition...
[ maven embedder DEBUG] In verifyVersionedPlugin for: org.apache.maven.plugins:maven-eclipse-plugin
[ maven embedder DEBUG] maven-eclipse-plugin: using locally installed snapshot
[ maven embedder DEBUG] org.apache.maven.plugins:maven-eclipse-plugin:maven-plugin:2.5-SNAPSHOT:runtime (selected for runtime)
[ maven embedder DEBUG]   org.codehaus.plexus:plexus-archiver:jar:1.0-alpha-7:runtime (selected for runtime)
[ maven embedder DEBUG]     org.codehaus.plexus:plexus-container-default:jar:1.0-alpha-8:runtime (selected for runtime)
[ maven embedder DEBUG]       org.codehaus.plexus:plexus-utils:jar:1.0.4:runtime (selected for runtime)
[ maven embedder DEBUG]       junit:junit:jar:3.8.1:runtime (selected for runtime)
[ maven embedder DEBUG]       classworlds:classworlds:jar:1.1-alpha-2:runtime (selected for runtime)
[ maven embedder DEBUG]     org.codehaus.plexus:plexus-utils:jar:1.0.4:runtime (removed - nearer found: 1.2)
[ maven embedder DEBUG]     org.codehaus.plexus:plexus-utils:jar:1.2:runtime (selected for runtime)
[ maven embedder DEBUG]   org.apache.maven:maven-project:jar:2.0.6:runtime (selected for runtime)
[ maven embedder DEBUG]     org.apache.maven:maven-settings:jar:2.0.6:runtime (selected for runtime)
[ maven embedder DEBUG]       org.apache.maven:maven-model:jar:2.0.6:runtime (selected for runtime)
[ maven embedder DEBUG]         org.codehaus.plexus:plexus-utils:jar:1.4.1:runtime (removed - nearer found: 1.2)
[ maven embedder DEBUG]       org.codehaus.plexus:plexus-utils:jar:1.4.1:runtime (removed - nearer found: 1.2)
[ maven embedder DEBUG]       org.codehaus.plexus:plexus-container-default:jar:1.0-alpha-9-stable-1:runtime (removed - nearer found: 1.0-alpha-8)
[ maven embedder DEBUG]     org.apache.maven:maven-profile:jar:2.0.6:runtime (selected for runtime)
[ maven embedder DEBUG]       org.codehaus.plexus:plexus-utils:jar:1.4.1:runtime (removed - nearer found: 1.2)
[ maven embedder DEBUG]       org.codehaus.plexus:plexus-container-default:jar:1.0-alpha-9-stable-1:runtime (removed - nearer found: 1.0-alpha-8)
[ maven embedder DEBUG]     org.apache.maven:maven-model:jar:2.0.6:runtime (selected for runtime)
[ maven embedder DEBUG]       org.codehaus.plexus:plexus-utils:jar:1.4.1:runtime (removed - nearer found: 1.2)
[ maven embedder DEBUG]     org.apache.maven:maven-artifact-manager:jar:2.0.6:runtime (selected for runtime)
[ maven embedder DEBUG]       org.apache.maven:maven-repository-metadata:jar:2.0.6:runtime (selected for runtime)
[ maven embedder DEBUG]         org.codehaus.plexus:plexus-utils:jar:1.4.1:runtime (removed - nearer found: 1.2)
[ maven embedder DEBUG]       org.codehaus.plexus:plexus-utils:jar:1.4.1:runtime (removed - nearer found: 1.2)
[ maven embedder DEBUG]       org.apache.maven:maven-artifact:jar:2.0.6:runtime (selected for runtime)
[ maven embedder DEBUG]         org.codehaus.plexus:plexus-utils:jar:1.4.1:runtime (removed - nearer found: 1.2)
[ maven embedder DEBUG]       org.codehaus.plexus:plexus-container-default:jar:1.0-alpha-9-stable-1:runtime (removed - nearer found: 1.0-alpha-8)
[ maven embedder DEBUG]       org.apache.maven.wagon:wagon-provider-api:jar:1.0-beta-2:runtime (selected for runtime)
[ maven embedder DEBUG]         org.codehaus.plexus:plexus-utils:jar:1.0.4:runtime (removed - nearer found: 1.2)
[ maven embedder DEBUG]     org.apache.maven:maven-plugin-registry:jar:2.0.6:runtime (selected for runtime)
[ maven embedder DEBUG]       org.codehaus.plexus:plexus-utils:jar:1.4.1:runtime (removed - nearer found: 1.2)
[ maven embedder DEBUG]       org.codehaus.plexus:plexus-container-default:jar:1.0-alpha-9-stable-1:runtime (removed - nearer found: 1.0-alpha-8)
[ maven embedder DEBUG]     org.codehaus.plexus:plexus-utils:jar:1.4.1:runtime (removed - nearer found: 1.2)
[ maven embedder DEBUG]     org.apache.maven:maven-artifact:jar:2.0.6:runtime (selected for runtime)
[ maven embedder DEBUG]       org.codehaus.plexus:plexus-utils:jar:1.4.1:runtime (removed - nearer found: 1.2)
[ maven embedder DEBUG]     org.codehaus.plexus:plexus-container-default:jar:1.0-alpha-9-stable-1:runtime (removed - nearer found: 1.0-alpha-8)
[ maven embedder DEBUG]   org.apache.maven:maven-plugin-api:jar:2.0.6:runtime (selected for runtime)
[ maven embedder DEBUG]   org.apache.maven:maven-model:jar:2.0.6:runtime (selected for runtime)
[ maven embedder DEBUG]     org.codehaus.plexus:plexus-utils:jar:1.4.1:runtime (removed - nearer found: 1.2)
[ maven embedder DEBUG]   org.apache.maven:maven-artifact-manager:jar:2.0.6:runtime (selected for runtime)
[ maven embedder DEBUG]     org.apache.maven:maven-repository-metadata:jar:2.0.6:runtime (selected for runtime)
[ maven embedder DEBUG]       org.codehaus.plexus:plexus-utils:jar:1.4.1:runtime (removed - nearer found: 1.2)
[ maven embedder DEBUG]     org.codehaus.plexus:plexus-utils:jar:1.4.1:runtime (removed - nearer found: 1.2)
[ maven embedder DEBUG]     org.codehaus.plexus:plexus-container-default:jar:1.0-alpha-9-stable-1:runtime (removed - nearer found: 1.0-alpha-8)
[ maven embedder DEBUG]     org.apache.maven.wagon:wagon-provider-api:jar:1.0-beta-2:runtime (selected for runtime)
[ maven embedder DEBUG]       org.codehaus.plexus:plexus-utils:jar:1.0.4:runtime (removed - nearer found: 1.2)
[ maven embedder DEBUG]   org.apache.maven:maven-artifact:jar:2.0.6:runtime (selected for runtime)
[ maven embedder DEBUG]     org.codehaus.plexus:plexus-utils:jar:1.4.1:runtime (removed - nearer found: 1.2)
[ maven embedder DEBUG]   org.codehaus.plexus:plexus-utils:jar:1.2:runtime (removed - nearer found: 1.4.2)
[ maven embedder DEBUG]   org.codehaus.plexus:plexus-utils:jar:1.4.2:runtime (selected for runtime)
[ maven embedder DEBUG]   org.codehaus.plexus:plexus-interactivity-jline:jar:1.0-alpha-5:runtime (selected for runtime)
[ maven embedder DEBUG]     jline:jline:jar:0.9.1:runtime (selected for runtime)
[ maven embedder DEBUG]     org.codehaus.plexus:plexus-interactivity-api:jar:1.0-alpha-5:runtime (selected for runtime)
[ maven embedder DEBUG]   org.apache.maven:maven-archiver:jar:2.2:runtime (selected for runtime)
[ maven embedder DEBUG]     org.apache.maven:maven-project:jar:2.0:runtime (removed - nearer found: 2.0.6)
[ maven embedder DEBUG]     org.apache.maven:maven-artifact:jar:2.0:runtime (removed - nearer found: 2.0.6)
[ maven embedder DEBUG]   biz.aQute:bndlib:jar:0.0.145:runtime (selected for runtime)
[ maven embedder DEBUG] Using the following artifacts for classpath of: org.apache.maven.plugins:maven-eclipse-plugin:maven-plugin:2.5-SNAPSHOT:

[org.codehaus.plexus:plexus-archiver:jar:1.0-alpha-7:runtime
 org.codehaus.plexus:plexus-utils:jar:1.4.2:runtime
 org.codehaus.plexus:plexus-interactivity-jline:jar:1.0-alpha-5:runtime
 jline:jline:jar:0.9.1:runtime
 org.apache.maven:maven-archiver:jar:2.2:runtime
 biz.aQute:bndlib:jar:0.0.145:runtime]
[ maven embedder DEBUG] Realm already exists for: org.apache.maven.plugins:maven-eclipse-plugin. Skipping addition...
[ maven embedder DEBUG] 

Our build plan is:

1. org.apache.maven.plugins:maven-eclipse-plugin:2.5-SNAPSHOT:eclipse [executionId: default]


[ maven embedder DEBUG] Mojo: eclipse has config:
null
[ maven embedder DEBUG] In verifyVersionedPlugin for: org.apache.maven.plugins:maven-eclipse-plugin
[ maven embedder DEBUG] maven-eclipse-plugin: using locally installed snapshot
[ maven embedder DEBUG] org.apache.maven.plugins:maven-eclipse-plugin:maven-plugin:2.5-SNAPSHOT:runtime (selected for runtime)
[ maven embedder DEBUG]   org.codehaus.plexus:plexus-archiver:jar:1.0-alpha-7:runtime (selected for runtime)
[ maven embedder DEBUG]     org.codehaus.plexus:plexus-container-default:jar:1.0-alpha-8:runtime (selected for runtime)
[ maven embedder DEBUG]       org.codehaus.plexus:plexus-utils:jar:1.0.4:runtime (selected for runtime)
[ maven embedder DEBUG]       junit:junit:jar:3.8.1:runtime (selected for runtime)
[ maven embedder DEBUG]       classworlds:classworlds:jar:1.1-alpha-2:runtime (selected for runtime)
[ maven embedder DEBUG]     org.codehaus.plexus:plexus-utils:jar:1.0.4:runtime (removed - nearer found: 1.2)
[ maven embedder DEBUG]     org.codehaus.plexus:plexus-utils:jar:1.2:runtime (selected for runtime)
[ maven embedder DEBUG]   org.apache.maven:maven-project:jar:2.0.6:runtime (selected for runtime)
[ maven embedder DEBUG]     org.apache.maven:maven-settings:jar:2.0.6:runtime (selected for runtime)
[ maven embedder DEBUG]       org.apache.maven:maven-model:jar:2.0.6:runtime (selected for runtime)
[ maven embedder DEBUG]         org.codehaus.plexus:plexus-utils:jar:1.4.1:runtime (removed - nearer found: 1.2)
[ maven embedder DEBUG]       org.codehaus.plexus:plexus-utils:jar:1.4.1:runtime (removed - nearer found: 1.2)
[ maven embedder DEBUG]       org.codehaus.plexus:plexus-container-default:jar:1.0-alpha-9-stable-1:runtime (removed - nearer found: 1.0-alpha-8)
[ maven embedder DEBUG]     org.apache.maven:maven-profile:jar:2.0.6:runtime (selected for runtime)
[ maven embedder DEBUG]       org.codehaus.plexus:plexus-utils:jar:1.4.1:runtime (removed - nearer found: 1.2)
[ maven embedder DEBUG]       org.codehaus.plexus:plexus-container-default:jar:1.0-alpha-9-stable-1:runtime (removed - nearer found: 1.0-alpha-8)
[ maven embedder DEBUG]     org.apache.maven:maven-model:jar:2.0.6:runtime (selected for runtime)
[ maven embedder DEBUG]       org.codehaus.plexus:plexus-utils:jar:1.4.1:runtime (removed - nearer found: 1.2)
[ maven embedder DEBUG]     org.apache.maven:maven-artifact-manager:jar:2.0.6:runtime (selected for runtime)
[ maven embedder DEBUG]       org.apache.maven:maven-repository-metadata:jar:2.0.6:runtime (selected for runtime)
[ maven embedder DEBUG]         org.codehaus.plexus:plexus-utils:jar:1.4.1:runtime (removed - nearer found: 1.2)
[ maven embedder DEBUG]       org.codehaus.plexus:plexus-utils:jar:1.4.1:runtime (removed - nearer found: 1.2)
[ maven embedder DEBUG]       org.apache.maven:maven-artifact:jar:2.0.6:runtime (selected for runtime)
[ maven embedder DEBUG]         org.codehaus.plexus:plexus-utils:jar:1.4.1:runtime (removed - nearer found: 1.2)
[ maven embedder DEBUG]       org.codehaus.plexus:plexus-container-default:jar:1.0-alpha-9-stable-1:runtime (removed - nearer found: 1.0-alpha-8)
[ maven embedder DEBUG]       org.apache.maven.wagon:wagon-provider-api:jar:1.0-beta-2:runtime (selected for runtime)
[ maven embedder DEBUG]         org.codehaus.plexus:plexus-utils:jar:1.0.4:runtime (removed - nearer found: 1.2)
[ maven embedder DEBUG]     org.apache.maven:maven-plugin-registry:jar:2.0.6:runtime (selected for runtime)
[ maven embedder DEBUG]       org.codehaus.plexus:plexus-utils:jar:1.4.1:runtime (removed - nearer found: 1.2)
[ maven embedder DEBUG]       org.codehaus.plexus:plexus-container-default:jar:1.0-alpha-9-stable-1:runtime (removed - nearer found: 1.0-alpha-8)
[ maven embedder DEBUG]     org.codehaus.plexus:plexus-utils:jar:1.4.1:runtime (removed - nearer found: 1.2)
[ maven embedder DEBUG]     org.apache.maven:maven-artifact:jar:2.0.6:runtime (selected for runtime)
[ maven embedder DEBUG]       org.codehaus.plexus:plexus-utils:jar:1.4.1:runtime (removed - nearer found: 1.2)
[ maven embedder DEBUG]     org.codehaus.plexus:plexus-container-default:jar:1.0-alpha-9-stable-1:runtime (removed - nearer found: 1.0-alpha-8)
[ maven embedder DEBUG]   org.apache.maven:maven-plugin-api:jar:2.0.6:runtime (selected for runtime)
[ maven embedder DEBUG]   org.apache.maven:maven-model:jar:2.0.6:runtime (selected for runtime)
[ maven embedder DEBUG]     org.codehaus.plexus:plexus-utils:jar:1.4.1:runtime (removed - nearer found: 1.2)
[ maven embedder DEBUG]   org.apache.maven:maven-artifact-manager:jar:2.0.6:runtime (selected for runtime)
[ maven embedder DEBUG]     org.apache.maven:maven-repository-metadata:jar:2.0.6:runtime (selected for runtime)
[ maven embedder DEBUG]       org.codehaus.plexus:plexus-utils:jar:1.4.1:runtime (removed - nearer found: 1.2)
[ maven embedder DEBUG]     org.codehaus.plexus:plexus-utils:jar:1.4.1:runtime (removed - nearer found: 1.2)
[ maven embedder DEBUG]     org.codehaus.plexus:plexus-container-default:jar:1.0-alpha-9-stable-1:runtime (removed - nearer found: 1.0-alpha-8)
[ maven embedder DEBUG]     org.apache.maven.wagon:wagon-provider-api:jar:1.0-beta-2:runtime (selected for runtime)
[ maven embedder DEBUG]       org.codehaus.plexus:plexus-utils:jar:1.0.4:runtime (removed - nearer found: 1.2)
[ maven embedder DEBUG]   org.apache.maven:maven-artifact:jar:2.0.6:runtime (selected for runtime)
[ maven embedder DEBUG]     org.codehaus.plexus:plexus-utils:jar:1.4.1:runtime (removed - nearer found: 1.2)
[ maven embedder DEBUG]   org.codehaus.plexus:plexus-utils:jar:1.2:runtime (removed - nearer found: 1.4.2)
[ maven embedder DEBUG]   org.codehaus.plexus:plexus-utils:jar:1.4.2:runtime (selected for runtime)
[ maven embedder DEBUG]   org.codehaus.plexus:plexus-interactivity-jline:jar:1.0-alpha-5:runtime (selected for runtime)
[ maven embedder DEBUG]     jline:jline:jar:0.9.1:runtime (selected for runtime)
[ maven embedder DEBUG]     org.codehaus.plexus:plexus-interactivity-api:jar:1.0-alpha-5:runtime (selected for runtime)
[ maven embedder DEBUG]   org.apache.maven:maven-archiver:jar:2.2:runtime (selected for runtime)
[ maven embedder DEBUG]     org.apache.maven:maven-project:jar:2.0:runtime (removed - nearer found: 2.0.6)
[ maven embedder DEBUG]     org.apache.maven:maven-artifact:jar:2.0:runtime (removed - nearer found: 2.0.6)
[ maven embedder DEBUG]   biz.aQute:bndlib:jar:0.0.145:runtime (selected for runtime)
[ maven embedder DEBUG] Using the following artifacts for classpath of: org.apache.maven.plugins:maven-eclipse-plugin:maven-plugin:2.5-SNAPSHOT:

[org.codehaus.plexus:plexus-archiver:jar:1.0-alpha-7:runtime
 org.codehaus.plexus:plexus-utils:jar:1.4.2:runtime
 org.codehaus.plexus:plexus-interactivity-jline:jar:1.0-alpha-5:runtime
 jline:jline:jar:0.9.1:runtime
 org.apache.maven:maven-archiver:jar:2.2:runtime
 biz.aQute:bndlib:jar:0.0.145:runtime]
[ maven embedder DEBUG] Realm already exists for: org.apache.maven.plugins:maven-eclipse-plugin. Skipping addition...
[ maven embedder DEBUG] Looking up mojo org.apache.maven.plugins:maven-eclipse-plugin:2.5-SNAPSHOT:eclipse in realm org.apache.maven.plugins:maven-eclipse-plugin - descRealmId=org.apache.maven.plugins:maven-eclipse-plugin
[ maven embedder DEBUG] Looked up - org.apache.maven.plugin.eclipse.EclipsePlugin@1be2893 - org.codehaus.plexus.classworlds.realm.ClassRealm@1fc1a6
[ maven embedder DEBUG] Configuring mojo 'org.apache.maven.plugins:maven-eclipse-plugin:2.5-SNAPSHOT:eclipse' -->
[ maven embedder DEBUG]   (s) addGroupIdToProjectName = false
[ maven embedder DEBUG]   (s) addVersionToProjectName = false
[ maven embedder DEBUG]   (s) buildOutputDirectory = /export/home/build/data/continuum/checkouts/353/target/eclipse-from-embedder/target/classes
[ maven embedder DEBUG]   (s) executedProject = org.apache.maven.project.MavenProject@9b4e89a9
[ maven embedder DEBUG]   (s) localRepository = [local] -> file:///export/home/build/.m2/repository
[ maven embedder DEBUG]   (f) manifest = /export/home/build/data/continuum/checkouts/353/target/eclipse-from-embedder/META-INF/MANIFEST.MF
[ maven embedder DEBUG]   (f) pde = false
[ maven embedder DEBUG]   (s) project = org.apache.maven.project.MavenProject@9b4e89a9
[ maven embedder DEBUG]   (s) reactorProjects = [org.apache.maven.project.MavenProject@9b4e89a9]
[ maven embedder DEBUG]   (s) remoteArtifactRepositories = [[central] -> http://repo1.maven.org/maven2]
[ maven embedder DEBUG]   (f) skip = false
[ maven embedder DEBUG]   (s) useProjectReferences = true
[ maven embedder DEBUG]   (f) wtpContextName = embedder-test-project
[ maven embedder DEBUG]   (s) wtpversion = none
[ maven embedder DEBUG] -- end configuration --
[ maven embedder INFO] [eclipse:eclipse]
[ maven embedder DEBUG] org.apache.maven:embedder-test-project:jar:1.0-SNAPSHOT (selected for null)
[ maven embedder DEBUG]   junit:junit:jar:3.8.1:test (selected for test)
[ maven embedder INFO] Using source status cache: /export/home/build/data/continuum/checkouts/353/target/eclipse-from-embedder/target/mvn-eclipse-cache.properties
[ maven embedder DEBUG] Searching for sources for junit:junit:3.8.1:null at junit:junit:3.8.1:sources
[ maven embedder DEBUG] Searching for sources for junit:junit:3.8.1:null at junit:junit:3.8.1:javadoc
[ maven embedder DEBUG] Processing resource dir: /export/home/build/data/continuum/checkouts/353/target/eclipse-from-embedder/src/main/resources
[ maven embedder DEBUG] Resource dir: /export/home/build/data/continuum/checkouts/353/target/eclipse-from-embedder/src/main/resources either missing or not a directory.
[ maven embedder DEBUG] testOutput toRelativeAndFixSeparator /export/home/build/data/continuum/checkouts/353/target/eclipse-from-embedder , /export/home/build/data/continuum/checkouts/353/target/eclipse-from-embedder/target/test-classes
[ maven embedder DEBUG] testOutput after toRelative : target/test-classes
[ maven embedder DEBUG] Processing resource dir: /export/home/build/data/continuum/checkouts/353/target/eclipse-from-embedder/src/test/resources
[ maven embedder DEBUG] Resource dir: /export/home/build/data/continuum/checkouts/353/target/eclipse-from-embedder/src/test/resources either missing or not a directory.
[ maven embedder INFO] Not writing settings - defaults suffice
[ maven embedder DEBUG] Processing source src/main/java: output=null; default output=target/classes
[ maven embedder DEBUG] Processing source src/test/java: output=target/test-classes; default output=target/classes
[ maven embedder INFO] Wrote Eclipse project for "embedder-test-project" to /export/home/build/data/continuum/checkouts/353/target/eclipse-from-embedder.
[ maven embedder INFO] 
       Sources for some artifacts are not available.
       Please run the same goal with the -DdownloadSources=true parameter in order to check remote repositories for sources.
       List of artifacts without a source archive:
         o junit:junit:3.8.1

       Javadoc for some artifacts is not available.
       Please run the same goal with the -DdownloadJavadoc=true parameter in order to check remote repositories for javadoc.
       List of artifacts without a javadoc archive:
         o junit:junit:3.8.1

[ maven embedder INFO] ------------------------------------------------------------------------
[ maven embedder INFO] BUILD SUCCESSFUL
[ maven embedder INFO] ------------------------------------------------------------------------
[ maven embedder INFO] Total time: 1 second
[ maven embedder INFO] Finished at: Wed Aug 29 14:18:19 GMT+00:00 2007
[ maven embedder INFO] Final Memory: 14M/321M
[ maven embedder INFO] ------------------------------------------------------------------------
Tests run: 1, Failures: 0, Errors: 0, Skipped: 0, Time elapsed: 1.889 sec
Running org.apache.maven.embedder.MavenEmbedderTest
[ maven embedder INFO] Scanning for projects...
[ maven embedder INFO] ----------------------------------------------------------------------------
[ maven embedder INFO] Building Maven Quick Start Archetype
[ maven embedder INFO]    task-segment: [package]
[ maven embedder INFO] ----------------------------------------------------------------------------
[ maven embedder WARNING] Cannot find parent POM: org.apache.maven.surefire:surefire::2.4-SNAPSHOT for child: [inherited]:surefire-booter:jar:[inherited]. Using stub model instead.
[ maven embedder WARNING] POM for 'org.apache.maven.surefire:surefire-booter:pom:2.4-SNAPSHOT:runtime' is invalid. It will be ignored for artifact resolution. Reason: Failed to validate POM for project org.apache.maven.surefire:surefire-booter at Artifact [org.apache.maven.surefire:surefire-booter:pom:2.4-SNAPSHOT:runtime]
[ maven embedder WARNING] Cannot find parent POM: org.apache.maven.surefire:surefire::2.4-SNAPSHOT for child: [inherited]:surefire-booter:jar:[inherited]. Using stub model instead.
[ maven embedder WARNING] POM for 'org.apache.maven.surefire:surefire-booter:pom:2.4-SNAPSHOT:runtime' is invalid. It will be ignored for artifact resolution. Reason: Failed to validate POM for project org.apache.maven.surefire:surefire-booter at Artifact [org.apache.maven.surefire:surefire-booter:pom:2.4-SNAPSHOT:runtime]
[ maven embedder INFO] [resources:resources]
[ maven embedder INFO] Using default encoding to copy filtered resources.
[ maven embedder INFO] Resource directory does not exist: /export/home/build/data/continuum/checkouts/353/target/embedder-test-project0/src/main/resources
[ maven embedder INFO] [compiler:compile]
[ maven embedder INFO] Compiling 1 source file to /export/home/build/data/continuum/checkouts/353/target/embedder-test-project0/target/classes
[ maven embedder INFO] [resources:testResources]
[ maven embedder INFO] Using default encoding to copy filtered resources.
[ maven embedder INFO] Resource directory does not exist: /export/home/build/data/continuum/checkouts/353/target/embedder-test-project0/src/test/resources
[ maven embedder INFO] [compiler:testCompile]
[ maven embedder INFO] Compiling 1 source file to /export/home/build/data/continuum/checkouts/353/target/embedder-test-project0/target/test-classes
[ maven embedder WARNING] Cannot find parent POM: org.apache.maven.surefire:surefire::2.4-SNAPSHOT for child: [inherited]:surefire-booter:jar:[inherited]. Using stub model instead.
[ maven embedder WARNING] POM for 'org.apache.maven.surefire:surefire-booter:pom:2.4-SNAPSHOT:runtime' is invalid. It will be ignored for artifact resolution. Reason: Failed to validate POM for project org.apache.maven.surefire:surefire-booter at Artifact [org.apache.maven.surefire:surefire-booter:pom:2.4-SNAPSHOT:runtime]
[ maven embedder INFO] ------------------------------------------------------------------------
[ maven embedder ERROR] BUILD ERROR
[ maven embedder INFO] ------------------------------------------------------------------------
[ maven embedder INFO] Internal error in the plugin manager executing goal 'org.apache.maven.plugins:maven-surefire-plugin:2.4-SNAPSHOT:test': Unable to find the mojo 'org.apache.maven.plugins:maven-surefire-plugin:2.4-SNAPSHOT:test' in the plugin 'org.apache.maven.plugins:maven-surefire-plugin'
org/apache/maven/surefire/util/NestedCheckedException
[ maven embedder INFO] ------------------------------------------------------------------------
[ maven embedder INFO] Trace
org.apache.maven.BuildFailureException: Internal error in the plugin manager executing goal 'org.apache.maven.plugins:maven-surefire-plugin:2.4-SNAPSHOT:test': Unable to find the mojo 'org.apache.maven.plugins:maven-surefire-plugin:2.4-SNAPSHOT:test' in the plugin 'org.apache.maven.plugins:maven-surefire-plugin'
	at org.apache.maven.DefaultMaven.doExecute(DefaultMaven.java:309)
	at org.apache.maven.DefaultMaven.execute(DefaultMaven.java:126)
	at org.apache.maven.embedder.MavenEmbedder.execute(MavenEmbedder.java:924)
	at org.apache.maven.embedder.MavenEmbedderTest.testExecutionUsingABaseDirectory(MavenEmbedderTest.java:125)
	at sun.reflect.NativeMethodAccessorImpl.invoke0(Native Method)
	at sun.reflect.NativeMethodAccessorImpl.invoke(NativeMethodAccessorImpl.java:39)
	at sun.reflect.DelegatingMethodAccessorImpl.invoke(DelegatingMethodAccessorImpl.java:25)
	at java.lang.reflect.Method.invoke(Method.java:585)
	at junit.framework.TestCase.runTest(TestCase.java:154)
	at junit.framework.TestCase.runBare(TestCase.java:127)
	at junit.framework.TestResult$1.protect(TestResult.java:106)
	at junit.framework.TestResult.runProtected(TestResult.java:124)
	at junit.framework.TestResult.run(TestResult.java:109)
	at junit.framework.TestCase.run(TestCase.java:118)
	at junit.framework.TestSuite.runTest(TestSuite.java:208)
	at junit.framework.TestSuite.run(TestSuite.java:203)
	at sun.reflect.NativeMethodAccessorImpl.invoke0(Native Method)
	at sun.reflect.NativeMethodAccessorImpl.invoke(NativeMethodAccessorImpl.java:39)
	at sun.reflect.DelegatingMethodAccessorImpl.invoke(DelegatingMethodAccessorImpl.java:25)
	at java.lang.reflect.Method.invoke(Method.java:585)
	at org.apache.maven.surefire.junit.JUnitTestSet.execute(JUnitTestSet.java:213)
	at org.apache.maven.surefire.suite.AbstractDirectoryTestSuite.executeTestSet(AbstractDirectoryTestSuite.java:138)
	at org.apache.maven.surefire.suite.AbstractDirectoryTestSuite.execute(AbstractDirectoryTestSuite.java:125)
	at org.apache.maven.surefire.Surefire.run(Surefire.java:132)
	at sun.reflect.NativeMethodAccessorImpl.invoke0(Native Method)
	at sun.reflect.NativeMethodAccessorImpl.invoke(NativeMethodAccessorImpl.java:39)
	at sun.reflect.DelegatingMethodAccessorImpl.invoke(DelegatingMethodAccessorImpl.java:25)
	at java.lang.reflect.Method.invoke(Method.java:585)
	at org.apache.maven.surefire.booter.SurefireBooter.runSuitesInProcess(SurefireBooter.java:290)
	at org.apache.maven.surefire.booter.SurefireBooter.main(SurefireBooter.java:818)
Caused by: org.apache.maven.lifecycle.LifecycleExecutionException: Internal error in the plugin manager executing goal 'org.apache.maven.plugins:maven-surefire-plugin:2.4-SNAPSHOT:test': Unable to find the mojo 'org.apache.maven.plugins:maven-surefire-plugin:2.4-SNAPSHOT:test' in the plugin 'org.apache.maven.plugins:maven-surefire-plugin'
	at org.apache.maven.lifecycle.DefaultLifecycleExecutor.executeGoalAndHandleFailures(DefaultLifecycleExecutor.java:358)
	at org.apache.maven.lifecycle.DefaultLifecycleExecutor.executeTaskSegments(DefaultLifecycleExecutor.java:255)
	at org.apache.maven.lifecycle.DefaultLifecycleExecutor.execute(DefaultLifecycleExecutor.java:141)
	at org.apache.maven.DefaultMaven.doExecute(DefaultMaven.java:305)
	... 29 more
Caused by: org.apache.maven.plugin.PluginManagerException: Unable to find the mojo 'org.apache.maven.plugins:maven-surefire-plugin:2.4-SNAPSHOT:test' in the plugin 'org.apache.maven.plugins:maven-surefire-plugin'
	at org.apache.maven.plugin.DefaultPluginManager.getConfiguredMojo(DefaultPluginManager.java:803)
	at org.apache.maven.plugin.DefaultPluginManager.executeMojo(DefaultPluginManager.java:619)
	at org.apache.maven.lifecycle.DefaultLifecycleExecutor.executeGoalAndHandleFailures(DefaultLifecycleExecutor.java:354)
	... 32 more
Caused by: org.codehaus.plexus.component.repository.exception.ComponentLookupException: Unable to lookup component 'org.apache.maven.plugin.Mojo', it could not be created
	at org.codehaus.plexus.DefaultComponentLookupManager.lookup(DefaultComponentLookupManager.java:151)
	at org.codehaus.plexus.DefaultPlexusContainer.lookup(DefaultPlexusContainer.java:283)
	at org.apache.maven.plugin.DefaultPluginManager.getConfiguredMojo(DefaultPluginManager.java:763)
	... 34 more
Caused by: org.codehaus.plexus.component.factory.ComponentInstantiationException: Could not instantiate component: role: 'null', implementation: 'org.apache.maven.plugin.surefire.SurefirePlugin', role hint: 'default' realm: org.apache.maven.plugins:maven-surefire-plugin
	at org.codehaus.plexus.component.factory.java.JavaComponentFactory.makeException(JavaComponentFactory.java:113)
	at org.codehaus.plexus.component.factory.java.JavaComponentFactory.newInstance(JavaComponentFactory.java:87)
	at org.codehaus.plexus.component.manager.AbstractComponentManager.createComponentInstance(AbstractComponentManager.java:239)
	at org.codehaus.plexus.component.manager.AbstractComponentManager.createComponentInstance(AbstractComponentManager.java:128)
	at org.codehaus.plexus.component.manager.PerLookupComponentManager.getComponent(PerLookupComponentManager.java:40)
	at org.codehaus.plexus.DefaultComponentLookupManager.lookup(DefaultComponentLookupManager.java:147)
	... 36 more
Caused by: java.lang.NoClassDefFoundError: org/apache/maven/surefire/util/NestedCheckedException
	at java.lang.ClassLoader.defineClass1(Native Method)
	at java.lang.ClassLoader.defineClass(ClassLoader.java:620)
	at java.security.SecureClassLoader.defineClass(SecureClassLoader.java:124)
	at java.net.URLClassLoader.defineClass(URLClassLoader.java:260)
	at java.net.URLClassLoader.access$100(URLClassLoader.java:56)
	at java.net.URLClassLoader$1.run(URLClassLoader.java:195)
	at java.security.AccessController.doPrivileged(Native Method)
	at java.net.URLClassLoader.findClass(URLClassLoader.java:188)
	at java.lang.ClassLoader.loadClass(ClassLoader.java:306)
	at java.lang.ClassLoader.loadClass(ClassLoader.java:251)
	at org.codehaus.plexus.classworlds.realm.ClassRealm.loadRealmClass(ClassRealm.java:170)
	at org.codehaus.plexus.classworlds.strategy.DefaultStrategy.loadClass(DefaultStrategy.java:67)
	at org.codehaus.plexus.classworlds.realm.ClassRealm.loadClass(ClassRealm.java:197)
	at java.lang.ClassLoader.loadClassInternal(ClassLoader.java:319)
	at java.lang.Class.getDeclaredConstructors0(Native Method)
	at java.lang.Class.privateGetDeclaredConstructors(Class.java:2357)
	at java.lang.Class.getConstructor0(Class.java:2671)
	at java.lang.Class.newInstance0(Class.java:321)
	at java.lang.Class.newInstance(Class.java:303)
	at org.codehaus.plexus.component.factory.java.JavaComponentFactory.newInstance(JavaComponentFactory.java:66)
	... 40 more
[ maven embedder INFO] ------------------------------------------------------------------------
[ maven embedder INFO] Total time: 2 seconds
[ maven embedder INFO] Finished at: Wed Aug 29 14:18:22 GMT+00:00 2007
[ maven embedder INFO] Final Memory: 18M/321M
[ maven embedder INFO] ------------------------------------------------------------------------
[ maven embedder INFO] Error for project: Maven Quick Start Archetype (during org.apache.maven.plugins:maven-surefire-plugin:2.4-SNAPSHOT:test)
[ maven embedder INFO] ------------------------------------------------------------------------
[ maven embedder INFO] Internal error in the plugin manager executing goal 'org.apache.maven.plugins:maven-surefire-plugin:2.4-SNAPSHOT:test': Unable to find the mojo 'org.apache.maven.plugins:maven-surefire-plugin:2.4-SNAPSHOT:test' in the plugin 'org.apache.maven.plugins:maven-surefire-plugin'
org/apache/maven/surefire/util/NestedCheckedException
[ maven embedder INFO] ------------------------------------------------------------------------
[ maven embedder INFO] Trace
org.apache.maven.lifecycle.LifecycleExecutionException: Internal error in the plugin manager executing goal 'org.apache.maven.plugins:maven-surefire-plugin:2.4-SNAPSHOT:test': Unable to find the mojo 'org.apache.maven.plugins:maven-surefire-plugin:2.4-SNAPSHOT:test' in the plugin 'org.apache.maven.plugins:maven-surefire-plugin'
	at org.apache.maven.lifecycle.DefaultLifecycleExecutor.executeGoalAndHandleFailures(DefaultLifecycleExecutor.java:358)
	at org.apache.maven.lifecycle.DefaultLifecycleExecutor.executeTaskSegments(DefaultLifecycleExecutor.java:255)
	at org.apache.maven.lifecycle.DefaultLifecycleExecutor.execute(DefaultLifecycleExecutor.java:141)
	at org.apache.maven.DefaultMaven.doExecute(DefaultMaven.java:305)
	at org.apache.maven.DefaultMaven.execute(DefaultMaven.java:126)
	at org.apache.maven.embedder.MavenEmbedder.execute(MavenEmbedder.java:924)
	at org.apache.maven.embedder.MavenEmbedderTest.testExecutionUsingABaseDirectory(MavenEmbedderTest.java:125)
	at sun.reflect.NativeMethodAccessorImpl.invoke0(Native Method)
	at sun.reflect.NativeMethodAccessorImpl.invoke(NativeMethodAccessorImpl.java:39)
	at sun.reflect.DelegatingMethodAccessorImpl.invoke(DelegatingMethodAccessorImpl.java:25)
	at java.lang.reflect.Method.invoke(Method.java:585)
	at junit.framework.TestCase.runTest(TestCase.java:154)
	at junit.framework.TestCase.runBare(TestCase.java:127)
	at junit.framework.TestResult$1.protect(TestResult.java:106)
	at junit.framework.TestResult.runProtected(TestResult.java:124)
	at junit.framework.TestResult.run(TestResult.java:109)
	at junit.framework.TestCase.run(TestCase.java:118)
	at junit.framework.TestSuite.runTest(TestSuite.java:208)
	at junit.framework.TestSuite.run(TestSuite.java:203)
	at sun.reflect.NativeMethodAccessorImpl.invoke0(Native Method)
	at sun.reflect.NativeMethodAccessorImpl.invoke(NativeMethodAccessorImpl.java:39)
	at sun.reflect.DelegatingMethodAccessorImpl.invoke(DelegatingMethodAccessorImpl.java:25)
	at java.lang.reflect.Method.invoke(Method.java:585)
	at org.apache.maven.surefire.junit.JUnitTestSet.execute(JUnitTestSet.java:213)
	at org.apache.maven.surefire.suite.AbstractDirectoryTestSuite.executeTestSet(AbstractDirectoryTestSuite.java:138)
	at org.apache.maven.surefire.suite.AbstractDirectoryTestSuite.execute(AbstractDirectoryTestSuite.java:125)
	at org.apache.maven.surefire.Surefire.run(Surefire.java:132)
	at sun.reflect.NativeMethodAccessorImpl.invoke0(Native Method)
	at sun.reflect.NativeMethodAccessorImpl.invoke(NativeMethodAccessorImpl.java:39)
	at sun.reflect.DelegatingMethodAccessorImpl.invoke(DelegatingMethodAccessorImpl.java:25)
	at java.lang.reflect.Method.invoke(Method.java:585)
	at org.apache.maven.surefire.booter.SurefireBooter.runSuitesInProcess(SurefireBooter.java:290)
	at org.apache.maven.surefire.booter.SurefireBooter.main(SurefireBooter.java:818)
Caused by: org.apache.maven.plugin.PluginManagerException: Unable to find the mojo 'org.apache.maven.plugins:maven-surefire-plugin:2.4-SNAPSHOT:test' in the plugin 'org.apache.maven.plugins:maven-surefire-plugin'
	at org.apache.maven.plugin.DefaultPluginManager.getConfiguredMojo(DefaultPluginManager.java:803)
	at org.apache.maven.plugin.DefaultPluginManager.executeMojo(DefaultPluginManager.java:619)
	at org.apache.maven.lifecycle.DefaultLifecycleExecutor.executeGoalAndHandleFailures(DefaultLifecycleExecutor.java:354)
	... 32 more
Caused by: org.codehaus.plexus.component.repository.exception.ComponentLookupException: Unable to lookup component 'org.apache.maven.plugin.Mojo', it could not be created
	at org.codehaus.plexus.DefaultComponentLookupManager.lookup(DefaultComponentLookupManager.java:151)
	at org.codehaus.plexus.DefaultPlexusContainer.lookup(DefaultPlexusContainer.java:283)
	at org.apache.maven.plugin.DefaultPluginManager.getConfiguredMojo(DefaultPluginManager.java:763)
	... 34 more
Caused by: org.codehaus.plexus.component.factory.ComponentInstantiationException: Could not instantiate component: role: 'null', implementation: 'org.apache.maven.plugin.surefire.SurefirePlugin', role hint: 'default' realm: org.apache.maven.plugins:maven-surefire-plugin
	at org.codehaus.plexus.component.factory.java.JavaComponentFactory.makeException(JavaComponentFactory.java:113)
	at org.codehaus.plexus.component.factory.java.JavaComponentFactory.newInstance(JavaComponentFactory.java:87)
	at org.codehaus.plexus.component.manager.AbstractComponentManager.createComponentInstance(AbstractComponentManager.java:239)
	at org.codehaus.plexus.component.manager.AbstractComponentManager.createComponentInstance(AbstractComponentManager.java:128)
	at org.codehaus.plexus.component.manager.PerLookupComponentManager.getComponent(PerLookupComponentManager.java:40)
	at org.codehaus.plexus.DefaultComponentLookupManager.lookup(DefaultComponentLookupManager.java:147)
	... 36 more
Caused by: java.lang.NoClassDefFoundError: org/apache/maven/surefire/util/NestedCheckedException
	at java.lang.ClassLoader.defineClass1(Native Method)
	at java.lang.ClassLoader.defineClass(ClassLoader.java:620)
	at java.security.SecureClassLoader.defineClass(SecureClassLoader.java:124)
	at java.net.URLClassLoader.defineClass(URLClassLoader.java:260)
	at java.net.URLClassLoader.access$100(URLClassLoader.java:56)
	at java.net.URLClassLoader$1.run(URLClassLoader.java:195)
	at java.security.AccessController.doPrivileged(Native Method)
	at java.net.URLClassLoader.findClass(URLClassLoader.java:188)
	at java.lang.ClassLoader.loadClass(ClassLoader.java:306)
	at java.lang.ClassLoader.loadClass(ClassLoader.java:251)
	at org.codehaus.plexus.classworlds.realm.ClassRealm.loadRealmClass(ClassRealm.java:170)
	at org.codehaus.plexus.classworlds.strategy.DefaultStrategy.loadClass(DefaultStrategy.java:67)
	at org.codehaus.plexus.classworlds.realm.ClassRealm.loadClass(ClassRealm.java:197)
	at java.lang.ClassLoader.loadClassInternal(ClassLoader.java:319)
	at java.lang.Class.getDeclaredConstructors0(Native Method)
	at java.lang.Class.privateGetDeclaredConstructors(Class.java:2357)
	at java.lang.Class.getConstructor0(Class.java:2671)
	at java.lang.Class.newInstance0(Class.java:321)
	at java.lang.Class.newInstance(Class.java:303)
	at org.codehaus.plexus.component.factory.java.JavaComponentFactory.newInstance(JavaComponentFactory.java:66)
	... 40 more
[ maven embedder INFO] ------------------------------------------------------------------------
[ maven embedder INFO] BUILD ERRORS
[ maven embedder INFO] ------------------------------------------------------------------------
[ maven embedder INFO] Total time: 3 seconds
[ maven embedder INFO] Finished at: Wed Aug 29 14:18:23 GMT+00:00 2007
[ maven embedder INFO] Final Memory: 7M/321M
[ maven embedder INFO] ------------------------------------------------------------------------
Encountered 1 exception(s).
org.apache.maven.reactor.MavenExecutionException: Some builds failed
	at org.apache.maven.DefaultMaven.execute(DefaultMaven.java:167)
	at org.apache.maven.embedder.MavenEmbedder.execute(MavenEmbedder.java:924)
	at org.apache.maven.embedder.MavenEmbedderTest.testExecutionUsingABaseDirectory(MavenEmbedderTest.java:125)
	at sun.reflect.NativeMethodAccessorImpl.invoke0(Native Method)
	at sun.reflect.NativeMethodAccessorImpl.invoke(NativeMethodAccessorImpl.java:39)
	at sun.reflect.DelegatingMethodAccessorImpl.invoke(DelegatingMethodAccessorImpl.java:25)
	at java.lang.reflect.Method.invoke(Method.java:585)
	at junit.framework.TestCase.runTest(TestCase.java:154)
	at junit.framework.TestCase.runBare(TestCase.java:127)
	at junit.framework.TestResult$1.protect(TestResult.java:106)
	at junit.framework.TestResult.runProtected(TestResult.java:124)
	at junit.framework.TestResult.run(TestResult.java:109)
	at junit.framework.TestCase.run(TestCase.java:118)
	at junit.framework.TestSuite.runTest(TestSuite.java:208)
	at junit.framework.TestSuite.run(TestSuite.java:203)
	at sun.reflect.NativeMethodAccessorImpl.invoke0(Native Method)
	at sun.reflect.NativeMethodAccessorImpl.invoke(NativeMethodAccessorImpl.java:39)
	at sun.reflect.DelegatingMethodAccessorImpl.invoke(DelegatingMethodAccessorImpl.java:25)
	at java.lang.reflect.Method.invoke(Method.java:585)
	at org.apache.maven.surefire.junit.JUnitTestSet.execute(JUnitTestSet.java:213)
	at org.apache.maven.surefire.suite.AbstractDirectoryTestSuite.executeTestSet(AbstractDirectoryTestSuite.java:138)
	at org.apache.maven.surefire.suite.AbstractDirectoryTestSuite.execute(AbstractDirectoryTestSuite.java:125)
	at org.apache.maven.surefire.Surefire.run(Surefire.java:132)
	at sun.reflect.NativeMethodAccessorImpl.invoke0(Native Method)
	at sun.reflect.NativeMethodAccessorImpl.invoke(NativeMethodAccessorImpl.java:39)
	at sun.reflect.DelegatingMethodAccessorImpl.invoke(DelegatingMethodAccessorImpl.java:25)
	at java.lang.reflect.Method.invoke(Method.java:585)
	at org.apache.maven.surefire.booter.SurefireBooter.runSuitesInProcess(SurefireBooter.java:290)
	at org.apache.maven.surefire.booter.SurefireBooter.main(SurefireBooter.java:818)
[ maven embedder INFO] Scanning for projects...
[ maven embedder INFO] ----------------------------------------------------------------------------
[ maven embedder INFO] Building Maven Quick Start Archetype
[ maven embedder INFO]    task-segment: [package]
[ maven embedder INFO] ----------------------------------------------------------------------------
[ maven embedder WARNING] Cannot find parent POM: org.apache.maven.surefire:surefire::2.4-SNAPSHOT for child: [inherited]:surefire-booter:jar:[inherited]. Using stub model instead.
[ maven embedder WARNING] POM for 'org.apache.maven.surefire:surefire-booter:pom:2.4-SNAPSHOT:runtime' is invalid. It will be ignored for artifact resolution. Reason: Failed to validate POM for project org.apache.maven.surefire:surefire-booter at Artifact [org.apache.maven.surefire:surefire-booter:pom:2.4-SNAPSHOT:runtime]
[ maven embedder WARNING] Cannot find parent POM: org.apache.maven.surefire:surefire::2.4-SNAPSHOT for child: [inherited]:surefire-booter:jar:[inherited]. Using stub model instead.
[ maven embedder WARNING] POM for 'org.apache.maven.surefire:surefire-booter:pom:2.4-SNAPSHOT:runtime' is invalid. It will be ignored for artifact resolution. Reason: Failed to validate POM for project org.apache.maven.surefire:surefire-booter at Artifact [org.apache.maven.surefire:surefire-booter:pom:2.4-SNAPSHOT:runtime]
[ maven embedder INFO] [resources:resources]
[ maven embedder INFO] Using default encoding to copy filtered resources.
[ maven embedder INFO] Resource directory does not exist: /export/home/build/data/continuum/checkouts/353/target/embedder-test-project1/src/main/resources
[ maven embedder INFO] [compiler:compile]
[ maven embedder INFO] Compiling 1 source file to /export/home/build/data/continuum/checkouts/353/target/embedder-test-project1/target/classes
[ maven embedder INFO] [resources:testResources]
[ maven embedder INFO] Using default encoding to copy filtered resources.
[ maven embedder INFO] Resource directory does not exist: /export/home/build/data/continuum/checkouts/353/target/embedder-test-project1/src/test/resources
[ maven embedder INFO] [compiler:testCompile]
[ maven embedder INFO] Compiling 1 source file to /export/home/build/data/continuum/checkouts/353/target/embedder-test-project1/target/test-classes
[ maven embedder WARNING] Cannot find parent POM: org.apache.maven.surefire:surefire::2.4-SNAPSHOT for child: [inherited]:surefire-booter:jar:[inherited]. Using stub model instead.
[ maven embedder WARNING] POM for 'org.apache.maven.surefire:surefire-booter:pom:2.4-SNAPSHOT:runtime' is invalid. It will be ignored for artifact resolution. Reason: Failed to validate POM for project org.apache.maven.surefire:surefire-booter at Artifact [org.apache.maven.surefire:surefire-booter:pom:2.4-SNAPSHOT:runtime]
[ maven embedder INFO] ------------------------------------------------------------------------
[ maven embedder ERROR] BUILD ERROR
[ maven embedder INFO] ------------------------------------------------------------------------
[ maven embedder INFO] Internal error in the plugin manager executing goal 'org.apache.maven.plugins:maven-surefire-plugin:2.4-SNAPSHOT:test': Unable to find the mojo 'org.apache.maven.plugins:maven-surefire-plugin:2.4-SNAPSHOT:test' in the plugin 'org.apache.maven.plugins:maven-surefire-plugin'
org/apache/maven/surefire/util/NestedCheckedException
[ maven embedder INFO] ------------------------------------------------------------------------
[ maven embedder INFO] Trace
org.apache.maven.BuildFailureException: Internal error in the plugin manager executing goal 'org.apache.maven.plugins:maven-surefire-plugin:2.4-SNAPSHOT:test': Unable to find the mojo 'org.apache.maven.plugins:maven-surefire-plugin:2.4-SNAPSHOT:test' in the plugin 'org.apache.maven.plugins:maven-surefire-plugin'
	at org.apache.maven.DefaultMaven.doExecute(DefaultMaven.java:309)
	at org.apache.maven.DefaultMaven.execute(DefaultMaven.java:126)
	at org.apache.maven.embedder.MavenEmbedder.execute(MavenEmbedder.java:924)
	at org.apache.maven.embedder.MavenEmbedderTest.testExecutionUsingAPomFile(MavenEmbedderTest.java:152)
	at sun.reflect.NativeMethodAccessorImpl.invoke0(Native Method)
	at sun.reflect.NativeMethodAccessorImpl.invoke(NativeMethodAccessorImpl.java:39)
	at sun.reflect.DelegatingMethodAccessorImpl.invoke(DelegatingMethodAccessorImpl.java:25)
	at java.lang.reflect.Method.invoke(Method.java:585)
	at junit.framework.TestCase.runTest(TestCase.java:154)
	at junit.framework.TestCase.runBare(TestCase.java:127)
	at junit.framework.TestResult$1.protect(TestResult.java:106)
	at junit.framework.TestResult.runProtected(TestResult.java:124)
	at junit.framework.TestResult.run(TestResult.java:109)
	at junit.framework.TestCase.run(TestCase.java:118)
	at junit.framework.TestSuite.runTest(TestSuite.java:208)
	at junit.framework.TestSuite.run(TestSuite.java:203)
	at sun.reflect.NativeMethodAccessorImpl.invoke0(Native Method)
	at sun.reflect.NativeMethodAccessorImpl.invoke(NativeMethodAccessorImpl.java:39)
	at sun.reflect.DelegatingMethodAccessorImpl.invoke(DelegatingMethodAccessorImpl.java:25)
	at java.lang.reflect.Method.invoke(Method.java:585)
	at org.apache.maven.surefire.junit.JUnitTestSet.execute(JUnitTestSet.java:213)
	at org.apache.maven.surefire.suite.AbstractDirectoryTestSuite.executeTestSet(AbstractDirectoryTestSuite.java:138)
	at org.apache.maven.surefire.suite.AbstractDirectoryTestSuite.execute(AbstractDirectoryTestSuite.java:125)
	at org.apache.maven.surefire.Surefire.run(Surefire.java:132)
	at sun.reflect.NativeMethodAccessorImpl.invoke0(Native Method)
	at sun.reflect.NativeMethodAccessorImpl.invoke(NativeMethodAccessorImpl.java:39)
	at sun.reflect.DelegatingMethodAccessorImpl.invoke(DelegatingMethodAccessorImpl.java:25)
	at java.lang.reflect.Method.invoke(Method.java:585)
	at org.apache.maven.surefire.booter.SurefireBooter.runSuitesInProcess(SurefireBooter.java:290)
	at org.apache.maven.surefire.booter.SurefireBooter.main(SurefireBooter.java:818)
Caused by: org.apache.maven.lifecycle.LifecycleExecutionException: Internal error in the plugin manager executing goal 'org.apache.maven.plugins:maven-surefire-plugin:2.4-SNAPSHOT:test': Unable to find the mojo 'org.apache.maven.plugins:maven-surefire-plugin:2.4-SNAPSHOT:test' in the plugin 'org.apache.maven.plugins:maven-surefire-plugin'
	at org.apache.maven.lifecycle.DefaultLifecycleExecutor.executeGoalAndHandleFailures(DefaultLifecycleExecutor.java:358)
	at org.apache.maven.lifecycle.DefaultLifecycleExecutor.executeTaskSegments(DefaultLifecycleExecutor.java:255)
	at org.apache.maven.lifecycle.DefaultLifecycleExecutor.execute(DefaultLifecycleExecutor.java:141)
	at org.apache.maven.DefaultMaven.doExecute(DefaultMaven.java:305)
	... 29 more
Caused by: org.apache.maven.plugin.PluginManagerException: Unable to find the mojo 'org.apache.maven.plugins:maven-surefire-plugin:2.4-SNAPSHOT:test' in the plugin 'org.apache.maven.plugins:maven-surefire-plugin'
	at org.apache.maven.plugin.DefaultPluginManager.getConfiguredMojo(DefaultPluginManager.java:803)
	at org.apache.maven.plugin.DefaultPluginManager.executeMojo(DefaultPluginManager.java:619)
	at org.apache.maven.lifecycle.DefaultLifecycleExecutor.executeGoalAndHandleFailures(DefaultLifecycleExecutor.java:354)
	... 32 more
Caused by: org.codehaus.plexus.component.repository.exception.ComponentLookupException: Unable to lookup component 'org.apache.maven.plugin.Mojo', it could not be created
	at org.codehaus.plexus.DefaultComponentLookupManager.lookup(DefaultComponentLookupManager.java:151)
	at org.codehaus.plexus.DefaultPlexusContainer.lookup(DefaultPlexusContainer.java:283)
	at org.apache.maven.plugin.DefaultPluginManager.getConfiguredMojo(DefaultPluginManager.java:763)
	... 34 more
Caused by: org.codehaus.plexus.component.factory.ComponentInstantiationException: Could not instantiate component: role: 'null', implementation: 'org.apache.maven.plugin.surefire.SurefirePlugin', role hint: 'default' realm: org.apache.maven.plugins:maven-surefire-plugin
	at org.codehaus.plexus.component.factory.java.JavaComponentFactory.makeException(JavaComponentFactory.java:113)
	at org.codehaus.plexus.component.factory.java.JavaComponentFactory.newInstance(JavaComponentFactory.java:87)
	at org.codehaus.plexus.component.manager.AbstractComponentManager.createComponentInstance(AbstractComponentManager.java:239)
	at org.codehaus.plexus.component.manager.AbstractComponentManager.createComponentInstance(AbstractComponentManager.java:128)
	at org.codehaus.plexus.component.manager.PerLookupComponentManager.getComponent(PerLookupComponentManager.java:40)
	at org.codehaus.plexus.DefaultComponentLookupManager.lookup(DefaultComponentLookupManager.java:147)
	... 36 more
Caused by: java.lang.NoClassDefFoundError: org/apache/maven/surefire/util/NestedCheckedException
	at java.lang.ClassLoader.defineClass1(Native Method)
	at java.lang.ClassLoader.defineClass(ClassLoader.java:620)
	at java.security.SecureClassLoader.defineClass(SecureClassLoader.java:124)
	at java.net.URLClassLoader.defineClass(URLClassLoader.java:260)
	at java.net.URLClassLoader.access$100(URLClassLoader.java:56)
	at java.net.URLClassLoader$1.run(URLClassLoader.java:195)
	at java.security.AccessController.doPrivileged(Native Method)
	at java.net.URLClassLoader.findClass(URLClassLoader.java:188)
	at java.lang.ClassLoader.loadClass(ClassLoader.java:306)
	at java.lang.ClassLoader.loadClass(ClassLoader.java:251)
	at org.codehaus.plexus.classworlds.realm.ClassRealm.loadRealmClass(ClassRealm.java:170)
	at org.codehaus.plexus.classworlds.strategy.DefaultStrategy.loadClass(DefaultStrategy.java:67)
	at org.codehaus.plexus.classworlds.realm.ClassRealm.loadClass(ClassRealm.java:197)
	at java.lang.ClassLoader.loadClassInternal(ClassLoader.java:319)
	at java.lang.Class.getDeclaredConstructors0(Native Method)
	at java.lang.Class.privateGetDeclaredConstructors(Class.java:2357)
	at java.lang.Class.getConstructor0(Class.java:2671)
	at java.lang.Class.newInstance0(Class.java:321)
	at java.lang.Class.newInstance(Class.java:303)
	at org.codehaus.plexus.component.factory.java.JavaComponentFactory.newInstance(JavaComponentFactory.java:66)
	... 40 more
[ maven embedder INFO] ------------------------------------------------------------------------
[ maven embedder INFO] Total time: 1 second
[ maven embedder INFO] Finished at: Wed Aug 29 14:18:24 GMT+00:00 2007
[ maven embedder INFO] Final Memory: 11M/321M
[ maven embedder INFO] ------------------------------------------------------------------------
[ maven embedder INFO] Error for project: Maven Quick Start Archetype (during org.apache.maven.plugins:maven-surefire-plugin:2.4-SNAPSHOT:test)
[ maven embedder INFO] ------------------------------------------------------------------------
[ maven embedder INFO] Internal error in the plugin manager executing goal 'org.apache.maven.plugins:maven-surefire-plugin:2.4-SNAPSHOT:test': Unable to find the mojo 'org.apache.maven.plugins:maven-surefire-plugin:2.4-SNAPSHOT:test' in the plugin 'org.apache.maven.plugins:maven-surefire-plugin'
org/apache/maven/surefire/util/NestedCheckedException
[ maven embedder INFO] ------------------------------------------------------------------------
[ maven embedder INFO] Trace
org.apache.maven.lifecycle.LifecycleExecutionException: Internal error in the plugin manager executing goal 'org.apache.maven.plugins:maven-surefire-plugin:2.4-SNAPSHOT:test': Unable to find the mojo 'org.apache.maven.plugins:maven-surefire-plugin:2.4-SNAPSHOT:test' in the plugin 'org.apache.maven.plugins:maven-surefire-plugin'
	at org.apache.maven.lifecycle.DefaultLifecycleExecutor.executeGoalAndHandleFailures(DefaultLifecycleExecutor.java:358)
	at org.apache.maven.lifecycle.DefaultLifecycleExecutor.executeTaskSegments(DefaultLifecycleExecutor.java:255)
	at org.apache.maven.lifecycle.DefaultLifecycleExecutor.execute(DefaultLifecycleExecutor.java:141)
	at org.apache.maven.DefaultMaven.doExecute(DefaultMaven.java:305)
	at org.apache.maven.DefaultMaven.execute(DefaultMaven.java:126)
	at org.apache.maven.embedder.MavenEmbedder.execute(MavenEmbedder.java:924)
	at org.apache.maven.embedder.MavenEmbedderTest.testExecutionUsingAPomFile(MavenEmbedderTest.java:152)
	at sun.reflect.NativeMethodAccessorImpl.invoke0(Native Method)
	at sun.reflect.NativeMethodAccessorImpl.invoke(NativeMethodAccessorImpl.java:39)
	at sun.reflect.DelegatingMethodAccessorImpl.invoke(DelegatingMethodAccessorImpl.java:25)
	at java.lang.reflect.Method.invoke(Method.java:585)
	at junit.framework.TestCase.runTest(TestCase.java:154)
	at junit.framework.TestCase.runBare(TestCase.java:127)
	at junit.framework.TestResult$1.protect(TestResult.java:106)
	at junit.framework.TestResult.runProtected(TestResult.java:124)
	at junit.framework.TestResult.run(TestResult.java:109)
	at junit.framework.TestCase.run(TestCase.java:118)
	at junit.framework.TestSuite.runTest(TestSuite.java:208)
	at junit.framework.TestSuite.run(TestSuite.java:203)
	at sun.reflect.NativeMethodAccessorImpl.invoke0(Native Method)
	at sun.reflect.NativeMethodAccessorImpl.invoke(NativeMethodAccessorImpl.java:39)
	at sun.reflect.DelegatingMethodAccessorImpl.invoke(DelegatingMethodAccessorImpl.java:25)
	at java.lang.reflect.Method.invoke(Method.java:585)
	at org.apache.maven.surefire.junit.JUnitTestSet.execute(JUnitTestSet.java:213)
	at org.apache.maven.surefire.suite.AbstractDirectoryTestSuite.executeTestSet(AbstractDirectoryTestSuite.java:138)
	at org.apache.maven.surefire.suite.AbstractDirectoryTestSuite.execute(AbstractDirectoryTestSuite.java:125)
	at org.apache.maven.surefire.Surefire.run(Surefire.java:132)
	at sun.reflect.NativeMethodAccessorImpl.invoke0(Native Method)
	at sun.reflect.NativeMethodAccessorImpl.invoke(NativeMethodAccessorImpl.java:39)
	at sun.reflect.DelegatingMethodAccessorImpl.invoke(DelegatingMethodAccessorImpl.java:25)
	at java.lang.reflect.Method.invoke(Method.java:585)
	at org.apache.maven.surefire.booter.SurefireBooter.runSuitesInProcess(SurefireBooter.java:290)
	at org.apache.maven.surefire.booter.SurefireBooter.main(SurefireBooter.java:818)
Caused by: org.apache.maven.plugin.PluginManagerException: Unable to find the mojo 'org.apache.maven.plugins:maven-surefire-plugin:2.4-SNAPSHOT:test' in the plugin 'org.apache.maven.plugins:maven-surefire-plugin'
	at org.apache.maven.plugin.DefaultPluginManager.getConfiguredMojo(DefaultPluginManager.java:803)
	at org.apache.maven.plugin.DefaultPluginManager.executeMojo(DefaultPluginManager.java:619)
	at org.apache.maven.lifecycle.DefaultLifecycleExecutor.executeGoalAndHandleFailures(DefaultLifecycleExecutor.java:354)
	... 32 more
Caused by: org.codehaus.plexus.component.repository.exception.ComponentLookupException: Unable to lookup component 'org.apache.maven.plugin.Mojo', it could not be created
	at org.codehaus.plexus.DefaultComponentLookupManager.lookup(DefaultComponentLookupManager.java:151)
	at org.codehaus.plexus.DefaultPlexusContainer.lookup(DefaultPlexusContainer.java:283)
	at org.apache.maven.plugin.DefaultPluginManager.getConfiguredMojo(DefaultPluginManager.java:763)
	... 34 more
Caused by: org.codehaus.plexus.component.factory.ComponentInstantiationException: Could not instantiate component: role: 'null', implementation: 'org.apache.maven.plugin.surefire.SurefirePlugin', role hint: 'default' realm: org.apache.maven.plugins:maven-surefire-plugin
	at org.codehaus.plexus.component.factory.java.JavaComponentFactory.makeException(JavaComponentFactory.java:113)
	at org.codehaus.plexus.component.factory.java.JavaComponentFactory.newInstance(JavaComponentFactory.java:87)
	at org.codehaus.plexus.component.manager.AbstractComponentManager.createComponentInstance(AbstractComponentManager.java:239)
	at org.codehaus.plexus.component.manager.AbstractComponentManager.createComponentInstance(AbstractComponentManager.java:128)
	at org.codehaus.plexus.component.manager.PerLookupComponentManager.getComponent(PerLookupComponentManager.java:40)
	at org.codehaus.plexus.DefaultComponentLookupManager.lookup(DefaultComponentLookupManager.java:147)
	... 36 more
Caused by: java.lang.NoClassDefFoundError: org/apache/maven/surefire/util/NestedCheckedException
	at java.lang.ClassLoader.defineClass1(Native Method)
	at java.lang.ClassLoader.defineClass(ClassLoader.java:620)
	at java.security.SecureClassLoader.defineClass(SecureClassLoader.java:124)
	at java.net.URLClassLoader.defineClass(URLClassLoader.java:260)
	at java.net.URLClassLoader.access$100(URLClassLoader.java:56)
	at java.net.URLClassLoader$1.run(URLClassLoader.java:195)
	at java.security.AccessController.doPrivileged(Native Method)
	at java.net.URLClassLoader.findClass(URLClassLoader.java:188)
	at java.lang.ClassLoader.loadClass(ClassLoader.java:306)
	at java.lang.ClassLoader.loadClass(ClassLoader.java:251)
	at org.codehaus.plexus.classworlds.realm.ClassRealm.loadRealmClass(ClassRealm.java:170)
	at org.codehaus.plexus.classworlds.strategy.DefaultStrategy.loadClass(DefaultStrategy.java:67)
	at org.codehaus.plexus.classworlds.realm.ClassRealm.loadClass(ClassRealm.java:197)
	at java.lang.ClassLoader.loadClassInternal(ClassLoader.java:319)
	at java.lang.Class.getDeclaredConstructors0(Native Method)
	at java.lang.Class.privateGetDeclaredConstructors(Class.java:2357)
	at java.lang.Class.getConstructor0(Class.java:2671)
	at java.lang.Class.newInstance0(Class.java:321)
	at java.lang.Class.newInstance(Class.java:303)
	at org.codehaus.plexus.component.factory.java.JavaComponentFactory.newInstance(JavaComponentFactory.java:66)
	... 40 more
[ maven embedder INFO] ------------------------------------------------------------------------
[ maven embedder INFO] BUILD ERRORS
[ maven embedder INFO] ------------------------------------------------------------------------
[ maven embedder INFO] Total time: 1 second
[ maven embedder INFO] Finished at: Wed Aug 29 14:18:25 GMT+00:00 2007
[ maven embedder INFO] Final Memory: 12M/321M
[ maven embedder INFO] ------------------------------------------------------------------------
Encountered 1 exception(s).
org.apache.maven.reactor.MavenExecutionException: Some builds failed
	at org.apache.maven.DefaultMaven.execute(DefaultMaven.java:167)
	at org.apache.maven.embedder.MavenEmbedder.execute(MavenEmbedder.java:924)
	at org.apache.maven.embedder.MavenEmbedderTest.testExecutionUsingAPomFile(MavenEmbedderTest.java:152)
	at sun.reflect.NativeMethodAccessorImpl.invoke0(Native Method)
	at sun.reflect.NativeMethodAccessorImpl.invoke(NativeMethodAccessorImpl.java:39)
	at sun.reflect.DelegatingMethodAccessorImpl.invoke(DelegatingMethodAccessorImpl.java:25)
	at java.lang.reflect.Method.invoke(Method.java:585)
	at junit.framework.TestCase.runTest(TestCase.java:154)
	at junit.framework.TestCase.runBare(TestCase.java:127)
	at junit.framework.TestResult$1.protect(TestResult.java:106)
	at junit.framework.TestResult.runProtected(TestResult.java:124)
	at junit.framework.TestResult.run(TestResult.java:109)
	at junit.framework.TestCase.run(TestCase.java:118)
	at junit.framework.TestSuite.runTest(TestSuite.java:208)
	at junit.framework.TestSuite.run(TestSuite.java:203)
	at sun.reflect.NativeMethodAccessorImpl.invoke0(Native Method)
	at sun.reflect.NativeMethodAccessorImpl.invoke(NativeMethodAccessorImpl.java:39)
	at sun.reflect.DelegatingMethodAccessorImpl.invoke(DelegatingMethodAccessorImpl.java:25)
	at java.lang.reflect.Method.invoke(Method.java:585)
	at org.apache.maven.surefire.junit.JUnitTestSet.execute(JUnitTestSet.java:213)
	at org.apache.maven.surefire.suite.AbstractDirectoryTestSuite.executeTestSet(AbstractDirectoryTestSuite.java:138)
	at org.apache.maven.surefire.suite.AbstractDirectoryTestSuite.execute(AbstractDirectoryTestSuite.java:125)
	at org.apache.maven.surefire.Surefire.run(Surefire.java:132)
	at sun.reflect.NativeMethodAccessorImpl.invoke0(Native Method)
	at sun.reflect.NativeMethodAccessorImpl.invoke(NativeMethodAccessorImpl.java:39)
	at sun.reflect.DelegatingMethodAccessorImpl.invoke(DelegatingMethodAccessorImpl.java:25)
	at java.lang.reflect.Method.invoke(Method.java:585)
	at org.apache.maven.surefire.booter.SurefireBooter.runSuitesInProcess(SurefireBooter.java:290)
	at org.apache.maven.surefire.booter.SurefireBooter.main(SurefireBooter.java:818)
[ maven embedder INFO] Scanning for projects...
[ maven embedder INFO] ----------------------------------------------------------------------------
[ maven embedder INFO] Building Maven Quick Start Archetype
[ maven embedder INFO]    task-segment: [validate]
[ maven embedder INFO] ----------------------------------------------------------------------------
[ maven embedder INFO] ------------------------------------------------------------------------
[ maven embedder INFO] BUILD SUCCESSFUL
[ maven embedder INFO] ------------------------------------------------------------------------
[ maven embedder INFO] Total time: < 1 second
[ maven embedder INFO] Finished at: Wed Aug 29 14:18:25 GMT+00:00 2007
[ maven embedder INFO] Final Memory: 13M/321M
[ maven embedder INFO] ------------------------------------------------------------------------
[ maven embedder INFO] Scanning for projects...
[ maven embedder INFO] ----------------------------------------------------------------------------
[ maven embedder INFO] Building Maven Quick Start Archetype
[ maven embedder INFO]    task-segment: [validate]
[ maven embedder INFO] ----------------------------------------------------------------------------
[ maven embedder INFO] ------------------------------------------------------------------------
[ maven embedder INFO] BUILD SUCCESSFUL
[ maven embedder INFO] ------------------------------------------------------------------------
[ maven embedder INFO] Total time: < 1 second
[ maven embedder INFO] Finished at: Wed Aug 29 14:18:25 GMT+00:00 2007
[ maven embedder INFO] Final Memory: 10M/321M
[ maven embedder INFO] ------------------------------------------------------------------------
[ maven embedder INFO] Scanning for projects...
[ maven embedder INFO] ----------------------------------------------------------------------------
[ maven embedder INFO] Building Maven Quick Start Archetype
[ maven embedder INFO]    task-segment: [package]
[ maven embedder INFO] ----------------------------------------------------------------------------
[ maven embedder INFO] [resources:resources]
[ maven embedder INFO] Using default encoding to copy filtered resources.
[ maven embedder INFO] Resource directory does not exist: /export/home/build/data/continuum/checkouts/353/target/embedder-test-project-caching/src/main/resources
[ maven embedder INFO] [compiler:compile]
[ maven embedder INFO] Compiling 1 source file to /export/home/build/data/continuum/checkouts/353/target/embedder-test-project-caching/target/classes
[ maven embedder INFO] [resources:testResources]
[ maven embedder INFO] Using default encoding to copy filtered resources.
[ maven embedder INFO] Resource directory does not exist: /export/home/build/data/continuum/checkouts/353/target/embedder-test-project-caching/src/test/resources
[ maven embedder INFO] [compiler:testCompile]
[ maven embedder INFO] Compiling 1 source file to /export/home/build/data/continuum/checkouts/353/target/embedder-test-project-caching/target/test-classes
[ maven embedder INFO] [surefire:test]
[ maven embedder INFO] Surefire report directory: /export/home/build/data/continuum/checkouts/353/target/embedder-test-project-caching/target/surefire-reports

-------------------------------------------------------
 T E S T S
-------------------------------------------------------
Running org.apache.maven.AppTest
Tests run: 1, Failures: 0, Errors: 0, Skipped: 0, Time elapsed: 0.039 sec

Results :
Tests run: 1, Failures: 0, Errors: 0, Skipped: 0

[ maven embedder INFO] [jar:jar]
[ maven embedder INFO] Building jar: /export/home/build/data/continuum/checkouts/353/target/embedder-test-project-caching/target/embedder-test-project-1.0-SNAPSHOT.jar
[ maven embedder INFO] ------------------------------------------------------------------------
[ maven embedder INFO] BUILD SUCCESSFUL
[ maven embedder INFO] ------------------------------------------------------------------------
[ maven embedder INFO] Total time: 1 second
[ maven embedder INFO] Finished at: Wed Aug 29 14:18:27 GMT+00:00 2007
[ maven embedder INFO] Final Memory: 14M/321M
[ maven embedder INFO] ------------------------------------------------------------------------
[ maven embedder INFO] Scanning for projects...
[ maven embedder INFO] ----------------------------------------------------------------------------
[ maven embedder INFO] Building Maven Quick Start Archetype
[ maven embedder INFO]    task-segment: [package]
[ maven embedder INFO] ----------------------------------------------------------------------------
[ maven embedder INFO] [resources:resources]
[ maven embedder INFO] Using default encoding to copy filtered resources.
[ maven embedder INFO] Resource directory does not exist: /export/home/build/data/continuum/checkouts/353/target/embedder-test-project-caching/src/main/resources
[ maven embedder INFO] [compiler:compile]
[ maven embedder INFO] Nothing to compile - all classes are up to date
[ maven embedder INFO] [resources:testResources]
[ maven embedder INFO] Using default encoding to copy filtered resources.
[ maven embedder INFO] Resource directory does not exist: /export/home/build/data/continuum/checkouts/353/target/embedder-test-project-caching/src/test/resources
[ maven embedder INFO] [compiler:testCompile]
[ maven embedder INFO] Nothing to compile - all classes are up to date
[ maven embedder INFO] [surefire:test]
[ maven embedder INFO] Surefire report directory: /export/home/build/data/continuum/checkouts/353/target/embedder-test-project-caching/target/surefire-reports

-------------------------------------------------------
 T E S T S
-------------------------------------------------------
Running org.apache.maven.AppTest
Tests run: 1, Failures: 0, Errors: 0, Skipped: 0, Time elapsed: 0.039 sec

Results :
Tests run: 1, Failures: 0, Errors: 0, Skipped: 0

[ maven embedder INFO] [jar:jar]
[ maven embedder INFO] Building jar: /export/home/build/data/continuum/checkouts/353/target/embedder-test-project-caching/target/embedder-test-project-1.0-SNAPSHOT.jar
[ maven embedder INFO] ------------------------------------------------------------------------
[ maven embedder INFO] BUILD SUCCESSFUL
[ maven embedder INFO] ------------------------------------------------------------------------
[ maven embedder INFO] Total time: < 1 second
[ maven embedder INFO] Finished at: Wed Aug 29 14:18:28 GMT+00:00 2007
[ maven embedder INFO] Final Memory: 15M/321M
[ maven embedder INFO] ------------------------------------------------------------------------
Tests run: 15, Failures: 2, Errors: 0, Skipped: 0, Time elapsed: 11.174 sec <<< FAILURE!
Running org.apache.maven.cli.ConsoleDownloadMonitorTest
Downloading: null://nullnull/null
0/97K
97K downloaded
Tests run: 6, Failures: 0, Errors: 0, Skipped: 0, Time elapsed: 0.007 sec
Running org.apache.maven.embedder.MavenEmbedderCrappySettingsConfigurationTest
java.lang.RuntimeException
	at org.apache.maven.cli.AbstractConsoleDownloadMonitorTest.testTransferError(AbstractConsoleDownloadMonitorTest.java:86)
	at sun.reflect.NativeMethodAccessorImpl.invoke0(Native Method)
	at sun.reflect.NativeMethodAccessorImpl.invoke(NativeMethodAccessorImpl.java:39)
	at sun.reflect.DelegatingMethodAccessorImpl.invoke(DelegatingMethodAccessorImpl.java:25)
	at java.lang.reflect.Method.invoke(Method.java:585)
	at junit.framework.TestCase.runTest(TestCase.java:154)
	at junit.framework.TestCase.runBare(TestCase.java:127)
	at junit.framework.TestResult$1.protect(TestResult.java:106)
	at junit.framework.TestResult.runProtected(TestResult.java:124)
	at junit.framework.TestResult.run(TestResult.java:109)
	at junit.framework.TestCase.run(TestCase.java:118)
	at junit.framework.TestSuite.runTest(TestSuite.java:208)
	at junit.framework.TestSuite.run(TestSuite.java:203)
	at sun.reflect.NativeMethodAccessorImpl.invoke0(Native Method)
	at sun.reflect.NativeMethodAccessorImpl.invoke(NativeMethodAccessorImpl.java:39)
	at sun.reflect.DelegatingMethodAccessorImpl.invoke(DelegatingMethodAccessorImpl.java:25)
	at java.lang.reflect.Method.invoke(Method.java:585)
	at org.apache.maven.surefire.junit.JUnitTestSet.execute(JUnitTestSet.java:213)
	at org.apache.maven.surefire.suite.AbstractDirectoryTestSuite.executeTestSet(AbstractDirectoryTestSuite.java:138)
	at org.apache.maven.surefire.suite.AbstractDirectoryTestSuite.execute(AbstractDirectoryTestSuite.java:125)
	at org.apache.maven.surefire.Surefire.run(Surefire.java:132)
	at sun.reflect.NativeMethodAccessorImpl.invoke0(Native Method)
	at sun.reflect.NativeMethodAccessorImpl.invoke(NativeMethodAccessorImpl.java:39)
	at sun.reflect.DelegatingMethodAccessorImpl.invoke(DelegatingMethodAccessorImpl.java:25)
	at java.lang.reflect.Method.invoke(Method.java:585)
	at org.apache.maven.surefire.booter.SurefireBooter.runSuitesInProcess(SurefireBooter.java:290)
	at org.apache.maven.surefire.booter.SurefireBooter.main(SurefireBooter.java:818)
Tests run: 1, Failures: 0, Errors: 1, Skipped: 0, Time elapsed: 0.043 sec <<< FAILURE!
Running org.apache.maven.embedder.ValidateConfigurationTest
Tests run: 4, Failures: 4, Errors: 0, Skipped: 0, Time elapsed: 0.191 sec <<< FAILURE!
Running org.apache.maven.cli.MavenCliTest
Tests run: 1, Failures: 0, Errors: 0, Skipped: 0, Time elapsed: 0.027 sec
Running org.apache.maven.embedder.MavenEmbedderExampleTest
The specific user settings file '/export/home/build/data/continuum/checkouts/353/src/examples/simple-project/settings.xml' is not present.
Tests run: 3, Failures: 0, Errors: 2, Skipped: 0, Time elapsed: 0.337 sec <<< FAILURE!
Running org.apache.maven.embedder.MavenEmbedderBehaviorTest
>>> /export/home/build/data/continuum/checkouts/353
Tests run: 1, Failures: 1, Errors: 0, Skipped: 0, Time elapsed: 0.112 sec <<< FAILURE!

Results :

Failed tests: 
  testExecutionUsingABaseDirectory(org.apache.maven.embedder.MavenEmbedderTest)
  testExecutionUsingAPomFile(org.apache.maven.embedder.MavenEmbedderTest)
  testConfigurationOnlyUserSettingsAreActiveAndItIsValid(org.apache.maven.embedder.ValidateConfigurationTest)
  testConfigurationOnlyUserSettingsAreActiveAndItIsInvalid(org.apache.maven.embedder.ValidateConfigurationTest)
  testConfigurationOnlyGlobalSettingsAreActiveAndItIsValid(org.apache.maven.embedder.ValidateConfigurationTest)
  testConfigurationOnlyGlobalSettingsAreActiveAndItIsInvalid(org.apache.maven.embedder.ValidateConfigurationTest)
  testThatTheLocalRepositoryIsTakenFromGlobalSettingsWhenUserSettingsAreNull(org.apache.maven.embedder.MavenEmbedderBehaviorTest)

Tests in error: 
  testEmbedderWillStillStartupWhenTheSettingsConfigurationIsCrap(org.apache.maven.embedder.MavenEmbedderCrappySettingsConfigurationTest)
  testEmbedderExampleThatShowsHowToMimicTheMavenCLI(org.apache.maven.embedder.MavenEmbedderExampleTest)
  testEmbedderExampleThatShowsAccessingThePlexusContainer(org.apache.maven.embedder.MavenEmbedderExampleTest)

Tests run: 40, Failures: 7, Errors: 3, Skipped: 0

[INFO] ------------------------------------------------------------------------
[ERROR] BUILD FAILURE
[INFO] ------------------------------------------------------------------------
[INFO] There are test failures.
[INFO] ------------------------------------------------------------------------
[INFO] For more information, run Maven with the -e switch
[INFO] ------------------------------------------------------------------------
[INFO] Total time: 26 seconds
[INFO] Finished at: Wed Aug 29 14:18:31 GMT+00:00 2007
[INFO] Final Memory: 11M/334M
[INFO] ------------------------------------------------------------------------

****************************************************************************



Mime
View raw message