maven-notifications mailing list archives

Site index · List index
Message view « Date » · « Thread »
Top « Date » · « Thread »
From "Continuum@maven.zones.apache.org" <contin...@maven.zones.apache.org>
Subject [continuum] BUILD FAILURE: Maven Core
Date Thu, 06 Sep 2007 17:36:37 GMT
Online report : http://maven.zones.apache.org/continuum/buildResult.action?buildId=20282&projectId=478

Build statistics:
  State: Failed
  Previous State: Ok
  Started at: Thu 6 Sep 2007 17:36:23 +0000
  Finished at: Thu 6 Sep 2007 17:36:34 +0000
  Total time: 10s
  Build Trigger: Schedule
  Build Number: 1
  Exit code: 1
  Building machine hostname: maven.zones.apache.org
  Operating system : SunOS(unknown)
  Java Home version : 
          java version "1.5.0_12"
          Java(TM) 2 Runtime Environment, Standard Edition (build 1.5.0_12-b04)
          Java HotSpot(TM) Server VM (build 1.5.0_12-b04, mixed mode)
        
  Builder version :
          Maven version: 2.0.7
          Java version: 1.5.0_12
          OS name: "sunos" version: "5.10" arch: "x86"
    
****************************************************************************
SCM Changes:
****************************************************************************
Changed: jvanzyl @ Thu 6 Sep 2007 17:09:36 +0000
Comment: o trying to get a grasp of the entire profile mechanism, especially in relation to
how they deal with repositories.
  here i am just collecting all the profile code into one place as it's scattered over several
packages and is
  hard to determine what the profile system as a whole is doing. the first task i would like
to do is decouple
  the profile system from the Settings. this can be done at the front-end i.e the profile
information from Settings
  can be fed into the profile manager up front.
Files changed:
  /maven/components/trunk/maven-core/src/main/java/org/apache/maven/DefaultMaven.java ( 573325
)
  /maven/components/trunk/maven-core/src/main/java/org/apache/maven/execution/DefaultMavenExecutionRequest.java
( 573325 )
  /maven/components/trunk/maven-core/src/main/java/org/apache/maven/execution/MavenExecutionRequest.java
( 573325 )
  /maven/components/trunk/maven-core/src/main/java/org/apache/maven/extension/BuildExtensionScanner.java
( 573325 )
  /maven/components/trunk/maven-core/src/main/java/org/apache/maven/extension/DefaultBuildExtensionScanner.java
( 573325 )
  /maven/components/trunk/maven-embedder/src/main/java/org/apache/maven/embedder/MavenEmbedder.java
( 573325 )
  /maven/components/trunk/maven-embedder/src/main/java/org/apache/maven/embedder/execution/DefaultMavenExecutionRequestPopulator.java
( 573325 )
  /maven/components/trunk/maven-embedder/src/test/projects/complex-project/maven-project/src/main/resources/META-INF/plexus/components.xml
( 573325 )
  /maven/components/trunk/maven-embedder/src/test/projects/complex-project/maven-project/src/test/resources/org/apache/maven/project/ProjectClasspathTest.xml
( 573325 )
  /maven/components/trunk/maven-embedder/src/test/projects/complex-project/maven-project/src/test/resources/org/apache/maven/project/canonical/CanonicalProjectBuilderTest.xml
( 573325 )
  /maven/components/trunk/maven-project/src/main/java/org/apache/maven/profiles/DefaultProfileManager.java
( 573325 )
  /maven/components/trunk/maven-project/src/main/java/org/apache/maven/profiles/ProfileManager.java
( 573325 )
  /maven/components/trunk/maven-project/src/main/java/org/apache/maven/profiles/build ( 573325
)
  /maven/components/trunk/maven-project/src/main/java/org/apache/maven/profiles/build/DefaultProfileAdvisor.java
(from /maven/components/trunk/maven-project/src/main/java/org/apache/maven/project/build/profile/DefaultProfileAdvisor.java:573172)
( 573325 )
  /maven/components/trunk/maven-project/src/main/java/org/apache/maven/profiles/build/ProfileAdvisor.java
(from /maven/components/trunk/maven-project/src/main/java/org/apache/maven/project/build/profile/ProfileAdvisor.java:573172)
( 573325 )
  /maven/components/trunk/maven-project/src/main/java/org/apache/maven/profiles/injection
( 573325 )
  /maven/components/trunk/maven-project/src/main/java/org/apache/maven/profiles/injection/DefaultProfileInjector.java
(from /maven/components/trunk/maven-project/src/main/java/org/apache/maven/project/injection/DefaultProfileInjector.java:573172)
( 573325 )
  /maven/components/trunk/maven-project/src/main/java/org/apache/maven/profiles/injection/ProfileInjector.java
(from /maven/components/trunk/maven-project/src/main/java/org/apache/maven/project/injection/ProfileInjector.java:573172)
( 573325 )
  /maven/components/trunk/maven-project/src/main/java/org/apache/maven/profiles/manager (
573325 )
  /maven/components/trunk/maven-project/src/main/java/org/apache/maven/profiles/manager/DefaultProfileManager.java
(from /maven/components/trunk/maven-project/src/main/java/org/apache/maven/profiles/DefaultProfileManager.java:573172)
( 573325 )
  /maven/components/trunk/maven-project/src/main/java/org/apache/maven/profiles/manager/ProfileManager.java
(from /maven/components/trunk/maven-project/src/main/java/org/apache/maven/profiles/ProfileManager.java:573172)
( 573325 )
  /maven/components/trunk/maven-project/src/main/java/org/apache/maven/project/DefaultMavenProjectBuilder.java
( 573325 )
  /maven/components/trunk/maven-project/src/main/java/org/apache/maven/project/MavenProjectBuilder.java
( 573325 )
  /maven/components/trunk/maven-project/src/main/java/org/apache/maven/project/build/model/DefaultModelLineageBuilder.java
( 573325 )
  /maven/components/trunk/maven-project/src/main/java/org/apache/maven/project/build/model/ModelLineageBuilder.java
( 573325 )
  /maven/components/trunk/maven-project/src/main/java/org/apache/maven/project/build/profile
( 573325 )
  /maven/components/trunk/maven-project/src/main/java/org/apache/maven/project/injection/DefaultProfileInjector.java
( 573325 )
  /maven/components/trunk/maven-project/src/main/java/org/apache/maven/project/injection/ProfileInjector.java
( 573325 )
  /maven/components/trunk/maven-project/src/main/java/org/apache/maven/project/profiles (
573325 )
  /maven/components/trunk/maven-project/src/main/java/org/apache/maven/project/profiles/build
( 573325 )
  /maven/components/trunk/maven-project/src/main/resources/META-INF/plexus/components.xml
( 573325 )
  /maven/components/trunk/maven-project/src/test/java/org/apache/maven/profiles/DefaultProfileManagerTest.java
( 573325 )
  /maven/components/trunk/maven-project/src/test/java/org/apache/maven/profiles/injection
( 573325 )
  /maven/components/trunk/maven-project/src/test/java/org/apache/maven/profiles/injection/DefaultProfileInjectorTest.java
(from /maven/components/trunk/maven-project/src/test/java/org/apache/maven/project/injection/DefaultProfileInjectorTest.java:573172)
( 573325 )
  /maven/components/trunk/maven-project/src/test/java/org/apache/maven/profiles/manager (
573325 )
  /maven/components/trunk/maven-project/src/test/java/org/apache/maven/profiles/manager/DefaultProfileManagerTest.java
(from /maven/components/trunk/maven-project/src/test/java/org/apache/maven/profiles/DefaultProfileManagerTest.java:573172)
( 573325 )
  /maven/components/trunk/maven-project/src/test/java/org/apache/maven/project/AbstractMavenProjectTestCase.java
( 573325 )
  /maven/components/trunk/maven-project/src/test/java/org/apache/maven/project/DefaultMavenProjectBuilderTest.java
( 573325 )
  /maven/components/trunk/maven-project/src/test/java/org/apache/maven/project/injection/DefaultProfileInjectorTest.java
( 573325 )
  /maven/components/trunk/maven-project/src/test/java/org/apache/maven/project/injection/TestProfileInjector.java
( 573325 )
  /maven/components/trunk/maven-project/src/test/resources/org/apache/maven/project/ProjectClasspathTest.xml
( 573325 )
  /maven/components/trunk/maven-project/src/test/resources/org/apache/maven/project/canonical/CanonicalProjectBuilderTest.xml
( 573325 )

****************************************************************************
Dependencies Changes:
****************************************************************************
No dependencies changed

****************************************************************************
Test Summary:
****************************************************************************
Tests: 0
Failures: 0
Total time: 0

****************************************************************************
Output:
****************************************************************************
[INFO] Scanning for projects...
[INFO] ----------------------------------------------------------------------------
[INFO] Building Maven Core
[INFO]    task-segment: [clean, install]
[INFO] ----------------------------------------------------------------------------
[INFO] [clean:clean]
[INFO] Deleting directory /export/home/build/data/continuum/checkouts/478/target
[INFO] [resources:resources]
[INFO] Using default encoding to copy filtered resources.
[INFO] Copying 14 resources
[INFO] [compiler:compile]
[INFO] Compiling 77 source files to /export/home/build/data/continuum/checkouts/478/target/classes
[INFO] ------------------------------------------------------------------------
[ERROR] BUILD FAILURE
[INFO] ------------------------------------------------------------------------
[INFO] Compilation failure

/export/home/build/data/continuum/checkouts/478/src/main/java/org/apache/maven/execution/MavenExecutionRequest.java:[25,41]
package org.apache.maven.profiles.manager does not exist

/export/home/build/data/continuum/checkouts/478/src/main/java/org/apache/maven/execution/MavenExecutionRequest.java:[187,4]
cannot find symbol
symbol  : class ProfileManager
location: interface org.apache.maven.execution.MavenExecutionRequest

/export/home/build/data/continuum/checkouts/478/src/main/java/org/apache/maven/execution/MavenExecutionRequest.java:[188,45]
cannot find symbol
symbol  : class ProfileManager
location: interface org.apache.maven.execution.MavenExecutionRequest

/export/home/build/data/continuum/checkouts/478/src/main/java/org/apache/maven/execution/DefaultMavenExecutionRequest.java:[24,41]
package org.apache.maven.profiles.manager does not exist

/export/home/build/data/continuum/checkouts/478/src/main/java/org/apache/maven/execution/DefaultMavenExecutionRequest.java:[99,12]
cannot find symbol
symbol  : class ProfileManager
location: class org.apache.maven.execution.DefaultMavenExecutionRequest

/export/home/build/data/continuum/checkouts/478/src/main/java/org/apache/maven/execution/DefaultMavenExecutionRequest.java:[511,11]
cannot find symbol
symbol  : class ProfileManager
location: class org.apache.maven.execution.DefaultMavenExecutionRequest

/export/home/build/data/continuum/checkouts/478/src/main/java/org/apache/maven/execution/DefaultMavenExecutionRequest.java:[516,52]
cannot find symbol
symbol  : class ProfileManager
location: class org.apache.maven.execution.DefaultMavenExecutionRequest

/export/home/build/data/continuum/checkouts/478/src/main/java/org/apache/maven/extension/DefaultBuildExtensionScanner.java:[31,41]
package org.apache.maven.profiles.manager does not exist

/export/home/build/data/continuum/checkouts/478/src/main/java/org/apache/maven/extension/BuildExtensionScanner.java:[23,41]
package org.apache.maven.profiles.manager does not exist

/export/home/build/data/continuum/checkouts/478/src/main/java/org/apache/maven/extension/DefaultBuildExtensionScanner.java:[73,40]
cannot find symbol
symbol  : class ProfileManager
location: class org.apache.maven.extension.DefaultBuildExtensionScanner

/export/home/build/data/continuum/checkouts/478/src/main/java/org/apache/maven/extension/DefaultBuildExtensionScanner.java:[87,40]
cannot find symbol
symbol  : class ProfileManager
location: class org.apache.maven.extension.DefaultBuildExtensionScanner

/export/home/build/data/continuum/checkouts/478/src/main/java/org/apache/maven/extension/DefaultBuildExtensionScanner.java:[95,77]
cannot find symbol
symbol  : class ProfileManager
location: class org.apache.maven.extension.DefaultBuildExtensionScanner

/export/home/build/data/continuum/checkouts/478/src/main/java/org/apache/maven/extension/DefaultBuildExtensionScanner.java:[206,77]
cannot find symbol
symbol  : class ProfileManager
location: class org.apache.maven.extension.DefaultBuildExtensionScanner

/export/home/build/data/continuum/checkouts/478/src/main/java/org/apache/maven/extension/DefaultBuildExtensionScanner.java:[325,77]
cannot find symbol
symbol  : class ProfileManager
location: class org.apache.maven.extension.DefaultBuildExtensionScanner

/export/home/build/data/continuum/checkouts/478/src/main/java/org/apache/maven/extension/BuildExtensionScanner.java:[33,81]
cannot find symbol
symbol  : class ProfileManager
location: interface org.apache.maven.extension.BuildExtensionScanner

/export/home/build/data/continuum/checkouts/478/src/main/java/org/apache/maven/extension/BuildExtensionScanner.java:[36,79]
cannot find symbol
symbol  : class ProfileManager
location: interface org.apache.maven.extension.BuildExtensionScanner

/export/home/build/data/continuum/checkouts/478/src/main/java/org/apache/maven/DefaultMaven.java:[43,41]
package org.apache.maven.profiles.manager does not exist

/export/home/build/data/continuum/checkouts/478/src/main/java/org/apache/maven/DefaultMaven.java:[327,34]
cannot find symbol
symbol  : class ProfileManager
location: class org.apache.maven.DefaultMaven


[INFO] ------------------------------------------------------------------------
[INFO] For more information, run Maven with the -e switch
[INFO] ------------------------------------------------------------------------
[INFO] Total time: 8 seconds
[INFO] Finished at: Thu Sep 06 17:36:34 GMT+00:00 2007
[INFO] Final Memory: 10M/322M
[INFO] ------------------------------------------------------------------------

****************************************************************************



Mime
View raw message