maven-notifications mailing list archives

Site index · List index
Message view « Date » · « Thread »
Top « Date » · « Thread »
From "Continuum@maven.zones.apache.org" <contin...@maven.zones.apache.org>
Subject [continuum] BUILD FAILURE: Maven Core
Date Wed, 05 Sep 2007 04:25:32 GMT
Online report : http://maven.zones.apache.org/continuum/buildResult.action?buildId=19985&projectId=337

Build statistics:
  State: Failed
  Previous State: Ok
  Started at: Wed 5 Sep 2007 04:25:16 +0000
  Finished at: Wed 5 Sep 2007 04:25:27 +0000
  Total time: 10s
  Build Trigger: Schedule
  Build Number: 107
  Exit code: 1
  Building machine hostname: maven.zones.apache.org
  Operating system : SunOS(unknown)
  Java Home version : 
          java version "1.5.0_12"
          Java(TM) 2 Runtime Environment, Standard Edition (build 1.5.0_12-b04)
          Java HotSpot(TM) Server VM (build 1.5.0_12-b04, mixed mode)
        
  Builder version :
          Maven version: 2.0.7
          Java version: 1.5.0_12
          OS name: "sunos" version: "5.10" arch: "x86"
    
****************************************************************************
SCM Changes:
****************************************************************************
Changed: jvanzyl @ Wed 5 Sep 2007 03:44:55 +0000
Comment: o Why would a plugin be executing in its own POM. I think this is a far out case
and you shouldn't be testing your plugin with its own POM. The comment is "I guess...". I
don't think this is right.
Files changed:
  /maven/components/trunk/maven-core/src/main/java/org/apache/maven/plugin/version/DefaultPluginVersionManager.java
( 572868 )

****************************************************************************
Dependencies Changes:
****************************************************************************
org.apache.maven:maven-lifecycle:2.1-SNAPSHOT

org.apache.maven:maven-build-context:2.1-SNAPSHOT

org.apache.maven:maven-settings:2.1-SNAPSHOT

org.apache.maven.reporting:maven-reporting-api:2.1-SNAPSHOT

org.apache.maven:maven-profile:2.1-SNAPSHOT

org.apache.maven:maven-model:2.1-SNAPSHOT

org.apache.maven:maven-project:2.1-SNAPSHOT

org.apache.maven:maven-plugin-api:2.1-SNAPSHOT

org.apache.maven:maven-plugin-descriptor:2.1-SNAPSHOT

org.apache.maven:maven:2.1-SNAPSHOT

****************************************************************************
Test Summary:
****************************************************************************
Tests: 0
Failures: 0
Total time: 0

****************************************************************************
Output:
****************************************************************************
[INFO] Scanning for projects...
[INFO] ----------------------------------------------------------------------------
[INFO] Building Maven Core
[INFO]    task-segment: [clean, install]
[INFO] ----------------------------------------------------------------------------
[INFO] [clean:clean]
[INFO] Deleting directory /export/home/build/data/continuum/checkouts/337/target
[INFO] [resources:resources]
[INFO] Using default encoding to copy filtered resources.
[INFO] Copying 14 resources
[INFO] snapshot org.apache.maven:maven-lifecycle:2.1-SNAPSHOT: checking for updates from apache.snapshots
[INFO] snapshot org.apache.maven.reporting:maven-reporting-api:2.1-SNAPSHOT: checking for
updates from apache.snapshots
[INFO] snapshot org.apache.maven.reporting:maven-reporting:2.1-SNAPSHOT: checking for updates
from apache.snapshots
[INFO] snapshot org.apache.maven:maven-monitor:2.1-SNAPSHOT: checking for updates from apache.snapshots
[INFO] [compiler:compile]
[INFO] Compiling 78 source files to /export/home/build/data/continuum/checkouts/337/target/classes
[INFO] ------------------------------------------------------------------------
[ERROR] BUILD FAILURE
[INFO] ------------------------------------------------------------------------
[INFO] Compilation failure
/export/home/build/data/continuum/checkouts/337/src/main/java/org/apache/maven/plugin/version/DefaultPluginVersionManager.java:[49,7]
org.apache.maven.plugin.version.DefaultPluginVersionManager is not abstract and does not override
abstract method resolvePluginVersion(java.lang.String,java.lang.String,org.apache.maven.project.MavenProject,org.apache.maven.artifact.repository.ArtifactRepository)
in org.apache.maven.plugin.version.PluginVersionManager



/export/home/build/data/continuum/checkouts/337/src/main/java/org/apache/maven/plugin/version/DefaultPluginVersionManager.java:[49,7]
org.apache.maven.plugin.version.DefaultPluginVersionManager is not abstract and does not override
abstract method resolvePluginVersion(java.lang.String,java.lang.String,org.apache.maven.project.MavenProject,org.apache.maven.artifact.repository.ArtifactRepository)
in org.apache.maven.plugin.version.PluginVersionManager


[INFO] ------------------------------------------------------------------------
[INFO] For more information, run Maven with the -e switch
[INFO] ------------------------------------------------------------------------
[INFO] Total time: 8 seconds
[INFO] Finished at: Wed Sep 05 04:25:26 GMT+00:00 2007
[INFO] Final Memory: 8M/322M
[INFO] ------------------------------------------------------------------------

****************************************************************************



Mime
View raw message