maven-notifications mailing list archives

Site index · List index
Message view « Date » · « Thread »
Top « Date » · « Thread »
From "Continuum@maven.zones.apache.org" <contin...@maven.zones.apache.org>
Subject [continuum] BUILD FAILURE: Maven Core
Date Thu, 06 Sep 2007 18:50:21 GMT
Online report : http://maven.zones.apache.org/continuum/buildResult.action?buildId=20292&projectId=478

Build statistics:
  State: Failed
  Previous State: Failed
  Started at: Thu 6 Sep 2007 18:49:39 +0000
  Finished at: Thu 6 Sep 2007 18:50:12 +0000
  Total time: 33s
  Build Trigger: Schedule
  Build Number: 1
  Exit code: 1
  Building machine hostname: maven.zones.apache.org
  Operating system : SunOS(unknown)
  Java Home version : 
          java version "1.5.0_12"
          Java(TM) 2 Runtime Environment, Standard Edition (build 1.5.0_12-b04)
          Java HotSpot(TM) Server VM (build 1.5.0_12-b04, mixed mode)
        
  Builder version :
          Maven version: 2.0.7
          Java version: 1.5.0_12
          OS name: "sunos" version: "5.10" arch: "x86"
    
****************************************************************************
SCM Changes:
****************************************************************************
No files changed

****************************************************************************
Dependencies Changes:
****************************************************************************
org.apache.maven:maven-lifecycle:2.1-SNAPSHOT

org.apache.maven:maven-build-context:2.1-SNAPSHOT

org.apache.maven:maven-settings:2.1-SNAPSHOT

org.apache.maven:maven-profile:2.1-SNAPSHOT

org.apache.maven:maven-model:2.1-SNAPSHOT

org.apache.maven:maven-plugin-api:2.1-SNAPSHOT

org.apache.maven:maven:2.1-SNAPSHOT

****************************************************************************
Test Summary:
****************************************************************************
Tests: 0
Failures: 0
Total time: 0

****************************************************************************
Output:
****************************************************************************
[INFO] Scanning for projects...
[INFO] ----------------------------------------------------------------------------
[INFO] Building Maven Core
[INFO]    task-segment: [clean, install]
[INFO] ----------------------------------------------------------------------------
[INFO] [clean:clean]
[INFO] Deleting directory /export/home/build/data/continuum/checkouts/478/target
[INFO] [resources:resources]
[INFO] Using default encoding to copy filtered resources.
[INFO] Copying 14 resources
[INFO] [compiler:compile]
[INFO] Compiling 77 source files to /export/home/build/data/continuum/checkouts/478/target/classes
[INFO] ------------------------------------------------------------------------
[ERROR] BUILD FAILURE
[INFO] ------------------------------------------------------------------------
[INFO] Compilation failure

/export/home/build/data/continuum/checkouts/478/src/main/java/org/apache/maven/execution/MavenExecutionRequest.java:[25,41]
package org.apache.maven.profiles.manager does not exist

/export/home/build/data/continuum/checkouts/478/src/main/java/org/apache/maven/execution/MavenExecutionRequest.java:[187,4]
cannot find symbol
symbol  : class ProfileManager
location: interface org.apache.maven.execution.MavenExecutionRequest

/export/home/build/data/continuum/checkouts/478/src/main/java/org/apache/maven/execution/MavenExecutionRequest.java:[188,45]
cannot find symbol
symbol  : class ProfileManager
location: interface org.apache.maven.execution.MavenExecutionRequest

/export/home/build/data/continuum/checkouts/478/src/main/java/org/apache/maven/execution/DefaultMavenExecutionRequest.java:[24,41]
package org.apache.maven.profiles.manager does not exist

/export/home/build/data/continuum/checkouts/478/src/main/java/org/apache/maven/execution/DefaultMavenExecutionRequest.java:[99,12]
cannot find symbol
symbol  : class ProfileManager
location: class org.apache.maven.execution.DefaultMavenExecutionRequest

/export/home/build/data/continuum/checkouts/478/src/main/java/org/apache/maven/execution/DefaultMavenExecutionRequest.java:[511,11]
cannot find symbol
symbol  : class ProfileManager
location: class org.apache.maven.execution.DefaultMavenExecutionRequest

/export/home/build/data/continuum/checkouts/478/src/main/java/org/apache/maven/execution/DefaultMavenExecutionRequest.java:[516,52]
cannot find symbol
symbol  : class ProfileManager
location: class org.apache.maven.execution.DefaultMavenExecutionRequest

/export/home/build/data/continuum/checkouts/478/src/main/java/org/apache/maven/extension/DefaultBuildExtensionScanner.java:[31,41]
package org.apache.maven.profiles.manager does not exist

/export/home/build/data/continuum/checkouts/478/src/main/java/org/apache/maven/extension/BuildExtensionScanner.java:[23,41]
package org.apache.maven.profiles.manager does not exist

/export/home/build/data/continuum/checkouts/478/src/main/java/org/apache/maven/extension/DefaultBuildExtensionScanner.java:[73,40]
cannot find symbol
symbol  : class ProfileManager
location: class org.apache.maven.extension.DefaultBuildExtensionScanner

/export/home/build/data/continuum/checkouts/478/src/main/java/org/apache/maven/extension/DefaultBuildExtensionScanner.java:[87,40]
cannot find symbol
symbol  : class ProfileManager
location: class org.apache.maven.extension.DefaultBuildExtensionScanner

/export/home/build/data/continuum/checkouts/478/src/main/java/org/apache/maven/extension/DefaultBuildExtensionScanner.java:[95,77]
cannot find symbol
symbol  : class ProfileManager
location: class org.apache.maven.extension.DefaultBuildExtensionScanner

/export/home/build/data/continuum/checkouts/478/src/main/java/org/apache/maven/extension/DefaultBuildExtensionScanner.java:[206,77]
cannot find symbol
symbol  : class ProfileManager
location: class org.apache.maven.extension.DefaultBuildExtensionScanner

/export/home/build/data/continuum/checkouts/478/src/main/java/org/apache/maven/extension/DefaultBuildExtensionScanner.java:[325,77]
cannot find symbol
symbol  : class ProfileManager
location: class org.apache.maven.extension.DefaultBuildExtensionScanner

/export/home/build/data/continuum/checkouts/478/src/main/java/org/apache/maven/extension/BuildExtensionScanner.java:[33,81]
cannot find symbol
symbol  : class ProfileManager
location: interface org.apache.maven.extension.BuildExtensionScanner

/export/home/build/data/continuum/checkouts/478/src/main/java/org/apache/maven/extension/BuildExtensionScanner.java:[36,79]
cannot find symbol
symbol  : class ProfileManager
location: interface org.apache.maven.extension.BuildExtensionScanner

/export/home/build/data/continuum/checkouts/478/src/main/java/org/apache/maven/DefaultMaven.java:[43,41]
package org.apache.maven.profiles.manager does not exist

/export/home/build/data/continuum/checkouts/478/src/main/java/org/apache/maven/DefaultMaven.java:[327,34]
cannot find symbol
symbol  : class ProfileManager
location: class org.apache.maven.DefaultMaven


[INFO] ------------------------------------------------------------------------
[INFO] For more information, run Maven with the -e switch
[INFO] ------------------------------------------------------------------------
[INFO] Total time: 30 seconds
[INFO] Finished at: Thu Sep 06 18:50:12 GMT+00:00 2007
[INFO] Final Memory: 10M/322M
[INFO] ------------------------------------------------------------------------

****************************************************************************



Mime
View raw message