maven-notifications mailing list archives

Site index · List index
Message view « Date » · « Thread »
Top « Date » · « Thread »
From "Continuum@maven.zones.apache.org" <contin...@maven.zones.apache.org>
Subject [continuum] BUILD FAILURE: Maven Archiver
Date Sun, 02 Sep 2007 02:42:26 GMT
Online report : http://maven.zones.apache.org/continuum/buildResult.action?buildId=19046&projectId=44

Build statistics:
  State: Failed
  Previous State: Failed
  Started at: Sun 2 Sep 2007 02:42:15 +0000
  Finished at: Sun 2 Sep 2007 02:42:24 +0000
  Total time: 9s
  Build Trigger: Forced
  Build Number: 7
  Exit code: 1
  Building machine hostname: maven.zones.apache.org
  Operating system : SunOS(unknown)
  Java Home version : 
          java version "1.5.0_12"
          Java(TM) 2 Runtime Environment, Standard Edition (build 1.5.0_12-b04)
          Java HotSpot(TM) Server VM (build 1.5.0_12-b04, mixed mode)
        
  Builder version :
          Maven version: 2.0.7
          Java version: 1.5.0_12
          OS name: "sunos" version: "5.10" arch: "x86"
    
****************************************************************************
SCM Changes:
****************************************************************************
No files changed

****************************************************************************
Dependencies Changes:
****************************************************************************
No dependencies changed

****************************************************************************
Test Summary:
****************************************************************************
Tests: 3
Failures: 1
Total time: 238

****************************************************************************
Output:
****************************************************************************
[INFO] Scanning for projects...
[INFO] ----------------------------------------------------------------------------
[INFO] Building Maven Archiver
[INFO]    task-segment: [clean, install]
[INFO] ----------------------------------------------------------------------------
[INFO] [clean:clean]
[INFO] Deleting directory /export/home/build/data/continuum/checkouts/44/target
[INFO] [resources:resources]
[INFO] Using default encoding to copy filtered resources.
[INFO] Resource directory does not exist: /export/home/build/data/continuum/checkouts/44/src/main/resources
[INFO] [compiler:compile]
[INFO] Compiling 5 source files to /export/home/build/data/continuum/checkouts/44/target/classes
[INFO] [resources:testResources]
[INFO] Using default encoding to copy filtered resources.
[INFO] Resource directory does not exist: /export/home/build/data/continuum/checkouts/44/src/test/resources
[INFO] [compiler:testCompile]
[INFO] Compiling 2 source files to /export/home/build/data/continuum/checkouts/44/target/test-classes
[INFO] [surefire:test]
[INFO] Surefire report directory: /export/home/build/data/continuum/checkouts/44/target/surefire-reports

-------------------------------------------------------
 T E S T S
-------------------------------------------------------
Running org.apache.maven.archiver.MavenArchiverTest
[INFO] Building jar: /export/home/build/data/continuum/checkouts/44/target/test/dummy.jar
[INFO] Building jar: /export/home/build/data/continuum/checkouts/44/target/test/dummy.jar
Tests run: 3, Failures: 1, Errors: 0, Skipped: 0, Time elapsed: 0.26 sec <<< FAILURE!

Results :

Failed tests: 
  testRecreation(org.apache.maven.archiver.MavenArchiverTest)

Tests run: 3, Failures: 1, Errors: 0, Skipped: 0

[INFO] ------------------------------------------------------------------------
[ERROR] BUILD FAILURE
[INFO] ------------------------------------------------------------------------
[INFO] There are test failures.

Please refer to /export/home/build/data/continuum/checkouts/44/target/surefire-reports for
the individual test results.
[INFO] ------------------------------------------------------------------------
[INFO] For more information, run Maven with the -e switch
[INFO] ------------------------------------------------------------------------
[INFO] Total time: 7 seconds
[INFO] Finished at: Sun Sep 02 02:42:24 GMT+00:00 2007
[INFO] Final Memory: 7M/322M
[INFO] ------------------------------------------------------------------------

****************************************************************************



Mime
View raw message