maven-notifications mailing list archives

Site index · List index
Message view « Date » · « Thread »
Top « Date » · « Thread »
From "Continuum@maven.zones.apache.org" <contin...@maven.zones.apache.org>
Subject [continuum] BUILD SUCCESSFUL: Maven Embedder
Date Fri, 07 Sep 2007 21:44:12 GMT
Online report : http://maven.zones.apache.org/continuum/buildResult.action?buildId=20554&projectId=486

Build statistics:
  State: Ok
  Previous State: Failed
  Started at: Fri 7 Sep 2007 21:40:43 +0000
  Finished at: Fri 7 Sep 2007 21:42:49 +0000
  Total time: 2m 6s
  Build Trigger: Schedule
  Build Number: 5
  Exit code: 0
  Building machine hostname: maven.zones.apache.org
  Operating system : SunOS(unknown)
  Java Home version : 
          java version "1.5.0_12"
          Java(TM) 2 Runtime Environment, Standard Edition (build 1.5.0_12-b04)
          Java HotSpot(TM) Server VM (build 1.5.0_12-b04, mixed mode)
        
  Builder version :
          Maven version: 2.0.7
          Java version: 1.5.0_12
          OS name: "sunos" version: "5.10" arch: "x86"
    
****************************************************************************
SCM Changes:
****************************************************************************
Changed: jvanzyl @ Fri 7 Sep 2007 21:29:08 +0000
Comment: o put the profile manager back into place as the project build is exposed in a ton of plugin. arrrg.
Files changed:
  /maven/components/trunk/maven-core/src/main/java/org/apache/maven/DefaultMaven.java ( 573718 )
  /maven/components/trunk/maven-core/src/main/java/org/apache/maven/execution/DefaultMavenExecutionRequest.java ( 573718 )
  /maven/components/trunk/maven-core/src/main/java/org/apache/maven/execution/MavenExecutionRequest.java ( 573718 )
  /maven/components/trunk/maven-core/src/main/java/org/apache/maven/extension/BuildExtensionScanner.java ( 573718 )
  /maven/components/trunk/maven-core/src/main/java/org/apache/maven/extension/DefaultBuildExtensionScanner.java ( 573718 )
  /maven/components/trunk/maven-core/src/main/resources/META-INF/plexus/components.xml ( 573718 )
  /maven/components/trunk/maven-embedder/src/main/java/org/apache/maven/embedder/execution/DefaultMavenExecutionRequestPopulator.java ( 573718 )
  /maven/components/trunk/maven-project/src/main/java/org/apache/maven/profiles/DefaultProfileManager.java (from /maven/components/trunk/maven-project/src/main/java/org/apache/maven/profiles/manager/DefaultProfileManager.java:573705) ( 573718 )
  /maven/components/trunk/maven-project/src/main/java/org/apache/maven/profiles/ProfileManager.java (from /maven/components/trunk/maven-project/src/main/java/org/apache/maven/profiles/manager/ProfileManager.java:573705) ( 573718 )
  /maven/components/trunk/maven-project/src/main/java/org/apache/maven/profiles/build/DefaultProfileAdvisor.java ( 573718 )
  /maven/components/trunk/maven-project/src/main/java/org/apache/maven/profiles/build/ProfileAdvisor.java ( 573718 )
  /maven/components/trunk/maven-project/src/main/java/org/apache/maven/profiles/manager/DefaultProfileManager.java ( 573718 )
  /maven/components/trunk/maven-project/src/main/java/org/apache/maven/profiles/manager/ProfileManager.java ( 573718 )
  /maven/components/trunk/maven-project/src/main/java/org/apache/maven/project/DefaultMavenProjectBuilder.java ( 573718 )
  /maven/components/trunk/maven-project/src/main/java/org/apache/maven/project/MavenProjectBuilder.java ( 573718 )
  /maven/components/trunk/maven-project/src/main/java/org/apache/maven/project/build/model/DefaultModelLineageBuilder.java ( 573718 )
  /maven/components/trunk/maven-project/src/main/java/org/apache/maven/project/build/model/ModelLineageBuilder.java ( 573718 )
  /maven/components/trunk/maven-project/src/test/java/org/apache/maven/profiles/manager/DefaultProfileManagerTest.java ( 573718 )
  /maven/components/trunk/maven-project/src/test/java/org/apache/maven/project/AbstractMavenProjectTestCase.java ( 573718 )

****************************************************************************
Dependencies Changes:
****************************************************************************
org.apache.maven:maven-core:2.1-SNAPSHOT

****************************************************************************
Test Summary:
****************************************************************************
Tests: 58
Failures: 0
Total time: 75150

****************************************************************************
Output:
****************************************************************************
[INFO] Scanning for projects...
[INFO] ----------------------------------------------------------------------------
[INFO] Building Maven Embedder
[INFO]    task-segment: [clean, install]
[INFO] ----------------------------------------------------------------------------
[INFO] [clean:clean]
[INFO] Deleting directory /export/home/build/data/continuum/checkouts/486/target
[INFO] [resources:resources]
[INFO] Using default encoding to copy filtered resources.
[INFO] Copying 2 resources
[INFO] [compiler:compile]
[INFO] Compiling 24 source files to /export/home/build/data/continuum/checkouts/486/target/classes
[INFO] [resources:testResources]
[INFO] Using default encoding to copy filtered resources.
[INFO] Copying 6 resources
[INFO] [compiler:testCompile]
[INFO] Compiling 18 source files to /export/home/build/data/continuum/checkouts/486/target/test-classes
[INFO] [surefire:test]
[INFO] Surefire report directory: /export/home/build/data/continuum/checkouts/486/target/surefire-reports

-------------------------------------------------------
 T E S T S
-------------------------------------------------------
Running org.apache.maven.embedder.TestComponentOverride
Tests run: 1, Failures: 0, Errors: 0, Skipped: 0, Time elapsed: 2.036 sec
Running org.apache.maven.embedder.validation.MavenEmbedderCrappySettingsConfigurationTest
[ERROR] Failed to read settings from: /export/home/build/data/continuum/checkouts/486/src/examples/simple-project/invalid-settings.xml. Throwing IOException...
[ERROR] Failed to read settings from: /export/home/build/data/continuum/checkouts/486/src/examples/simple-project/invalid-settings.xml. Throwing IOException...
[INFO] Scanning for projects...
[INFO] ----------------------------------------------------------------------------
[INFO] Building simple-project
[INFO]    task-segment: [clean, install]
[INFO] ----------------------------------------------------------------------------
[INFO] [clean:clean]
[INFO] Deleting directory /export/home/build/data/continuum/checkouts/486/src/examples/simple-project/target
[INFO] [resources:resources]
[INFO] Using default encoding to copy filtered resources.
[INFO] Resource directory does not exist: /export/home/build/data/continuum/checkouts/486/src/examples/simple-project/src/main/resources
[INFO] [compiler:compile]
[INFO] Compiling 1 source file to /export/home/build/data/continuum/checkouts/486/src/examples/simple-project/target/classes
[INFO] [resources:testResources]
[INFO] Using default encoding to copy filtered resources.
[INFO] Resource directory does not exist: /export/home/build/data/continuum/checkouts/486/src/examples/simple-project/src/test/resources
[INFO] [compiler:testCompile]
[INFO] Compiling 1 source file to /export/home/build/data/continuum/checkouts/486/src/examples/simple-project/target/test-classes
[INFO] [surefire:test]
[INFO] Surefire report directory: /export/home/build/data/continuum/checkouts/486/src/examples/simple-project/target/surefire-reports

-------------------------------------------------------
 T E S T S
-------------------------------------------------------
Running org.apache.maven.embedder.AppTest
Tests run: 1, Failures: 0, Errors: 0, Skipped: 0, Time elapsed: 0.071 sec

Results :

Tests run: 1, Failures: 0, Errors: 0, Skipped: 0

[INFO] [jar:jar]
[INFO] Building jar: /export/home/build/data/continuum/checkouts/486/src/examples/simple-project/target/simple-project-1.0-SNAPSHOT.jar
[INFO] [install:install]
[INFO] Installing /export/home/build/data/continuum/checkouts/486/src/examples/simple-project/target/simple-project-1.0-SNAPSHOT.jar to /export/home/build/.m2/repository/org/apache/maven/embedder/simple-project/1.0-SNAPSHOT/simple-project-1.0-SNAPSHOT.jar
Tests run: 1, Failures: 0, Errors: 0, Skipped: 0, Time elapsed: 13.031 sec
Running org.apache.maven.cli.ConsoleDownloadMonitorTest
Downloading: null://nullnull/null
0/97K
97K downloaded
java.lang.RuntimeException
	at org.apache.maven.cli.AbstractConsoleDownloadMonitorTest.testTransferError(AbstractConsoleDownloadMonitorTest.java:75)
	at sun.reflect.NativeMethodAccessorImpl.invoke0(Native Method)
	at sun.reflect.NativeMethodAccessorImpl.invoke(NativeMethodAccessorImpl.java:39)
	at sun.reflect.DelegatingMethodAccessorImpl.invoke(DelegatingMethodAccessorImpl.java:25)
	at java.lang.reflect.Method.invoke(Method.java:585)
	at junit.framework.TestCase.runTest(TestCase.java:154)
	at junit.framework.TestCase.runBare(TestCase.java:127)
	at junit.framework.TestResult$1.protect(TestResult.java:106)
	at junit.framework.TestResult.runProtected(TestResult.java:124)
	at junit.framework.TestResult.run(TestResult.java:109)
	at junit.framework.TestCase.run(TestCase.java:118)
	at junit.framework.TestSuite.runTest(TestSuite.java:208)
	at junit.framework.TestSuite.run(TestSuite.java:203)
	at sun.reflect.NativeMethodAccessorImpl.invoke0(Native Method)
	at sun.reflect.NativeMethodAccessorImpl.invoke(NativeMethodAccessorImpl.java:39)
	at sun.reflect.DelegatingMethodAccessorImpl.invoke(DelegatingMethodAccessorImpl.java:25)
	at java.lang.reflect.Method.invoke(Method.java:585)
	at org.apache.maven.surefire.junit.JUnitTestSet.execute(JUnitTestSet.java:213)
	at org.apache.maven.surefire.suite.AbstractDirectoryTestSuite.executeTestSet(AbstractDirectoryTestSuite.java:138)
	at org.apache.maven.surefire.suite.AbstractDirectoryTestSuite.execute(AbstractDirectoryTestSuite.java:125)
	at org.apache.maven.surefire.Surefire.run(Surefire.java:132)
	at sun.reflect.NativeMethodAccessorImpl.invoke0(Native Method)
	at sun.reflect.NativeMethodAccessorImpl.invoke(NativeMethodAccessorImpl.java:39)
	at sun.reflect.DelegatingMethodAccessorImpl.invoke(DelegatingMethodAccessorImpl.java:25)
	at java.lang.reflect.Method.invoke(Method.java:585)
	at org.apache.maven.surefire.booter.SurefireBooter.runSuitesInProcess(SurefireBooter.java:290)
	at org.apache.maven.surefire.booter.SurefireBooter.main(SurefireBooter.java:818)
Tests run: 6, Failures: 0, Errors: 0, Skipped: 0, Time elapsed: 0.026 sec
Running org.apache.maven.embedder.execution.EmbedderUsingEclipsePluginTest
properties = null
[DEBUG] No settings files provided, and default locations are disabled for this request. Returning empty Settings instance.
[DEBUG] Pre-scanning POM lineage of: /export/home/build/data/continuum/checkouts/486/target/eclipse-from-embedder/pom.xml for build extensions.
[DEBUG] Building model-lineage for: /export/home/build/data/continuum/checkouts/486/target/eclipse-from-embedder/pom.xml to pre-scan for extensions.
[DEBUG] Checking: org.apache.maven:embedder-test-project:jar:1.0-SNAPSHOT for extensions. (It has 0 modules.)
[DEBUG] Basedir is: /export/home/build/data/continuum/checkouts/486/target/eclipse-from-embedder
[DEBUG] Finished pre-scanning: /export/home/build/data/continuum/checkouts/486/target/eclipse-from-embedder/pom.xml for build extensions.
[INFO] Searching repository for plugin with prefix: 'eclipse'.
[DEBUG] Loading plugin prefixes from group: org.apache.maven.plugins
[DEBUG] Loading plugin prefixes from group: org.codehaus.mojo
[DEBUG] Resolving version for plugin: org.apache.maven.plugins:maven-eclipse-plugin
[DEBUG] Version from POM: null
[DEBUG] Version from another POM in the reactor: null
[DEBUG] maven-eclipse-plugin: resolved to version 2.5-SNAPSHOT from local repository
[DEBUG] Skipping disabled repository central
[DEBUG] maven-eclipse-plugin: using locally installed snapshot
[DEBUG] Version from LATEST metadata: 2.5-SNAPSHOT
[DEBUG] In verifyVersionedPlugin for: org.apache.maven.plugins:maven-eclipse-plugin
[DEBUG] maven-eclipse-plugin: using locally installed snapshot
[DEBUG] org.apache.maven.plugins:maven-eclipse-plugin:maven-plugin:2.5-SNAPSHOT:runtime (selected for runtime)
[DEBUG]   org.codehaus.plexus:plexus-archiver:jar:1.0-alpha-7:runtime (selected for runtime)
[DEBUG]     org.codehaus.plexus:plexus-container-default:jar:1.0-alpha-8:runtime (selected for runtime)
[DEBUG]       org.codehaus.plexus:plexus-utils:jar:1.0.4:runtime (selected for runtime)
[DEBUG]       junit:junit:jar:3.8.1:runtime (selected for runtime)
[DEBUG]       classworlds:classworlds:jar:1.1-alpha-2:runtime (selected for runtime)
[DEBUG]     org.codehaus.plexus:plexus-utils:jar:1.0.4:runtime (removed - nearer found: 1.2)
[DEBUG]     org.codehaus.plexus:plexus-utils:jar:1.2:runtime (selected for runtime)
[DEBUG]   org.apache.maven:maven-project:jar:2.0.6:runtime (selected for runtime)
[DEBUG]     org.apache.maven:maven-settings:jar:2.0.6:runtime (selected for runtime)
[DEBUG]       org.apache.maven:maven-model:jar:2.0.6:runtime (selected for runtime)
[DEBUG]         org.codehaus.plexus:plexus-utils:jar:1.4.1:runtime (removed - nearer found: 1.2)
[DEBUG]       org.codehaus.plexus:plexus-utils:jar:1.4.1:runtime (removed - nearer found: 1.2)
[DEBUG]       org.codehaus.plexus:plexus-container-default:jar:1.0-alpha-9-stable-1:runtime (removed - nearer found: 1.0-alpha-8)
[DEBUG]     org.apache.maven:maven-profile:jar:2.0.6:runtime (selected for runtime)
[DEBUG]       org.codehaus.plexus:plexus-utils:jar:1.4.1:runtime (removed - nearer found: 1.2)
[DEBUG]       org.codehaus.plexus:plexus-container-default:jar:1.0-alpha-9-stable-1:runtime (removed - nearer found: 1.0-alpha-8)
[DEBUG]     org.apache.maven:maven-model:jar:2.0.6:runtime (selected for runtime)
[DEBUG]       org.codehaus.plexus:plexus-utils:jar:1.4.1:runtime (removed - nearer found: 1.2)
[DEBUG]     org.apache.maven:maven-artifact-manager:jar:2.0.6:runtime (selected for runtime)
[DEBUG]       org.apache.maven:maven-repository-metadata:jar:2.0.6:runtime (selected for runtime)
[DEBUG]         org.codehaus.plexus:plexus-utils:jar:1.4.1:runtime (removed - nearer found: 1.2)
[DEBUG]       org.codehaus.plexus:plexus-utils:jar:1.4.1:runtime (removed - nearer found: 1.2)
[DEBUG]       org.apache.maven:maven-artifact:jar:2.0.6:runtime (selected for runtime)
[DEBUG]         org.codehaus.plexus:plexus-utils:jar:1.4.1:runtime (removed - nearer found: 1.2)
[DEBUG]       org.codehaus.plexus:plexus-container-default:jar:1.0-alpha-9-stable-1:runtime (removed - nearer found: 1.0-alpha-8)
[DEBUG]       org.apache.maven.wagon:wagon-provider-api:jar:1.0-beta-2:runtime (selected for runtime)
[DEBUG]         org.codehaus.plexus:plexus-utils:jar:1.0.4:runtime (removed - nearer found: 1.2)
[DEBUG]     org.apache.maven:maven-plugin-registry:jar:2.0.6:runtime (selected for runtime)
[DEBUG]       org.codehaus.plexus:plexus-utils:jar:1.4.1:runtime (removed - nearer found: 1.2)
[DEBUG]       org.codehaus.plexus:plexus-container-default:jar:1.0-alpha-9-stable-1:runtime (removed - nearer found: 1.0-alpha-8)
[DEBUG]     org.codehaus.plexus:plexus-utils:jar:1.4.1:runtime (removed - nearer found: 1.2)
[DEBUG]     org.apache.maven:maven-artifact:jar:2.0.6:runtime (selected for runtime)
[DEBUG]       org.codehaus.plexus:plexus-utils:jar:1.4.1:runtime (removed - nearer found: 1.2)
[DEBUG]     org.codehaus.plexus:plexus-container-default:jar:1.0-alpha-9-stable-1:runtime (removed - nearer found: 1.0-alpha-8)
[DEBUG]   org.apache.maven:maven-plugin-api:jar:2.0.6:runtime (selected for runtime)
[DEBUG]   org.apache.maven:maven-model:jar:2.0.6:runtime (selected for runtime)
[DEBUG]     org.codehaus.plexus:plexus-utils:jar:1.4.1:runtime (removed - nearer found: 1.2)
[DEBUG]   org.apache.maven:maven-artifact-manager:jar:2.0.6:runtime (selected for runtime)
[DEBUG]     org.apache.maven:maven-repository-metadata:jar:2.0.6:runtime (selected for runtime)
[DEBUG]       org.codehaus.plexus:plexus-utils:jar:1.4.1:runtime (removed - nearer found: 1.2)
[DEBUG]     org.codehaus.plexus:plexus-utils:jar:1.4.1:runtime (removed - nearer found: 1.2)
[DEBUG]     org.codehaus.plexus:plexus-container-default:jar:1.0-alpha-9-stable-1:runtime (removed - nearer found: 1.0-alpha-8)
[DEBUG]     org.apache.maven.wagon:wagon-provider-api:jar:1.0-beta-2:runtime (selected for runtime)
[DEBUG]       org.codehaus.plexus:plexus-utils:jar:1.0.4:runtime (removed - nearer found: 1.2)
[DEBUG]   org.apache.maven:maven-artifact:jar:2.0.6:runtime (selected for runtime)
[DEBUG]     org.codehaus.plexus:plexus-utils:jar:1.4.1:runtime (removed - nearer found: 1.2)
[DEBUG]   org.codehaus.plexus:plexus-utils:jar:1.2:runtime (removed - nearer found: 1.4.2)
[DEBUG]   org.codehaus.plexus:plexus-utils:jar:1.4.2:runtime (selected for runtime)
[DEBUG]   org.codehaus.plexus:plexus-interactivity-jline:jar:1.0-alpha-5:runtime (selected for runtime)
[DEBUG]     jline:jline:jar:0.9.1:runtime (selected for runtime)
[DEBUG]     org.codehaus.plexus:plexus-interactivity-api:jar:1.0-alpha-5:runtime (selected for runtime)
[DEBUG]   org.apache.maven:maven-archiver:jar:2.2:runtime (selected for runtime)
[DEBUG]     org.apache.maven:maven-project:jar:2.0:runtime (removed - nearer found: 2.0.6)
[DEBUG]     org.apache.maven:maven-artifact:jar:2.0:runtime (removed - nearer found: 2.0.6)
[DEBUG]   biz.aQute:bndlib:jar:0.0.145:runtime (selected for runtime)
[DEBUG] Using the following artifacts for classpath of: org.apache.maven.plugins:maven-eclipse-plugin:maven-plugin:2.5-SNAPSHOT:

[org.codehaus.plexus:plexus-interactivity-jline:jar:1.0-alpha-5:runtime
 org.codehaus.plexus:plexus-archiver:jar:1.0-alpha-7:runtime
 jline:jline:jar:0.9.1:runtime
 org.apache.maven:maven-archiver:jar:2.2:runtime
 biz.aQute:bndlib:jar:0.0.145:runtime
 org.codehaus.plexus:plexus-utils:jar:1.4.2:runtime]
[DEBUG] Checking for plugin descriptor for: org.apache.maven.plugins:maven-eclipse-plugin in collector: org.apache.maven.plugin.MavenPluginCollector@129e5e9
[DEBUG] Realm for plugin: org.apache.maven.plugins:maven-eclipse-plugin:
ClassRealm[org.apache.maven.plugins:maven-eclipse-plugin, parent: ClassRealm[plexus.core, parent: null]]
[DEBUG] In verifyVersionedPlugin for: org.apache.maven.plugins:maven-eclipse-plugin
[DEBUG] maven-eclipse-plugin: using locally installed snapshot
[DEBUG] org.apache.maven.plugins:maven-eclipse-plugin:maven-plugin:2.5-SNAPSHOT:runtime (selected for runtime)
[DEBUG]   org.codehaus.plexus:plexus-archiver:jar:1.0-alpha-7:runtime (selected for runtime)
[DEBUG]     org.codehaus.plexus:plexus-container-default:jar:1.0-alpha-8:runtime (selected for runtime)
[DEBUG]       org.codehaus.plexus:plexus-utils:jar:1.0.4:runtime (selected for runtime)
[DEBUG]       junit:junit:jar:3.8.1:runtime (selected for runtime)
[DEBUG]       classworlds:classworlds:jar:1.1-alpha-2:runtime (selected for runtime)
[DEBUG]     org.codehaus.plexus:plexus-utils:jar:1.0.4:runtime (removed - nearer found: 1.2)
[DEBUG]     org.codehaus.plexus:plexus-utils:jar:1.2:runtime (selected for runtime)
[DEBUG]   org.apache.maven:maven-project:jar:2.0.6:runtime (selected for runtime)
[DEBUG]     org.apache.maven:maven-settings:jar:2.0.6:runtime (selected for runtime)
[DEBUG]       org.apache.maven:maven-model:jar:2.0.6:runtime (selected for runtime)
[DEBUG]         org.codehaus.plexus:plexus-utils:jar:1.4.1:runtime (removed - nearer found: 1.2)
[DEBUG]       org.codehaus.plexus:plexus-utils:jar:1.4.1:runtime (removed - nearer found: 1.2)
[DEBUG]       org.codehaus.plexus:plexus-container-default:jar:1.0-alpha-9-stable-1:runtime (removed - nearer found: 1.0-alpha-8)
[DEBUG]     org.apache.maven:maven-profile:jar:2.0.6:runtime (selected for runtime)
[DEBUG]       org.codehaus.plexus:plexus-utils:jar:1.4.1:runtime (removed - nearer found: 1.2)
[DEBUG]       org.codehaus.plexus:plexus-container-default:jar:1.0-alpha-9-stable-1:runtime (removed - nearer found: 1.0-alpha-8)
[DEBUG]     org.apache.maven:maven-model:jar:2.0.6:runtime (selected for runtime)
[DEBUG]       org.codehaus.plexus:plexus-utils:jar:1.4.1:runtime (removed - nearer found: 1.2)
[DEBUG]     org.apache.maven:maven-artifact-manager:jar:2.0.6:runtime (selected for runtime)
[DEBUG]       org.apache.maven:maven-repository-metadata:jar:2.0.6:runtime (selected for runtime)
[DEBUG]         org.codehaus.plexus:plexus-utils:jar:1.4.1:runtime (removed - nearer found: 1.2)
[DEBUG]       org.codehaus.plexus:plexus-utils:jar:1.4.1:runtime (removed - nearer found: 1.2)
[DEBUG]       org.apache.maven:maven-artifact:jar:2.0.6:runtime (selected for runtime)
[DEBUG]         org.codehaus.plexus:plexus-utils:jar:1.4.1:runtime (removed - nearer found: 1.2)
[DEBUG]       org.codehaus.plexus:plexus-container-default:jar:1.0-alpha-9-stable-1:runtime (removed - nearer found: 1.0-alpha-8)
[DEBUG]       org.apache.maven.wagon:wagon-provider-api:jar:1.0-beta-2:runtime (selected for runtime)
[DEBUG]         org.codehaus.plexus:plexus-utils:jar:1.0.4:runtime (removed - nearer found: 1.2)
[DEBUG]     org.apache.maven:maven-plugin-registry:jar:2.0.6:runtime (selected for runtime)
[DEBUG]       org.codehaus.plexus:plexus-utils:jar:1.4.1:runtime (removed - nearer found: 1.2)
[DEBUG]       org.codehaus.plexus:plexus-container-default:jar:1.0-alpha-9-stable-1:runtime (removed - nearer found: 1.0-alpha-8)
[DEBUG]     org.codehaus.plexus:plexus-utils:jar:1.4.1:runtime (removed - nearer found: 1.2)
[DEBUG]     org.apache.maven:maven-artifact:jar:2.0.6:runtime (selected for runtime)
[DEBUG]       org.codehaus.plexus:plexus-utils:jar:1.4.1:runtime (removed - nearer found: 1.2)
[DEBUG]     org.codehaus.plexus:plexus-container-default:jar:1.0-alpha-9-stable-1:runtime (removed - nearer found: 1.0-alpha-8)
[DEBUG]   org.apache.maven:maven-plugin-api:jar:2.0.6:runtime (selected for runtime)
[DEBUG]   org.apache.maven:maven-model:jar:2.0.6:runtime (selected for runtime)
[DEBUG]     org.codehaus.plexus:plexus-utils:jar:1.4.1:runtime (removed - nearer found: 1.2)
[DEBUG]   org.apache.maven:maven-artifact-manager:jar:2.0.6:runtime (selected for runtime)
[DEBUG]     org.apache.maven:maven-repository-metadata:jar:2.0.6:runtime (selected for runtime)
[DEBUG]       org.codehaus.plexus:plexus-utils:jar:1.4.1:runtime (removed - nearer found: 1.2)
[DEBUG]     org.codehaus.plexus:plexus-utils:jar:1.4.1:runtime (removed - nearer found: 1.2)
[DEBUG]     org.codehaus.plexus:plexus-container-default:jar:1.0-alpha-9-stable-1:runtime (removed - nearer found: 1.0-alpha-8)
[DEBUG]     org.apache.maven.wagon:wagon-provider-api:jar:1.0-beta-2:runtime (selected for runtime)
[DEBUG]       org.codehaus.plexus:plexus-utils:jar:1.0.4:runtime (removed - nearer found: 1.2)
[DEBUG]   org.apache.maven:maven-artifact:jar:2.0.6:runtime (selected for runtime)
[DEBUG]     org.codehaus.plexus:plexus-utils:jar:1.4.1:runtime (removed - nearer found: 1.2)
[DEBUG]   org.codehaus.plexus:plexus-utils:jar:1.2:runtime (removed - nearer found: 1.4.2)
[DEBUG]   org.codehaus.plexus:plexus-utils:jar:1.4.2:runtime (selected for runtime)
[DEBUG]   org.codehaus.plexus:plexus-interactivity-jline:jar:1.0-alpha-5:runtime (selected for runtime)
[DEBUG]     jline:jline:jar:0.9.1:runtime (selected for runtime)
[DEBUG]     org.codehaus.plexus:plexus-interactivity-api:jar:1.0-alpha-5:runtime (selected for runtime)
[DEBUG]   org.apache.maven:maven-archiver:jar:2.2:runtime (selected for runtime)
[DEBUG]     org.apache.maven:maven-project:jar:2.0:runtime (removed - nearer found: 2.0.6)
[DEBUG]     org.apache.maven:maven-artifact:jar:2.0:runtime (removed - nearer found: 2.0.6)
[DEBUG]   biz.aQute:bndlib:jar:0.0.145:runtime (selected for runtime)
[DEBUG] Using the following artifacts for classpath of: org.apache.maven.plugins:maven-eclipse-plugin:maven-plugin:2.5-SNAPSHOT:

[org.codehaus.plexus:plexus-interactivity-jline:jar:1.0-alpha-5:runtime
 org.codehaus.plexus:plexus-archiver:jar:1.0-alpha-7:runtime
 jline:jline:jar:0.9.1:runtime
 org.apache.maven:maven-archiver:jar:2.2:runtime
 biz.aQute:bndlib:jar:0.0.145:runtime
 org.codehaus.plexus:plexus-utils:jar:1.4.2:runtime]
[DEBUG] Realm already exists for: org.apache.maven.plugins:maven-eclipse-plugin. Skipping addition...
[INFO] Scanning for projects...
[DEBUG] In verifyVersionedPlugin for: org.apache.maven.plugins:maven-eclipse-plugin
[DEBUG] maven-eclipse-plugin: using locally installed snapshot
[DEBUG] org.apache.maven.plugins:maven-eclipse-plugin:maven-plugin:2.5-SNAPSHOT:runtime (selected for runtime)
[DEBUG]   org.codehaus.plexus:plexus-archiver:jar:1.0-alpha-7:runtime (selected for runtime)
[DEBUG]     org.codehaus.plexus:plexus-container-default:jar:1.0-alpha-8:runtime (selected for runtime)
[DEBUG]       org.codehaus.plexus:plexus-utils:jar:1.0.4:runtime (selected for runtime)
[DEBUG]       junit:junit:jar:3.8.1:runtime (selected for runtime)
[DEBUG]       classworlds:classworlds:jar:1.1-alpha-2:runtime (selected for runtime)
[DEBUG]     org.codehaus.plexus:plexus-utils:jar:1.0.4:runtime (removed - nearer found: 1.2)
[DEBUG]     org.codehaus.plexus:plexus-utils:jar:1.2:runtime (selected for runtime)
[DEBUG]   org.apache.maven:maven-project:jar:2.0.6:runtime (selected for runtime)
[DEBUG]     org.apache.maven:maven-settings:jar:2.0.6:runtime (selected for runtime)
[DEBUG]       org.apache.maven:maven-model:jar:2.0.6:runtime (selected for runtime)
[DEBUG]         org.codehaus.plexus:plexus-utils:jar:1.4.1:runtime (removed - nearer found: 1.2)
[DEBUG]       org.codehaus.plexus:plexus-utils:jar:1.4.1:runtime (removed - nearer found: 1.2)
[DEBUG]       org.codehaus.plexus:plexus-container-default:jar:1.0-alpha-9-stable-1:runtime (removed - nearer found: 1.0-alpha-8)
[DEBUG]     org.apache.maven:maven-profile:jar:2.0.6:runtime (selected for runtime)
[DEBUG]       org.codehaus.plexus:plexus-utils:jar:1.4.1:runtime (removed - nearer found: 1.2)
[DEBUG]       org.codehaus.plexus:plexus-container-default:jar:1.0-alpha-9-stable-1:runtime (removed - nearer found: 1.0-alpha-8)
[DEBUG]     org.apache.maven:maven-model:jar:2.0.6:runtime (selected for runtime)
[DEBUG]       org.codehaus.plexus:plexus-utils:jar:1.4.1:runtime (removed - nearer found: 1.2)
[DEBUG]     org.apache.maven:maven-artifact-manager:jar:2.0.6:runtime (selected for runtime)
[DEBUG]       org.apache.maven:maven-repository-metadata:jar:2.0.6:runtime (selected for runtime)
[DEBUG]         org.codehaus.plexus:plexus-utils:jar:1.4.1:runtime (removed - nearer found: 1.2)
[DEBUG]       org.codehaus.plexus:plexus-utils:jar:1.4.1:runtime (removed - nearer found: 1.2)
[DEBUG]       org.apache.maven:maven-artifact:jar:2.0.6:runtime (selected for runtime)
[DEBUG]         org.codehaus.plexus:plexus-utils:jar:1.4.1:runtime (removed - nearer found: 1.2)
[DEBUG]       org.codehaus.plexus:plexus-container-default:jar:1.0-alpha-9-stable-1:runtime (removed - nearer found: 1.0-alpha-8)
[DEBUG]       org.apache.maven.wagon:wagon-provider-api:jar:1.0-beta-2:runtime (selected for runtime)
[DEBUG]         org.codehaus.plexus:plexus-utils:jar:1.0.4:runtime (removed - nearer found: 1.2)
[DEBUG]     org.apache.maven:maven-plugin-registry:jar:2.0.6:runtime (selected for runtime)
[DEBUG]       org.codehaus.plexus:plexus-utils:jar:1.4.1:runtime (removed - nearer found: 1.2)
[DEBUG]       org.codehaus.plexus:plexus-container-default:jar:1.0-alpha-9-stable-1:runtime (removed - nearer found: 1.0-alpha-8)
[DEBUG]     org.codehaus.plexus:plexus-utils:jar:1.4.1:runtime (removed - nearer found: 1.2)
[DEBUG]     org.apache.maven:maven-artifact:jar:2.0.6:runtime (selected for runtime)
[DEBUG]       org.codehaus.plexus:plexus-utils:jar:1.4.1:runtime (removed - nearer found: 1.2)
[DEBUG]     org.codehaus.plexus:plexus-container-default:jar:1.0-alpha-9-stable-1:runtime (removed - nearer found: 1.0-alpha-8)
[DEBUG]   org.apache.maven:maven-plugin-api:jar:2.0.6:runtime (selected for runtime)
[DEBUG]   org.apache.maven:maven-model:jar:2.0.6:runtime (selected for runtime)
[DEBUG]     org.codehaus.plexus:plexus-utils:jar:1.4.1:runtime (removed - nearer found: 1.2)
[DEBUG]   org.apache.maven:maven-artifact-manager:jar:2.0.6:runtime (selected for runtime)
[DEBUG]     org.apache.maven:maven-repository-metadata:jar:2.0.6:runtime (selected for runtime)
[DEBUG]       org.codehaus.plexus:plexus-utils:jar:1.4.1:runtime (removed - nearer found: 1.2)
[DEBUG]     org.codehaus.plexus:plexus-utils:jar:1.4.1:runtime (removed - nearer found: 1.2)
[DEBUG]     org.codehaus.plexus:plexus-container-default:jar:1.0-alpha-9-stable-1:runtime (removed - nearer found: 1.0-alpha-8)
[DEBUG]     org.apache.maven.wagon:wagon-provider-api:jar:1.0-beta-2:runtime (selected for runtime)
[DEBUG]       org.codehaus.plexus:plexus-utils:jar:1.0.4:runtime (removed - nearer found: 1.2)
[DEBUG]   org.apache.maven:maven-artifact:jar:2.0.6:runtime (selected for runtime)
[DEBUG]     org.codehaus.plexus:plexus-utils:jar:1.4.1:runtime (removed - nearer found: 1.2)
[DEBUG]   org.codehaus.plexus:plexus-utils:jar:1.2:runtime (removed - nearer found: 1.4.2)
[DEBUG]   org.codehaus.plexus:plexus-utils:jar:1.4.2:runtime (selected for runtime)
[DEBUG]   org.codehaus.plexus:plexus-interactivity-jline:jar:1.0-alpha-5:runtime (selected for runtime)
[DEBUG]     jline:jline:jar:0.9.1:runtime (selected for runtime)
[DEBUG]     org.codehaus.plexus:plexus-interactivity-api:jar:1.0-alpha-5:runtime (selected for runtime)
[DEBUG]   org.apache.maven:maven-archiver:jar:2.2:runtime (selected for runtime)
[DEBUG]     org.apache.maven:maven-project:jar:2.0:runtime (removed - nearer found: 2.0.6)
[DEBUG]     org.apache.maven:maven-artifact:jar:2.0:runtime (removed - nearer found: 2.0.6)
[DEBUG]   biz.aQute:bndlib:jar:0.0.145:runtime (selected for runtime)
[DEBUG] Using the following artifacts for classpath of: org.apache.maven.plugins:maven-eclipse-plugin:maven-plugin:2.5-SNAPSHOT:

[org.codehaus.plexus:plexus-interactivity-jline:jar:1.0-alpha-5:runtime
 org.codehaus.plexus:plexus-archiver:jar:1.0-alpha-7:runtime
 jline:jline:jar:0.9.1:runtime
 org.apache.maven:maven-archiver:jar:2.2:runtime
 biz.aQute:bndlib:jar:0.0.145:runtime
 org.codehaus.plexus:plexus-utils:jar:1.4.2:runtime]
[DEBUG] Realm already exists for: org.apache.maven.plugins:maven-eclipse-plugin. Skipping addition...
[INFO] ----------------------------------------------------------------------------
[INFO] Building Maven Quick Start Archetype
[INFO]    task-segment: [eclipse:eclipse]
[INFO] ----------------------------------------------------------------------------
[WARNING] Assuming that mojo: 'eclipse:eclipse' does NOT need configuration from the <reporting /> section of the POM.
[DEBUG] In verifyVersionedPlugin for: org.apache.maven.plugins:maven-eclipse-plugin
[DEBUG] maven-eclipse-plugin: using locally installed snapshot
[DEBUG] org.apache.maven.plugins:maven-eclipse-plugin:maven-plugin:2.5-SNAPSHOT:runtime (selected for runtime)
[DEBUG]   org.codehaus.plexus:plexus-archiver:jar:1.0-alpha-7:runtime (selected for runtime)
[DEBUG]     org.codehaus.plexus:plexus-container-default:jar:1.0-alpha-8:runtime (selected for runtime)
[DEBUG]       org.codehaus.plexus:plexus-utils:jar:1.0.4:runtime (selected for runtime)
[DEBUG]       junit:junit:jar:3.8.1:runtime (selected for runtime)
[DEBUG]       classworlds:classworlds:jar:1.1-alpha-2:runtime (selected for runtime)
[DEBUG]     org.codehaus.plexus:plexus-utils:jar:1.0.4:runtime (removed - nearer found: 1.2)
[DEBUG]     org.codehaus.plexus:plexus-utils:jar:1.2:runtime (selected for runtime)
[DEBUG]   org.apache.maven:maven-project:jar:2.0.6:runtime (selected for runtime)
[DEBUG]     org.apache.maven:maven-settings:jar:2.0.6:runtime (selected for runtime)
[DEBUG]       org.apache.maven:maven-model:jar:2.0.6:runtime (selected for runtime)
[DEBUG]         org.codehaus.plexus:plexus-utils:jar:1.4.1:runtime (removed - nearer found: 1.2)
[DEBUG]       org.codehaus.plexus:plexus-utils:jar:1.4.1:runtime (removed - nearer found: 1.2)
[DEBUG]       org.codehaus.plexus:plexus-container-default:jar:1.0-alpha-9-stable-1:runtime (removed - nearer found: 1.0-alpha-8)
[DEBUG]     org.apache.maven:maven-profile:jar:2.0.6:runtime (selected for runtime)
[DEBUG]       org.codehaus.plexus:plexus-utils:jar:1.4.1:runtime (removed - nearer found: 1.2)
[DEBUG]       org.codehaus.plexus:plexus-container-default:jar:1.0-alpha-9-stable-1:runtime (removed - nearer found: 1.0-alpha-8)
[DEBUG]     org.apache.maven:maven-model:jar:2.0.6:runtime (selected for runtime)
[DEBUG]       org.codehaus.plexus:plexus-utils:jar:1.4.1:runtime (removed - nearer found: 1.2)
[DEBUG]     org.apache.maven:maven-artifact-manager:jar:2.0.6:runtime (selected for runtime)
[DEBUG]       org.apache.maven:maven-repository-metadata:jar:2.0.6:runtime (selected for runtime)
[DEBUG]         org.codehaus.plexus:plexus-utils:jar:1.4.1:runtime (removed - nearer found: 1.2)
[DEBUG]       org.codehaus.plexus:plexus-utils:jar:1.4.1:runtime (removed - nearer found: 1.2)
[DEBUG]       org.apache.maven:maven-artifact:jar:2.0.6:runtime (selected for runtime)
[DEBUG]         org.codehaus.plexus:plexus-utils:jar:1.4.1:runtime (removed - nearer found: 1.2)
[DEBUG]       org.codehaus.plexus:plexus-container-default:jar:1.0-alpha-9-stable-1:runtime (removed - nearer found: 1.0-alpha-8)
[DEBUG]       org.apache.maven.wagon:wagon-provider-api:jar:1.0-beta-2:runtime (selected for runtime)
[DEBUG]         org.codehaus.plexus:plexus-utils:jar:1.0.4:runtime (removed - nearer found: 1.2)
[DEBUG]     org.apache.maven:maven-plugin-registry:jar:2.0.6:runtime (selected for runtime)
[DEBUG]       org.codehaus.plexus:plexus-utils:jar:1.4.1:runtime (removed - nearer found: 1.2)
[DEBUG]       org.codehaus.plexus:plexus-container-default:jar:1.0-alpha-9-stable-1:runtime (removed - nearer found: 1.0-alpha-8)
[DEBUG]     org.codehaus.plexus:plexus-utils:jar:1.4.1:runtime (removed - nearer found: 1.2)
[DEBUG]     org.apache.maven:maven-artifact:jar:2.0.6:runtime (selected for runtime)
[DEBUG]       org.codehaus.plexus:plexus-utils:jar:1.4.1:runtime (removed - nearer found: 1.2)
[DEBUG]     org.codehaus.plexus:plexus-container-default:jar:1.0-alpha-9-stable-1:runtime (removed - nearer found: 1.0-alpha-8)
[DEBUG]   org.apache.maven:maven-plugin-api:jar:2.0.6:runtime (selected for runtime)
[DEBUG]   org.apache.maven:maven-model:jar:2.0.6:runtime (selected for runtime)
[DEBUG]     org.codehaus.plexus:plexus-utils:jar:1.4.1:runtime (removed - nearer found: 1.2)
[DEBUG]   org.apache.maven:maven-artifact-manager:jar:2.0.6:runtime (selected for runtime)
[DEBUG]     org.apache.maven:maven-repository-metadata:jar:2.0.6:runtime (selected for runtime)
[DEBUG]       org.codehaus.plexus:plexus-utils:jar:1.4.1:runtime (removed - nearer found: 1.2)
[DEBUG]     org.codehaus.plexus:plexus-utils:jar:1.4.1:runtime (removed - nearer found: 1.2)
[DEBUG]     org.codehaus.plexus:plexus-container-default:jar:1.0-alpha-9-stable-1:runtime (removed - nearer found: 1.0-alpha-8)
[DEBUG]     org.apache.maven.wagon:wagon-provider-api:jar:1.0-beta-2:runtime (selected for runtime)
[DEBUG]       org.codehaus.plexus:plexus-utils:jar:1.0.4:runtime (removed - nearer found: 1.2)
[DEBUG]   org.apache.maven:maven-artifact:jar:2.0.6:runtime (selected for runtime)
[DEBUG]     org.codehaus.plexus:plexus-utils:jar:1.4.1:runtime (removed - nearer found: 1.2)
[DEBUG]   org.codehaus.plexus:plexus-utils:jar:1.2:runtime (removed - nearer found: 1.4.2)
[DEBUG]   org.codehaus.plexus:plexus-utils:jar:1.4.2:runtime (selected for runtime)
[DEBUG]   org.codehaus.plexus:plexus-interactivity-jline:jar:1.0-alpha-5:runtime (selected for runtime)
[DEBUG]     jline:jline:jar:0.9.1:runtime (selected for runtime)
[DEBUG]     org.codehaus.plexus:plexus-interactivity-api:jar:1.0-alpha-5:runtime (selected for runtime)
[DEBUG]   org.apache.maven:maven-archiver:jar:2.2:runtime (selected for runtime)
[DEBUG]     org.apache.maven:maven-project:jar:2.0:runtime (removed - nearer found: 2.0.6)
[DEBUG]     org.apache.maven:maven-artifact:jar:2.0:runtime (removed - nearer found: 2.0.6)
[DEBUG]   biz.aQute:bndlib:jar:0.0.145:runtime (selected for runtime)
[DEBUG] Using the following artifacts for classpath of: org.apache.maven.plugins:maven-eclipse-plugin:maven-plugin:2.5-SNAPSHOT:

[org.codehaus.plexus:plexus-interactivity-jline:jar:1.0-alpha-5:runtime
 org.codehaus.plexus:plexus-archiver:jar:1.0-alpha-7:runtime
 jline:jline:jar:0.9.1:runtime
 org.apache.maven:maven-archiver:jar:2.2:runtime
 biz.aQute:bndlib:jar:0.0.145:runtime
 org.codehaus.plexus:plexus-utils:jar:1.4.2:runtime]
[DEBUG] Realm already exists for: org.apache.maven.plugins:maven-eclipse-plugin. Skipping addition...
[DEBUG] In verifyVersionedPlugin for: org.apache.maven.plugins:maven-eclipse-plugin
[DEBUG] maven-eclipse-plugin: using locally installed snapshot
[DEBUG] org.apache.maven.plugins:maven-eclipse-plugin:maven-plugin:2.5-SNAPSHOT:runtime (selected for runtime)
[DEBUG]   org.codehaus.plexus:plexus-archiver:jar:1.0-alpha-7:runtime (selected for runtime)
[DEBUG]     org.codehaus.plexus:plexus-container-default:jar:1.0-alpha-8:runtime (selected for runtime)
[DEBUG]       org.codehaus.plexus:plexus-utils:jar:1.0.4:runtime (selected for runtime)
[DEBUG]       junit:junit:jar:3.8.1:runtime (selected for runtime)
[DEBUG]       classworlds:classworlds:jar:1.1-alpha-2:runtime (selected for runtime)
[DEBUG]     org.codehaus.plexus:plexus-utils:jar:1.0.4:runtime (removed - nearer found: 1.2)
[DEBUG]     org.codehaus.plexus:plexus-utils:jar:1.2:runtime (selected for runtime)
[DEBUG]   org.apache.maven:maven-project:jar:2.0.6:runtime (selected for runtime)
[DEBUG]     org.apache.maven:maven-settings:jar:2.0.6:runtime (selected for runtime)
[DEBUG]       org.apache.maven:maven-model:jar:2.0.6:runtime (selected for runtime)
[DEBUG]         org.codehaus.plexus:plexus-utils:jar:1.4.1:runtime (removed - nearer found: 1.2)
[DEBUG]       org.codehaus.plexus:plexus-utils:jar:1.4.1:runtime (removed - nearer found: 1.2)
[DEBUG]       org.codehaus.plexus:plexus-container-default:jar:1.0-alpha-9-stable-1:runtime (removed - nearer found: 1.0-alpha-8)
[DEBUG]     org.apache.maven:maven-profile:jar:2.0.6:runtime (selected for runtime)
[DEBUG]       org.codehaus.plexus:plexus-utils:jar:1.4.1:runtime (removed - nearer found: 1.2)
[DEBUG]       org.codehaus.plexus:plexus-container-default:jar:1.0-alpha-9-stable-1:runtime (removed - nearer found: 1.0-alpha-8)
[DEBUG]     org.apache.maven:maven-model:jar:2.0.6:runtime (selected for runtime)
[DEBUG]       org.codehaus.plexus:plexus-utils:jar:1.4.1:runtime (removed - nearer found: 1.2)
[DEBUG]     org.apache.maven:maven-artifact-manager:jar:2.0.6:runtime (selected for runtime)
[DEBUG]       org.apache.maven:maven-repository-metadata:jar:2.0.6:runtime (selected for runtime)
[DEBUG]         org.codehaus.plexus:plexus-utils:jar:1.4.1:runtime (removed - nearer found: 1.2)
[DEBUG]       org.codehaus.plexus:plexus-utils:jar:1.4.1:runtime (removed - nearer found: 1.2)
[DEBUG]       org.apache.maven:maven-artifact:jar:2.0.6:runtime (selected for runtime)
[DEBUG]         org.codehaus.plexus:plexus-utils:jar:1.4.1:runtime (removed - nearer found: 1.2)
[DEBUG]       org.codehaus.plexus:plexus-container-default:jar:1.0-alpha-9-stable-1:runtime (removed - nearer found: 1.0-alpha-8)
[DEBUG]       org.apache.maven.wagon:wagon-provider-api:jar:1.0-beta-2:runtime (selected for runtime)
[DEBUG]         org.codehaus.plexus:plexus-utils:jar:1.0.4:runtime (removed - nearer found: 1.2)
[DEBUG]     org.apache.maven:maven-plugin-registry:jar:2.0.6:runtime (selected for runtime)
[DEBUG]       org.codehaus.plexus:plexus-utils:jar:1.4.1:runtime (removed - nearer found: 1.2)
[DEBUG]       org.codehaus.plexus:plexus-container-default:jar:1.0-alpha-9-stable-1:runtime (removed - nearer found: 1.0-alpha-8)
[DEBUG]     org.codehaus.plexus:plexus-utils:jar:1.4.1:runtime (removed - nearer found: 1.2)
[DEBUG]     org.apache.maven:maven-artifact:jar:2.0.6:runtime (selected for runtime)
[DEBUG]       org.codehaus.plexus:plexus-utils:jar:1.4.1:runtime (removed - nearer found: 1.2)
[DEBUG]     org.codehaus.plexus:plexus-container-default:jar:1.0-alpha-9-stable-1:runtime (removed - nearer found: 1.0-alpha-8)
[DEBUG]   org.apache.maven:maven-plugin-api:jar:2.0.6:runtime (selected for runtime)
[DEBUG]   org.apache.maven:maven-model:jar:2.0.6:runtime (selected for runtime)
[DEBUG]     org.codehaus.plexus:plexus-utils:jar:1.4.1:runtime (removed - nearer found: 1.2)
[DEBUG]   org.apache.maven:maven-artifact-manager:jar:2.0.6:runtime (selected for runtime)
[DEBUG]     org.apache.maven:maven-repository-metadata:jar:2.0.6:runtime (selected for runtime)
[DEBUG]       org.codehaus.plexus:plexus-utils:jar:1.4.1:runtime (removed - nearer found: 1.2)
[DEBUG]     org.codehaus.plexus:plexus-utils:jar:1.4.1:runtime (removed - nearer found: 1.2)
[DEBUG]     org.codehaus.plexus:plexus-container-default:jar:1.0-alpha-9-stable-1:runtime (removed - nearer found: 1.0-alpha-8)
[DEBUG]     org.apache.maven.wagon:wagon-provider-api:jar:1.0-beta-2:runtime (selected for runtime)
[DEBUG]       org.codehaus.plexus:plexus-utils:jar:1.0.4:runtime (removed - nearer found: 1.2)
[DEBUG]   org.apache.maven:maven-artifact:jar:2.0.6:runtime (selected for runtime)
[DEBUG]     org.codehaus.plexus:plexus-utils:jar:1.4.1:runtime (removed - nearer found: 1.2)
[DEBUG]   org.codehaus.plexus:plexus-utils:jar:1.2:runtime (removed - nearer found: 1.4.2)
[DEBUG]   org.codehaus.plexus:plexus-utils:jar:1.4.2:runtime (selected for runtime)
[DEBUG]   org.codehaus.plexus:plexus-interactivity-jline:jar:1.0-alpha-5:runtime (selected for runtime)
[DEBUG]     jline:jline:jar:0.9.1:runtime (selected for runtime)
[DEBUG]     org.codehaus.plexus:plexus-interactivity-api:jar:1.0-alpha-5:runtime (selected for runtime)
[DEBUG]   org.apache.maven:maven-archiver:jar:2.2:runtime (selected for runtime)
[DEBUG]     org.apache.maven:maven-project:jar:2.0:runtime (removed - nearer found: 2.0.6)
[DEBUG]     org.apache.maven:maven-artifact:jar:2.0:runtime (removed - nearer found: 2.0.6)
[DEBUG]   biz.aQute:bndlib:jar:0.0.145:runtime (selected for runtime)
[DEBUG] Using the following artifacts for classpath of: org.apache.maven.plugins:maven-eclipse-plugin:maven-plugin:2.5-SNAPSHOT:

[org.codehaus.plexus:plexus-interactivity-jline:jar:1.0-alpha-5:runtime
 org.codehaus.plexus:plexus-archiver:jar:1.0-alpha-7:runtime
 jline:jline:jar:0.9.1:runtime
 org.apache.maven:maven-archiver:jar:2.2:runtime
 biz.aQute:bndlib:jar:0.0.145:runtime
 org.codehaus.plexus:plexus-utils:jar:1.4.2:runtime]
[DEBUG] Realm already exists for: org.apache.maven.plugins:maven-eclipse-plugin. Skipping addition...
[DEBUG] 

Our build plan is:

1. org.apache.maven.plugins:maven-eclipse-plugin:2.5-SNAPSHOT:eclipse [executionId: default]


[DEBUG] Mojo: eclipse has config:
null
[DEBUG] In verifyVersionedPlugin for: org.apache.maven.plugins:maven-eclipse-plugin
[DEBUG] maven-eclipse-plugin: using locally installed snapshot
[DEBUG] org.apache.maven.plugins:maven-eclipse-plugin:maven-plugin:2.5-SNAPSHOT:runtime (selected for runtime)
[DEBUG]   org.codehaus.plexus:plexus-archiver:jar:1.0-alpha-7:runtime (selected for runtime)
[DEBUG]     org.codehaus.plexus:plexus-container-default:jar:1.0-alpha-8:runtime (selected for runtime)
[DEBUG]       org.codehaus.plexus:plexus-utils:jar:1.0.4:runtime (selected for runtime)
[DEBUG]       junit:junit:jar:3.8.1:runtime (selected for runtime)
[DEBUG]       classworlds:classworlds:jar:1.1-alpha-2:runtime (selected for runtime)
[DEBUG]     org.codehaus.plexus:plexus-utils:jar:1.0.4:runtime (removed - nearer found: 1.2)
[DEBUG]     org.codehaus.plexus:plexus-utils:jar:1.2:runtime (selected for runtime)
[DEBUG]   org.apache.maven:maven-project:jar:2.0.6:runtime (selected for runtime)
[DEBUG]     org.apache.maven:maven-settings:jar:2.0.6:runtime (selected for runtime)
[DEBUG]       org.apache.maven:maven-model:jar:2.0.6:runtime (selected for runtime)
[DEBUG]         org.codehaus.plexus:plexus-utils:jar:1.4.1:runtime (removed - nearer found: 1.2)
[DEBUG]       org.codehaus.plexus:plexus-utils:jar:1.4.1:runtime (removed - nearer found: 1.2)
[DEBUG]       org.codehaus.plexus:plexus-container-default:jar:1.0-alpha-9-stable-1:runtime (removed - nearer found: 1.0-alpha-8)
[DEBUG]     org.apache.maven:maven-profile:jar:2.0.6:runtime (selected for runtime)
[DEBUG]       org.codehaus.plexus:plexus-utils:jar:1.4.1:runtime (removed - nearer found: 1.2)
[DEBUG]       org.codehaus.plexus:plexus-container-default:jar:1.0-alpha-9-stable-1:runtime (removed - nearer found: 1.0-alpha-8)
[DEBUG]     org.apache.maven:maven-model:jar:2.0.6:runtime (selected for runtime)
[DEBUG]       org.codehaus.plexus:plexus-utils:jar:1.4.1:runtime (removed - nearer found: 1.2)
[DEBUG]     org.apache.maven:maven-artifact-manager:jar:2.0.6:runtime (selected for runtime)
[DEBUG]       org.apache.maven:maven-repository-metadata:jar:2.0.6:runtime (selected for runtime)
[DEBUG]         org.codehaus.plexus:plexus-utils:jar:1.4.1:runtime (removed - nearer found: 1.2)
[DEBUG]       org.codehaus.plexus:plexus-utils:jar:1.4.1:runtime (removed - nearer found: 1.2)
[DEBUG]       org.apache.maven:maven-artifact:jar:2.0.6:runtime (selected for runtime)
[DEBUG]         org.codehaus.plexus:plexus-utils:jar:1.4.1:runtime (removed - nearer found: 1.2)
[DEBUG]       org.codehaus.plexus:plexus-container-default:jar:1.0-alpha-9-stable-1:runtime (removed - nearer found: 1.0-alpha-8)
[DEBUG]       org.apache.maven.wagon:wagon-provider-api:jar:1.0-beta-2:runtime (selected for runtime)
[DEBUG]         org.codehaus.plexus:plexus-utils:jar:1.0.4:runtime (removed - nearer found: 1.2)
[DEBUG]     org.apache.maven:maven-plugin-registry:jar:2.0.6:runtime (selected for runtime)
[DEBUG]       org.codehaus.plexus:plexus-utils:jar:1.4.1:runtime (removed - nearer found: 1.2)
[DEBUG]       org.codehaus.plexus:plexus-container-default:jar:1.0-alpha-9-stable-1:runtime (removed - nearer found: 1.0-alpha-8)
[DEBUG]     org.codehaus.plexus:plexus-utils:jar:1.4.1:runtime (removed - nearer found: 1.2)
[DEBUG]     org.apache.maven:maven-artifact:jar:2.0.6:runtime (selected for runtime)
[DEBUG]       org.codehaus.plexus:plexus-utils:jar:1.4.1:runtime (removed - nearer found: 1.2)
[DEBUG]     org.codehaus.plexus:plexus-container-default:jar:1.0-alpha-9-stable-1:runtime (removed - nearer found: 1.0-alpha-8)
[DEBUG]   org.apache.maven:maven-plugin-api:jar:2.0.6:runtime (selected for runtime)
[DEBUG]   org.apache.maven:maven-model:jar:2.0.6:runtime (selected for runtime)
[DEBUG]     org.codehaus.plexus:plexus-utils:jar:1.4.1:runtime (removed - nearer found: 1.2)
[DEBUG]   org.apache.maven:maven-artifact-manager:jar:2.0.6:runtime (selected for runtime)
[DEBUG]     org.apache.maven:maven-repository-metadata:jar:2.0.6:runtime (selected for runtime)
[DEBUG]       org.codehaus.plexus:plexus-utils:jar:1.4.1:runtime (removed - nearer found: 1.2)
[DEBUG]     org.codehaus.plexus:plexus-utils:jar:1.4.1:runtime (removed - nearer found: 1.2)
[DEBUG]     org.codehaus.plexus:plexus-container-default:jar:1.0-alpha-9-stable-1:runtime (removed - nearer found: 1.0-alpha-8)
[DEBUG]     org.apache.maven.wagon:wagon-provider-api:jar:1.0-beta-2:runtime (selected for runtime)
[DEBUG]       org.codehaus.plexus:plexus-utils:jar:1.0.4:runtime (removed - nearer found: 1.2)
[DEBUG]   org.apache.maven:maven-artifact:jar:2.0.6:runtime (selected for runtime)
[DEBUG]     org.codehaus.plexus:plexus-utils:jar:1.4.1:runtime (removed - nearer found: 1.2)
[DEBUG]   org.codehaus.plexus:plexus-utils:jar:1.2:runtime (removed - nearer found: 1.4.2)
[DEBUG]   org.codehaus.plexus:plexus-utils:jar:1.4.2:runtime (selected for runtime)
[DEBUG]   org.codehaus.plexus:plexus-interactivity-jline:jar:1.0-alpha-5:runtime (selected for runtime)
[DEBUG]     jline:jline:jar:0.9.1:runtime (selected for runtime)
[DEBUG]     org.codehaus.plexus:plexus-interactivity-api:jar:1.0-alpha-5:runtime (selected for runtime)
[DEBUG]   org.apache.maven:maven-archiver:jar:2.2:runtime (selected for runtime)
[DEBUG]     org.apache.maven:maven-project:jar:2.0:runtime (removed - nearer found: 2.0.6)
[DEBUG]     org.apache.maven:maven-artifact:jar:2.0:runtime (removed - nearer found: 2.0.6)
[DEBUG]   biz.aQute:bndlib:jar:0.0.145:runtime (selected for runtime)
[DEBUG] Using the following artifacts for classpath of: org.apache.maven.plugins:maven-eclipse-plugin:maven-plugin:2.5-SNAPSHOT:

[org.codehaus.plexus:plexus-interactivity-jline:jar:1.0-alpha-5:runtime
 org.codehaus.plexus:plexus-archiver:jar:1.0-alpha-7:runtime
 jline:jline:jar:0.9.1:runtime
 org.apache.maven:maven-archiver:jar:2.2:runtime
 biz.aQute:bndlib:jar:0.0.145:runtime
 org.codehaus.plexus:plexus-utils:jar:1.4.2:runtime]
[DEBUG] Realm already exists for: org.apache.maven.plugins:maven-eclipse-plugin. Skipping addition...
[DEBUG] Looking up mojo org.apache.maven.plugins:maven-eclipse-plugin:2.5-SNAPSHOT:eclipse in realm org.apache.maven.plugins:maven-eclipse-plugin - descRealmId=org.apache.maven.plugins:maven-eclipse-plugin
[DEBUG] Looked up - org.apache.maven.plugin.eclipse.EclipsePlugin@2da5a6 - ClassRealm[org.apache.maven.plugins:maven-eclipse-plugin, parent: ClassRealm[plexus.core, parent: null]]
[DEBUG] Configuring mojo 'org.apache.maven.plugins:maven-eclipse-plugin:2.5-SNAPSHOT:eclipse' -->
[DEBUG]   (s) addGroupIdToProjectName = false
[DEBUG]   (s) addVersionToProjectName = false
[DEBUG]   (s) buildOutputDirectory = /export/home/build/data/continuum/checkouts/486/target/eclipse-from-embedder/target/classes
[DEBUG]   (s) executedProject = org.apache.maven.project.MavenProject@9b4e89a9
[DEBUG]   (s) localRepository = [local] -> file:///export/home/build/.m2/repository
[DEBUG]   (f) manifest = /export/home/build/data/continuum/checkouts/486/target/eclipse-from-embedder/META-INF/MANIFEST.MF
[DEBUG]   (f) pde = false
[DEBUG]   (s) project = org.apache.maven.project.MavenProject@9b4e89a9
[DEBUG]   (s) reactorProjects = [org.apache.maven.project.MavenProject@9b4e89a9]
[DEBUG]   (s) remoteArtifactRepositories = [[central] -> http://repo1.maven.org/maven2]
[DEBUG]   (f) skip = false
[DEBUG]   (s) useProjectReferences = true
[DEBUG]   (f) wtpContextName = embedder-test-project
[DEBUG]   (s) wtpversion = none
[DEBUG] -- end configuration --
[INFO] [eclipse:eclipse]
[DEBUG] org.apache.maven:embedder-test-project:jar:1.0-SNAPSHOT (selected for null)
[DEBUG]   junit:junit:jar:3.8.1:test (selected for test)
[INFO] Using source status cache: /export/home/build/data/continuum/checkouts/486/target/eclipse-from-embedder/target/mvn-eclipse-cache.properties
[DEBUG] Searching for sources for junit:junit:3.8.1:null at junit:junit:3.8.1:sources
[DEBUG] Searching for sources for junit:junit:3.8.1:null at junit:junit:3.8.1:javadoc
[DEBUG] Processing resource dir: /export/home/build/data/continuum/checkouts/486/target/eclipse-from-embedder/src/main/resources
[DEBUG] Resource dir: /export/home/build/data/continuum/checkouts/486/target/eclipse-from-embedder/src/main/resources either missing or not a directory.
[DEBUG] testOutput toRelativeAndFixSeparator /export/home/build/data/continuum/checkouts/486/target/eclipse-from-embedder , /export/home/build/data/continuum/checkouts/486/target/eclipse-from-embedder/target/test-classes
[DEBUG] testOutput after toRelative : target/test-classes
[DEBUG] Processing resource dir: /export/home/build/data/continuum/checkouts/486/target/eclipse-from-embedder/src/test/resources
[DEBUG] Resource dir: /export/home/build/data/continuum/checkouts/486/target/eclipse-from-embedder/src/test/resources either missing or not a directory.
[INFO] Not writing settings - defaults suffice
[DEBUG] Processing source src/main/java: output=null; default output=target/classes
[DEBUG] Processing source src/test/java: output=target/test-classes; default output=target/classes
[INFO] Wrote Eclipse project for "embedder-test-project" to /export/home/build/data/continuum/checkouts/486/target/eclipse-from-embedder.
[INFO] 
       Sources for some artifacts are not available.
       Please run the same goal with the -DdownloadSources=true parameter in order to check remote repositories for sources.
       List of artifacts without a source archive:
         o junit:junit:3.8.1

       Javadoc for some artifacts is not available.
       Please run the same goal with the -DdownloadJavadoc=true parameter in order to check remote repositories for javadoc.
       List of artifacts without a javadoc archive:
         o junit:junit:3.8.1

Tests run: 1, Failures: 0, Errors: 0, Skipped: 0, Time elapsed: 5.222 sec
Running org.apache.maven.embedder.project.MavenEmbedderImportProjectTest
Tests run: 1, Failures: 0, Errors: 0, Skipped: 0, Time elapsed: 1.951 sec
Running org.apache.maven.embedder.MavenEmbedderBehaviorTest
Tests run: 1, Failures: 0, Errors: 0, Skipped: 0, Time elapsed: 1.112 sec
Running org.apache.maven.embedder.validation.ValidateConfigurationTest
Tests run: 4, Failures: 0, Errors: 0, Skipped: 0, Time elapsed: 0.682 sec
Running org.apache.maven.embedder.project.MavenEmbedderProjectNotInRepositoryTest
Tests run: 1, Failures: 0, Errors: 0, Skipped: 0, Time elapsed: 1.599 sec
Running org.apache.maven.cli.BatchModeDownloadMonitorTest
url = null://nullnull
Downloading: null://nullnull/null
97K downloaded
java.lang.RuntimeException
	at org.apache.maven.cli.AbstractConsoleDownloadMonitorTest.testTransferError(AbstractConsoleDownloadMonitorTest.java:75)
	at sun.reflect.NativeMethodAccessorImpl.invoke0(Native Method)
	at sun.reflect.NativeMethodAccessorImpl.invoke(NativeMethodAccessorImpl.java:39)
	at sun.reflect.DelegatingMethodAccessorImpl.invoke(DelegatingMethodAccessorImpl.java:25)
	at java.lang.reflect.Method.invoke(Method.java:585)
	at junit.framework.TestCase.runTest(TestCase.java:154)
	at junit.framework.TestCase.runBare(TestCase.java:127)
	at junit.framework.TestResult$1.protect(TestResult.java:106)
	at junit.framework.TestResult.runProtected(TestResult.java:124)
	at junit.framework.TestResult.run(TestResult.java:109)
	at junit.framework.TestCase.run(TestCase.java:118)
	at junit.framework.TestSuite.runTest(TestSuite.java:208)
	at junit.framework.TestSuite.run(TestSuite.java:203)
	at sun.reflect.NativeMethodAccessorImpl.invoke0(Native Method)
	at sun.reflect.NativeMethodAccessorImpl.invoke(NativeMethodAccessorImpl.java:39)
	at sun.reflect.DelegatingMethodAccessorImpl.invoke(DelegatingMethodAccessorImpl.java:25)
	at java.lang.reflect.Method.invoke(Method.java:585)
	at org.apache.maven.surefire.junit.JUnitTestSet.execute(JUnitTestSet.java:213)
	at org.apache.maven.surefire.suite.AbstractDirectoryTestSuite.executeTestSet(AbstractDirectoryTestSuite.java:138)
	at org.apache.maven.surefire.suite.AbstractDirectoryTestSuite.execute(AbstractDirectoryTestSuite.java:125)
	at org.apache.maven.surefire.Surefire.run(Surefire.java:132)
	at sun.reflect.NativeMethodAccessorImpl.invoke0(Native Method)
	at sun.reflect.NativeMethodAccessorImpl.invoke(NativeMethodAccessorImpl.java:39)
	at sun.reflect.DelegatingMethodAccessorImpl.invoke(DelegatingMethodAccessorImpl.java:25)
	at java.lang.reflect.Method.invoke(Method.java:585)
	at org.apache.maven.surefire.booter.SurefireBooter.runSuitesInProcess(SurefireBooter.java:290)
	at org.apache.maven.surefire.booter.SurefireBooter.main(SurefireBooter.java:818)
Tests run: 6, Failures: 0, Errors: 0, Skipped: 0, Time elapsed: 0.032 sec
Running org.apache.maven.embedder.MavenEmbedderTest
[INFO] Scanning for projects...
[INFO] ----------------------------------------------------------------------------
[INFO] Building Maven Quick Start Archetype
[INFO]    task-segment: [package]
[INFO] ----------------------------------------------------------------------------
[INFO] [resources:resources]
[INFO] Using default encoding to copy filtered resources.
[INFO] Resource directory does not exist: /export/home/build/data/continuum/checkouts/486/target/embedder-test-project0/src/main/resources
[INFO] [compiler:compile]
[INFO] Compiling 1 source file to /export/home/build/data/continuum/checkouts/486/target/embedder-test-project0/target/classes
[INFO] [resources:testResources]
[INFO] Using default encoding to copy filtered resources.
[INFO] Resource directory does not exist: /export/home/build/data/continuum/checkouts/486/target/embedder-test-project0/src/test/resources
[INFO] [compiler:testCompile]
[INFO] Compiling 1 source file to /export/home/build/data/continuum/checkouts/486/target/embedder-test-project0/target/test-classes
[INFO] [surefire:test]
[INFO] Surefire report directory: /export/home/build/data/continuum/checkouts/486/target/embedder-test-project0/target/surefire-reports

-------------------------------------------------------
 T E S T S
-------------------------------------------------------
Running org.apache.maven.AppTest
Tests run: 1, Failures: 0, Errors: 0, Skipped: 0, Time elapsed: 0.061 sec

Results :

Tests run: 1, Failures: 0, Errors: 0, Skipped: 0

[INFO] [jar:jar]
[INFO] Building jar: /export/home/build/data/continuum/checkouts/486/target/embedder-test-project0/target/embedder-test-project-1.0-SNAPSHOT.jar
[INFO] Scanning for projects...
[INFO] ----------------------------------------------------------------------------
[INFO] Building Maven Quick Start Archetype
[INFO]    task-segment: [package]
[INFO] ----------------------------------------------------------------------------
[INFO] [resources:resources]
[INFO] Using default encoding to copy filtered resources.
[INFO] Resource directory does not exist: /export/home/build/data/continuum/checkouts/486/target/embedder-test-project1/src/main/resources
[INFO] [compiler:compile]
[INFO] Compiling 1 source file to /export/home/build/data/continuum/checkouts/486/target/embedder-test-project1/target/classes
[INFO] [resources:testResources]
[INFO] Using default encoding to copy filtered resources.
[INFO] Resource directory does not exist: /export/home/build/data/continuum/checkouts/486/target/embedder-test-project1/src/test/resources
[INFO] [compiler:testCompile]
[INFO] Compiling 1 source file to /export/home/build/data/continuum/checkouts/486/target/embedder-test-project1/target/test-classes
[INFO] [surefire:test]
[INFO] Surefire report directory: /export/home/build/data/continuum/checkouts/486/target/embedder-test-project1/target/surefire-reports

-------------------------------------------------------
 T E S T S
-------------------------------------------------------
Running org.apache.maven.AppTest
Tests run: 1, Failures: 0, Errors: 0, Skipped: 0, Time elapsed: 0.043 sec

Results :

Tests run: 1, Failures: 0, Errors: 0, Skipped: 0

[INFO] [jar:jar]
[INFO] Building jar: /export/home/build/data/continuum/checkouts/486/target/embedder-test-project1/target/embedder-test-project-1.0-SNAPSHOT.jar
[INFO] Scanning for projects...
[INFO] ----------------------------------------------------------------------------
[INFO] Building Maven Quick Start Archetype
[INFO]    task-segment: [validate]
[INFO] ----------------------------------------------------------------------------
[INFO] Scanning for projects...
[INFO] ----------------------------------------------------------------------------
[INFO] Building Maven Quick Start Archetype
[INFO]    task-segment: [validate]
[INFO] ----------------------------------------------------------------------------
[INFO] Scanning for projects...
[INFO] ----------------------------------------------------------------------------
[INFO] Building Maven Quick Start Archetype
[INFO]    task-segment: [package]
[INFO] ----------------------------------------------------------------------------
[INFO] [resources:resources]
[INFO] Using default encoding to copy filtered resources.
[INFO] Resource directory does not exist: /export/home/build/data/continuum/checkouts/486/target/embedder-test-project-caching/src/main/resources
[INFO] [compiler:compile]
[INFO] Compiling 1 source file to /export/home/build/data/continuum/checkouts/486/target/embedder-test-project-caching/target/classes
[INFO] [resources:testResources]
[INFO] Using default encoding to copy filtered resources.
[INFO] Resource directory does not exist: /export/home/build/data/continuum/checkouts/486/target/embedder-test-project-caching/src/test/resources
[INFO] [compiler:testCompile]
[INFO] Compiling 1 source file to /export/home/build/data/continuum/checkouts/486/target/embedder-test-project-caching/target/test-classes
[INFO] [surefire:test]
[INFO] Surefire report directory: /export/home/build/data/continuum/checkouts/486/target/embedder-test-project-caching/target/surefire-reports

-------------------------------------------------------
 T E S T S
-------------------------------------------------------
Running org.apache.maven.AppTest
Tests run: 1, Failures: 0, Errors: 0, Skipped: 0, Time elapsed: 0.035 sec

Results :
Tests run: 1, Failures: 0, Errors: 0, Skipped: 0

[INFO] [jar:jar]
[INFO] Building jar: /export/home/build/data/continuum/checkouts/486/target/embedder-test-project-caching/target/embedder-test-project-1.0-SNAPSHOT.jar
[INFO] Scanning for projects...
[INFO] ----------------------------------------------------------------------------
[INFO] Building Maven Quick Start Archetype
[INFO]    task-segment: [package]
[INFO] ----------------------------------------------------------------------------
[INFO] [resources:resources]
[INFO] Using default encoding to copy filtered resources.
[INFO] Resource directory does not exist: /export/home/build/data/continuum/checkouts/486/target/embedder-test-project-caching/src/main/resources
[INFO] [compiler:compile]
[INFO] Nothing to compile - all classes are up to date
[INFO] [resources:testResources]
[INFO] Using default encoding to copy filtered resources.
[INFO] Resource directory does not exist: /export/home/build/data/continuum/checkouts/486/target/embedder-test-project-caching/src/test/resources
[INFO] [compiler:testCompile]
[INFO] Nothing to compile - all classes are up to date
[INFO] [surefire:test]
[INFO] Surefire report directory: /export/home/build/data/continuum/checkouts/486/target/embedder-test-project-caching/target/surefire-reports

-------------------------------------------------------
 T E S T S
-------------------------------------------------------
Running org.apache.maven.AppTest
Tests run: 1, Failures: 0, Errors: 0, Skipped: 0, Time elapsed: 0.04 sec

Results :
Tests run: 1, Failures: 0, Errors: 0, Skipped: 0

[INFO] [jar:jar]
[INFO] Building jar: /export/home/build/data/continuum/checkouts/486/target/embedder-test-project-caching/target/embedder-test-project-1.0-SNAPSHOT.jar
Tests run: 13, Failures: 0, Errors: 0, Skipped: 0, Time elapsed: 18.029 sec
Running org.apache.maven.embedder.execution.EmbedderUsingScmPluginTest
properties = {connectionUrl=scm:svn:http://svn.apache.org/repos/asf/maven/components/trunk/maven-embedder, outputDirectory=/export/home/build/data/continuum/checkouts/486/target/scm.diff}
[DEBUG] No settings files provided, and default locations are disabled for this request. Returning empty Settings instance.
[DEBUG] Pre-scanning POM lineage of: /export/home/build/data/continuum/checkouts/486/target/scm-plugin-from-embedder/pom.xml for build extensions.
[DEBUG] Building model-lineage for: /export/home/build/data/continuum/checkouts/486/target/scm-plugin-from-embedder/pom.xml to pre-scan for extensions.
[DEBUG] Checking: org.apache.maven:embedder-test-project:jar:1.0-SNAPSHOT for extensions. (It has 0 modules.)
[DEBUG] Basedir is: /export/home/build/data/continuum/checkouts/486/target/scm-plugin-from-embedder
[DEBUG] Finished pre-scanning: /export/home/build/data/continuum/checkouts/486/target/scm-plugin-from-embedder/pom.xml for build extensions.
[INFO] Searching repository for plugin with prefix: 'scm'.
[DEBUG] Loading plugin prefixes from group: org.apache.maven.plugins
[DEBUG] Loading plugin prefixes from group: org.codehaus.mojo
[DEBUG] Resolving version for plugin: org.apache.maven.plugins:maven-scm-plugin
[DEBUG] Version from POM: null
[DEBUG] Version from another POM in the reactor: null
[DEBUG] maven-scm-plugin: resolved to version 1.1-SNAPSHOT from local repository
[DEBUG] Skipping disabled repository central
[DEBUG] maven-scm-plugin: using locally installed snapshot
[DEBUG] Skipping disabled repository central
[DEBUG] maven-scm: using locally installed snapshot
[DEBUG] Version from LATEST metadata: 1.1-SNAPSHOT
[DEBUG] In verifyVersionedPlugin for: org.apache.maven.plugins:maven-scm-plugin
[DEBUG] maven-scm-plugin: using locally installed snapshot
[DEBUG] org.apache.maven.plugins:maven-scm-plugin:maven-plugin:1.1-SNAPSHOT:runtime (selected for runtime)
[DEBUG]   org.codehaus.plexus:plexus-utils:jar:1.1:runtime (selected for runtime)
[DEBUG]   org.apache.maven:maven-project:jar:2.0:runtime (selected for runtime)
[DEBUG]     org.apache.maven:maven-profile:jar:2.0:runtime (selected for runtime)
[DEBUG]       org.apache.maven:maven-model:jar:2.0:runtime (selected for runtime)
[DEBUG]         org.codehaus.plexus:plexus-utils:jar:1.0.4:runtime (removed - nearer found: 1.1)
[DEBUG]       org.codehaus.plexus:plexus-utils:jar:1.0.4:runtime (removed - nearer found: 1.1)
[DEBUG]       org.codehaus.plexus:plexus-container-default:jar:1.0-alpha-8:runtime (selected for runtime)
[DEBUG]         org.codehaus.plexus:plexus-utils:jar:1.0.4:runtime (removed - nearer found: 1.1)
[DEBUG]         junit:junit:jar:3.8.1:runtime (selected for runtime)
[DEBUG]         classworlds:classworlds:jar:1.1-alpha-2:runtime (selected for runtime)
[DEBUG]     org.apache.maven:maven-model:jar:2.0:runtime (selected for runtime)
[DEBUG]       org.codehaus.plexus:plexus-utils:jar:1.0.4:runtime (removed - nearer found: 1.1)
[DEBUG]     org.apache.maven:maven-artifact-manager:jar:2.0:runtime (selected for runtime)
[DEBUG]       org.apache.maven:maven-repository-metadata:jar:2.0:runtime (selected for runtime)
[DEBUG]         org.codehaus.plexus:plexus-utils:jar:1.0.4:runtime (removed - nearer found: 1.1)
[DEBUG]       org.codehaus.plexus:plexus-utils:jar:1.0.4:runtime (removed - nearer found: 1.1)
[DEBUG]       org.apache.maven:maven-artifact:jar:2.0:runtime (selected for runtime)
[DEBUG]         org.codehaus.plexus:plexus-utils:jar:1.0.4:runtime (removed - nearer found: 1.1)
[DEBUG]       org.apache.maven.wagon:wagon-provider-api:jar:1.0-alpha-5:runtime (selected for runtime)
[DEBUG]         org.codehaus.plexus:plexus-utils:jar:1.0.4:runtime (removed - nearer found: 1.1)
[DEBUG]     org.codehaus.plexus:plexus-utils:jar:1.0.4:runtime (removed - nearer found: 1.1)
[DEBUG]     org.apache.maven:maven-artifact:jar:2.0:runtime (selected for runtime)
[DEBUG]       org.codehaus.plexus:plexus-utils:jar:1.0.4:runtime (removed - nearer found: 1.1)
[DEBUG]     org.codehaus.plexus:plexus-container-default:jar:1.0-alpha-8:runtime (selected for runtime)
[DEBUG]       org.codehaus.plexus:plexus-utils:jar:1.0.4:runtime (removed - nearer found: 1.1)
[DEBUG]       junit:junit:jar:3.8.1:runtime (selected for runtime)
[DEBUG]       classworlds:classworlds:jar:1.1-alpha-2:runtime (selected for runtime)
[DEBUG] Adding managed dependencies for unknown:maven-settings
[DEBUG]   org.codehaus.plexus:plexus-container-default:jar:1.0-alpha-8
[DEBUG]   org.codehaus.plexus:plexus-utils:jar:1.0.4
[DEBUG]   org.apache.maven.wagon:wagon-provider-api:jar:1.0-alpha-5
[DEBUG]   org.apache.maven.wagon:wagon-ssh:jar:1.0-alpha-5
[DEBUG]   org.apache.maven.wagon:wagon-file:jar:1.0-alpha-5
[DEBUG]   org.apache.maven.wagon:wagon-http-lightweight:jar:1.0-alpha-5
[DEBUG]   org.apache.maven:maven-settings:jar:2.0:runtime (selected for runtime)
[DEBUG]     org.codehaus.plexus:plexus-utils:jar:1.0.4:runtime (removed - nearer found: 1.1)
[DEBUG]   org.apache.maven:maven-plugin-api:jar:2.0:runtime (selected for runtime)
[DEBUG]   org.apache.maven.scm:maven-scm-manager-plexus:jar:1.0:runtime (selected for runtime)
[DEBUG]     org.apache.maven.scm:maven-scm-api:jar:1.0:runtime (selected for runtime)
[DEBUG]     org.codehaus.plexus:plexus-container-default:jar:1.0-alpha-9:runtime (removed - nearer found: 1.0-alpha-8)
[DEBUG]   org.apache.maven.scm:maven-scm-provider-bazaar:jar:1.0:runtime (selected for runtime)
[DEBUG]     regexp:regexp:jar:1.3:runtime (selected for runtime)
[DEBUG]     org.codehaus.plexus:plexus-container-default:jar:1.0-alpha-7:runtime (removed - nearer found: 1.0-alpha-8)
[DEBUG]   org.apache.maven.scm:maven-scm-provider-clearcase:jar:1.0:runtime (selected for runtime)
[DEBUG]   org.apache.maven.scm:maven-scm-provider-cvsexe:jar:1.0:runtime (selected for runtime)
[DEBUG]     org.apache.maven.scm:maven-scm-provider-cvs-commons:jar:1.0:runtime (selected for runtime)
[DEBUG]   org.apache.maven.scm:maven-scm-provider-cvsjava:jar:1.0:runtime (selected for runtime)
[DEBUG]     org.netbeans.lib:cvsclient:jar:20060125:runtime (selected for runtime)
[DEBUG]     ch.ethz.ganymed:ganymed-ssh2:jar:build210:runtime (selected for runtime)
[DEBUG]   org.apache.maven.scm:maven-scm-provider-hg:jar:1.0:runtime (selected for runtime)
[DEBUG]   org.apache.maven.scm:maven-scm-provider-local:jar:1.0:runtime (selected for runtime)
[DEBUG]   org.apache.maven.scm:maven-scm-provider-perforce:jar:1.0:runtime (selected for runtime)
[DEBUG]   org.apache.maven.scm:maven-scm-provider-starteam:jar:1.0:runtime (selected for runtime)
[DEBUG]   org.apache.maven.scm:maven-scm-provider-svnexe:jar:1.0:runtime (selected for runtime)
[DEBUG]     org.apache.maven.scm:maven-scm-provider-svn-commons:jar:1.0:runtime (selected for runtime)
[DEBUG]   org.apache.maven.scm:maven-scm-provider-synergy:jar:1.0:runtime (selected for runtime)
[DEBUG]   org.apache.maven.scm:maven-scm-provider-vss:jar:1.0:runtime (selected for runtime)
[DEBUG] Using the following artifacts for classpath of: org.apache.maven.plugins:maven-scm-plugin:maven-plugin:1.1-SNAPSHOT:

[org.apache.maven.scm:maven-scm-api:jar:1.0:runtime
 org.apache.maven.scm:maven-scm-provider-cvsexe:jar:1.0:runtime
 org.netbeans.lib:cvsclient:jar:20060125:runtime
 org.apache.maven.scm:maven-scm-manager-plexus:jar:1.0:runtime
 org.codehaus.plexus:plexus-utils:jar:1.1:runtime
 org.apache.maven.scm:maven-scm-provider-hg:jar:1.0:runtime
 org.apache.maven.scm:maven-scm-provider-bazaar:jar:1.0:runtime
 org.apache.maven.scm:maven-scm-provider-starteam:jar:1.0:runtime
 org.apache.maven.scm:maven-scm-provider-local:jar:1.0:runtime
 org.apache.maven.scm:maven-scm-provider-cvsjava:jar:1.0:runtime
 org.apache.maven.scm:maven-scm-provider-svnexe:jar:1.0:runtime
 org.apache.maven.scm:maven-scm-provider-synergy:jar:1.0:runtime
 org.apache.maven.scm:maven-scm-provider-clearcase:jar:1.0:runtime
 org.apache.maven.scm:maven-scm-provider-svn-commons:jar:1.0:runtime
 ch.ethz.ganymed:ganymed-ssh2:jar:build210:runtime
 org.apache.maven.scm:maven-scm-provider-perforce:jar:1.0:runtime
 org.apache.maven.scm:maven-scm-provider-vss:jar:1.0:runtime
 org.apache.maven.scm:maven-scm-provider-cvs-commons:jar:1.0:runtime
 regexp:regexp:jar:1.3:runtime]
[DEBUG] Checking for plugin descriptor for: org.apache.maven.plugins:maven-scm-plugin in collector: org.apache.maven.plugin.MavenPluginCollector@176d662
[DEBUG] Realm for plugin: org.apache.maven.plugins:maven-scm-plugin:
ClassRealm[org.apache.maven.plugins:maven-scm-plugin, parent: ClassRealm[plexus.core, parent: null]]
[DEBUG] In verifyVersionedPlugin for: org.apache.maven.plugins:maven-scm-plugin
[DEBUG] maven-scm-plugin: using locally installed snapshot
[DEBUG] org.apache.maven.plugins:maven-scm-plugin:maven-plugin:1.1-SNAPSHOT:runtime (selected for runtime)
[DEBUG]   org.codehaus.plexus:plexus-utils:jar:1.1:runtime (selected for runtime)
[DEBUG]   org.apache.maven:maven-project:jar:2.0:runtime (selected for runtime)
[DEBUG]     org.apache.maven:maven-profile:jar:2.0:runtime (selected for runtime)
[DEBUG]       org.apache.maven:maven-model:jar:2.0:runtime (selected for runtime)
[DEBUG]         org.codehaus.plexus:plexus-utils:jar:1.0.4:runtime (removed - nearer found: 1.1)
[DEBUG]       org.codehaus.plexus:plexus-utils:jar:1.0.4:runtime (removed - nearer found: 1.1)
[DEBUG]       org.codehaus.plexus:plexus-container-default:jar:1.0-alpha-8:runtime (selected for runtime)
[DEBUG]         org.codehaus.plexus:plexus-utils:jar:1.0.4:runtime (removed - nearer found: 1.1)
[DEBUG]         junit:junit:jar:3.8.1:runtime (selected for runtime)
[DEBUG]         classworlds:classworlds:jar:1.1-alpha-2:runtime (selected for runtime)
[DEBUG]     org.apache.maven:maven-model:jar:2.0:runtime (selected for runtime)
[DEBUG]       org.codehaus.plexus:plexus-utils:jar:1.0.4:runtime (removed - nearer found: 1.1)
[DEBUG]     org.apache.maven:maven-artifact-manager:jar:2.0:runtime (selected for runtime)
[DEBUG]       org.apache.maven:maven-repository-metadata:jar:2.0:runtime (selected for runtime)
[DEBUG]         org.codehaus.plexus:plexus-utils:jar:1.0.4:runtime (removed - nearer found: 1.1)
[DEBUG]       org.codehaus.plexus:plexus-utils:jar:1.0.4:runtime (removed - nearer found: 1.1)
[DEBUG]       org.apache.maven:maven-artifact:jar:2.0:runtime (selected for runtime)
[DEBUG]         org.codehaus.plexus:plexus-utils:jar:1.0.4:runtime (removed - nearer found: 1.1)
[DEBUG]       org.apache.maven.wagon:wagon-provider-api:jar:1.0-alpha-5:runtime (selected for runtime)
[DEBUG]         org.codehaus.plexus:plexus-utils:jar:1.0.4:runtime (removed - nearer found: 1.1)
[DEBUG]     org.codehaus.plexus:plexus-utils:jar:1.0.4:runtime (removed - nearer found: 1.1)
[DEBUG]     org.apache.maven:maven-artifact:jar:2.0:runtime (selected for runtime)
[DEBUG]       org.codehaus.plexus:plexus-utils:jar:1.0.4:runtime (removed - nearer found: 1.1)
[DEBUG]     org.codehaus.plexus:plexus-container-default:jar:1.0-alpha-8:runtime (selected for runtime)
[DEBUG]       org.codehaus.plexus:plexus-utils:jar:1.0.4:runtime (removed - nearer found: 1.1)
[DEBUG]       junit:junit:jar:3.8.1:runtime (selected for runtime)
[DEBUG]       classworlds:classworlds:jar:1.1-alpha-2:runtime (selected for runtime)
[DEBUG]   org.apache.maven:maven-settings:jar:2.0:runtime (selected for runtime)
[DEBUG]     org.codehaus.plexus:plexus-utils:jar:1.0.4:runtime (removed - nearer found: 1.1)
[DEBUG]   org.apache.maven:maven-plugin-api:jar:2.0:runtime (selected for runtime)
[DEBUG]   org.apache.maven.scm:maven-scm-manager-plexus:jar:1.0:runtime (selected for runtime)
[DEBUG]     org.apache.maven.scm:maven-scm-api:jar:1.0:runtime (selected for runtime)
[DEBUG]     org.codehaus.plexus:plexus-container-default:jar:1.0-alpha-9:runtime (removed - nearer found: 1.0-alpha-8)
[DEBUG]   org.apache.maven.scm:maven-scm-provider-bazaar:jar:1.0:runtime (selected for runtime)
[DEBUG]     regexp:regexp:jar:1.3:runtime (selected for runtime)
[DEBUG]     org.codehaus.plexus:plexus-container-default:jar:1.0-alpha-7:runtime (removed - nearer found: 1.0-alpha-8)
[DEBUG]   org.apache.maven.scm:maven-scm-provider-clearcase:jar:1.0:runtime (selected for runtime)
[DEBUG]   org.apache.maven.scm:maven-scm-provider-cvsexe:jar:1.0:runtime (selected for runtime)
[DEBUG]     org.apache.maven.scm:maven-scm-provider-cvs-commons:jar:1.0:runtime (selected for runtime)
[DEBUG]   org.apache.maven.scm:maven-scm-provider-cvsjava:jar:1.0:runtime (selected for runtime)
[DEBUG]     org.netbeans.lib:cvsclient:jar:20060125:runtime (selected for runtime)
[DEBUG]     ch.ethz.ganymed:ganymed-ssh2:jar:build210:runtime (selected for runtime)
[DEBUG]   org.apache.maven.scm:maven-scm-provider-hg:jar:1.0:runtime (selected for runtime)
[DEBUG]   org.apache.maven.scm:maven-scm-provider-local:jar:1.0:runtime (selected for runtime)
[DEBUG]   org.apache.maven.scm:maven-scm-provider-perforce:jar:1.0:runtime (selected for runtime)
[DEBUG]   org.apache.maven.scm:maven-scm-provider-starteam:jar:1.0:runtime (selected for runtime)
[DEBUG]   org.apache.maven.scm:maven-scm-provider-svnexe:jar:1.0:runtime (selected for runtime)
[DEBUG]     org.apache.maven.scm:maven-scm-provider-svn-commons:jar:1.0:runtime (selected for runtime)
[DEBUG]   org.apache.maven.scm:maven-scm-provider-synergy:jar:1.0:runtime (selected for runtime)
[DEBUG]   org.apache.maven.scm:maven-scm-provider-vss:jar:1.0:runtime (selected for runtime)
[DEBUG] Using the following artifacts for classpath of: org.apache.maven.plugins:maven-scm-plugin:maven-plugin:1.1-SNAPSHOT:

[org.apache.maven.scm:maven-scm-api:jar:1.0:runtime
 org.apache.maven.scm:maven-scm-provider-cvsexe:jar:1.0:runtime
 org.netbeans.lib:cvsclient:jar:20060125:runtime
 org.apache.maven.scm:maven-scm-manager-plexus:jar:1.0:runtime
 org.codehaus.plexus:plexus-utils:jar:1.1:runtime
 org.apache.maven.scm:maven-scm-provider-hg:jar:1.0:runtime
 org.apache.maven.scm:maven-scm-provider-bazaar:jar:1.0:runtime
 org.apache.maven.scm:maven-scm-provider-starteam:jar:1.0:runtime
 org.apache.maven.scm:maven-scm-provider-local:jar:1.0:runtime
 org.apache.maven.scm:maven-scm-provider-cvsjava:jar:1.0:runtime
 org.apache.maven.scm:maven-scm-provider-svnexe:jar:1.0:runtime
 org.apache.maven.scm:maven-scm-provider-synergy:jar:1.0:runtime
 org.apache.maven.scm:maven-scm-provider-clearcase:jar:1.0:runtime
 org.apache.maven.scm:maven-scm-provider-svn-commons:jar:1.0:runtime
 ch.ethz.ganymed:ganymed-ssh2:jar:build210:runtime
 org.apache.maven.scm:maven-scm-provider-perforce:jar:1.0:runtime
 org.apache.maven.scm:maven-scm-provider-vss:jar:1.0:runtime
 org.apache.maven.scm:maven-scm-provider-cvs-commons:jar:1.0:runtime
 regexp:regexp:jar:1.3:runtime]
[DEBUG] Realm already exists for: org.apache.maven.plugins:maven-scm-plugin. Skipping addition...
[INFO] Scanning for projects...
[DEBUG] In verifyVersionedPlugin for: org.apache.maven.plugins:maven-scm-plugin
[DEBUG] maven-scm-plugin: using locally installed snapshot
[DEBUG] org.apache.maven.plugins:maven-scm-plugin:maven-plugin:1.1-SNAPSHOT:runtime (selected for runtime)
[DEBUG]   org.codehaus.plexus:plexus-utils:jar:1.1:runtime (selected for runtime)
[DEBUG]   org.apache.maven:maven-project:jar:2.0:runtime (selected for runtime)
[DEBUG]     org.apache.maven:maven-profile:jar:2.0:runtime (selected for runtime)
[DEBUG]       org.apache.maven:maven-model:jar:2.0:runtime (selected for runtime)
[DEBUG]         org.codehaus.plexus:plexus-utils:jar:1.0.4:runtime (removed - nearer found: 1.1)
[DEBUG]       org.codehaus.plexus:plexus-utils:jar:1.0.4:runtime (removed - nearer found: 1.1)
[DEBUG]       org.codehaus.plexus:plexus-container-default:jar:1.0-alpha-8:runtime (selected for runtime)
[DEBUG]         org.codehaus.plexus:plexus-utils:jar:1.0.4:runtime (removed - nearer found: 1.1)
[DEBUG]         junit:junit:jar:3.8.1:runtime (selected for runtime)
[DEBUG]         classworlds:classworlds:jar:1.1-alpha-2:runtime (selected for runtime)
[DEBUG]     org.apache.maven:maven-model:jar:2.0:runtime (selected for runtime)
[DEBUG]       org.codehaus.plexus:plexus-utils:jar:1.0.4:runtime (removed - nearer found: 1.1)
[DEBUG]     org.apache.maven:maven-artifact-manager:jar:2.0:runtime (selected for runtime)
[DEBUG]       org.apache.maven:maven-repository-metadata:jar:2.0:runtime (selected for runtime)
[DEBUG]         org.codehaus.plexus:plexus-utils:jar:1.0.4:runtime (removed - nearer found: 1.1)
[DEBUG]       org.codehaus.plexus:plexus-utils:jar:1.0.4:runtime (removed - nearer found: 1.1)
[DEBUG]       org.apache.maven:maven-artifact:jar:2.0:runtime (selected for runtime)
[DEBUG]         org.codehaus.plexus:plexus-utils:jar:1.0.4:runtime (removed - nearer found: 1.1)
[DEBUG]       org.apache.maven.wagon:wagon-provider-api:jar:1.0-alpha-5:runtime (selected for runtime)
[DEBUG]         org.codehaus.plexus:plexus-utils:jar:1.0.4:runtime (removed - nearer found: 1.1)
[DEBUG]     org.codehaus.plexus:plexus-utils:jar:1.0.4:runtime (removed - nearer found: 1.1)
[DEBUG]     org.apache.maven:maven-artifact:jar:2.0:runtime (selected for runtime)
[DEBUG]       org.codehaus.plexus:plexus-utils:jar:1.0.4:runtime (removed - nearer found: 1.1)
[DEBUG]     org.codehaus.plexus:plexus-container-default:jar:1.0-alpha-8:runtime (selected for runtime)
[DEBUG]       org.codehaus.plexus:plexus-utils:jar:1.0.4:runtime (removed - nearer found: 1.1)
[DEBUG]       junit:junit:jar:3.8.1:runtime (selected for runtime)
[DEBUG]       classworlds:classworlds:jar:1.1-alpha-2:runtime (selected for runtime)
[DEBUG]   org.apache.maven:maven-settings:jar:2.0:runtime (selected for runtime)
[DEBUG]     org.codehaus.plexus:plexus-utils:jar:1.0.4:runtime (removed - nearer found: 1.1)
[DEBUG]   org.apache.maven:maven-plugin-api:jar:2.0:runtime (selected for runtime)
[DEBUG]   org.apache.maven.scm:maven-scm-manager-plexus:jar:1.0:runtime (selected for runtime)
[DEBUG]     org.apache.maven.scm:maven-scm-api:jar:1.0:runtime (selected for runtime)
[DEBUG]     org.codehaus.plexus:plexus-container-default:jar:1.0-alpha-9:runtime (removed - nearer found: 1.0-alpha-8)
[DEBUG]   org.apache.maven.scm:maven-scm-provider-bazaar:jar:1.0:runtime (selected for runtime)
[DEBUG]     regexp:regexp:jar:1.3:runtime (selected for runtime)
[DEBUG]     org.codehaus.plexus:plexus-container-default:jar:1.0-alpha-7:runtime (removed - nearer found: 1.0-alpha-8)
[DEBUG]   org.apache.maven.scm:maven-scm-provider-clearcase:jar:1.0:runtime (selected for runtime)
[DEBUG]   org.apache.maven.scm:maven-scm-provider-cvsexe:jar:1.0:runtime (selected for runtime)
[DEBUG]     org.apache.maven.scm:maven-scm-provider-cvs-commons:jar:1.0:runtime (selected for runtime)
[DEBUG]   org.apache.maven.scm:maven-scm-provider-cvsjava:jar:1.0:runtime (selected for runtime)
[DEBUG]     org.netbeans.lib:cvsclient:jar:20060125:runtime (selected for runtime)
[DEBUG]     ch.ethz.ganymed:ganymed-ssh2:jar:build210:runtime (selected for runtime)
[DEBUG]   org.apache.maven.scm:maven-scm-provider-hg:jar:1.0:runtime (selected for runtime)
[DEBUG]   org.apache.maven.scm:maven-scm-provider-local:jar:1.0:runtime (selected for runtime)
[DEBUG]   org.apache.maven.scm:maven-scm-provider-perforce:jar:1.0:runtime (selected for runtime)
[DEBUG]   org.apache.maven.scm:maven-scm-provider-starteam:jar:1.0:runtime (selected for runtime)
[DEBUG]   org.apache.maven.scm:maven-scm-provider-svnexe:jar:1.0:runtime (selected for runtime)
[DEBUG]     org.apache.maven.scm:maven-scm-provider-svn-commons:jar:1.0:runtime (selected for runtime)
[DEBUG]   org.apache.maven.scm:maven-scm-provider-synergy:jar:1.0:runtime (selected for runtime)
[DEBUG]   org.apache.maven.scm:maven-scm-provider-vss:jar:1.0:runtime (selected for runtime)
[DEBUG] Using the following artifacts for classpath of: org.apache.maven.plugins:maven-scm-plugin:maven-plugin:1.1-SNAPSHOT:

[org.apache.maven.scm:maven-scm-api:jar:1.0:runtime
 org.apache.maven.scm:maven-scm-provider-cvsexe:jar:1.0:runtime
 org.netbeans.lib:cvsclient:jar:20060125:runtime
 org.apache.maven.scm:maven-scm-manager-plexus:jar:1.0:runtime
 org.codehaus.plexus:plexus-utils:jar:1.1:runtime
 org.apache.maven.scm:maven-scm-provider-hg:jar:1.0:runtime
 org.apache.maven.scm:maven-scm-provider-bazaar:jar:1.0:runtime
 org.apache.maven.scm:maven-scm-provider-starteam:jar:1.0:runtime
 org.apache.maven.scm:maven-scm-provider-local:jar:1.0:runtime
 org.apache.maven.scm:maven-scm-provider-cvsjava:jar:1.0:runtime
 org.apache.maven.scm:maven-scm-provider-svnexe:jar:1.0:runtime
 org.apache.maven.scm:maven-scm-provider-synergy:jar:1.0:runtime
 org.apache.maven.scm:maven-scm-provider-clearcase:jar:1.0:runtime
 org.apache.maven.scm:maven-scm-provider-svn-commons:jar:1.0:runtime
 ch.ethz.ganymed:ganymed-ssh2:jar:build210:runtime
 org.apache.maven.scm:maven-scm-provider-perforce:jar:1.0:runtime
 org.apache.maven.scm:maven-scm-provider-vss:jar:1.0:runtime
 org.apache.maven.scm:maven-scm-provider-cvs-commons:jar:1.0:runtime
 regexp:regexp:jar:1.3:runtime]
[DEBUG] Realm already exists for: org.apache.maven.plugins:maven-scm-plugin. Skipping addition...
[INFO] ----------------------------------------------------------------------------
[INFO] Building Maven Quick Start Archetype
[INFO]    task-segment: [scm:diff] (aggregator-style)
[INFO] ----------------------------------------------------------------------------
[DEBUG] Constructing build plan for org.apache.maven:embedder-test-project:jar:1.0-SNAPSHOT (  task-segment: [scm:diff] (aggregator-style) )
[WARNING] Assuming that mojo: 'scm:diff' does NOT need configuration from the <reporting /> section of the POM.
[DEBUG] In verifyVersionedPlugin for: org.apache.maven.plugins:maven-scm-plugin
[DEBUG] maven-scm-plugin: using locally installed snapshot
[DEBUG] org.apache.maven.plugins:maven-scm-plugin:maven-plugin:1.1-SNAPSHOT:runtime (selected for runtime)
[DEBUG]   org.codehaus.plexus:plexus-utils:jar:1.1:runtime (selected for runtime)
[DEBUG]   org.apache.maven:maven-project:jar:2.0:runtime (selected for runtime)
[DEBUG]     org.apache.maven:maven-profile:jar:2.0:runtime (selected for runtime)
[DEBUG]       org.apache.maven:maven-model:jar:2.0:runtime (selected for runtime)
[DEBUG]         org.codehaus.plexus:plexus-utils:jar:1.0.4:runtime (removed - nearer found: 1.1)
[DEBUG]       org.codehaus.plexus:plexus-utils:jar:1.0.4:runtime (removed - nearer found: 1.1)
[DEBUG]       org.codehaus.plexus:plexus-container-default:jar:1.0-alpha-8:runtime (selected for runtime)
[DEBUG]         org.codehaus.plexus:plexus-utils:jar:1.0.4:runtime (removed - nearer found: 1.1)
[DEBUG]         junit:junit:jar:3.8.1:runtime (selected for runtime)
[DEBUG]         classworlds:classworlds:jar:1.1-alpha-2:runtime (selected for runtime)
[DEBUG]     org.apache.maven:maven-model:jar:2.0:runtime (selected for runtime)
[DEBUG]       org.codehaus.plexus:plexus-utils:jar:1.0.4:runtime (removed - nearer found: 1.1)
[DEBUG]     org.apache.maven:maven-artifact-manager:jar:2.0:runtime (selected for runtime)
[DEBUG]       org.apache.maven:maven-repository-metadata:jar:2.0:runtime (selected for runtime)
[DEBUG]         org.codehaus.plexus:plexus-utils:jar:1.0.4:runtime (removed - nearer found: 1.1)
[DEBUG]       org.codehaus.plexus:plexus-utils:jar:1.0.4:runtime (removed - nearer found: 1.1)
[DEBUG]       org.apache.maven:maven-artifact:jar:2.0:runtime (selected for runtime)
[DEBUG]         org.codehaus.plexus:plexus-utils:jar:1.0.4:runtime (removed - nearer found: 1.1)
[DEBUG]       org.apache.maven.wagon:wagon-provider-api:jar:1.0-alpha-5:runtime (selected for runtime)
[DEBUG]         org.codehaus.plexus:plexus-utils:jar:1.0.4:runtime (removed - nearer found: 1.1)
[DEBUG]     org.codehaus.plexus:plexus-utils:jar:1.0.4:runtime (removed - nearer found: 1.1)
[DEBUG]     org.apache.maven:maven-artifact:jar:2.0:runtime (selected for runtime)
[DEBUG]       org.codehaus.plexus:plexus-utils:jar:1.0.4:runtime (removed - nearer found: 1.1)
[DEBUG]     org.codehaus.plexus:plexus-container-default:jar:1.0-alpha-8:runtime (selected for runtime)
[DEBUG]       org.codehaus.plexus:plexus-utils:jar:1.0.4:runtime (removed - nearer found: 1.1)
[DEBUG]       junit:junit:jar:3.8.1:runtime (selected for runtime)
[DEBUG]       classworlds:classworlds:jar:1.1-alpha-2:runtime (selected for runtime)
[DEBUG]   org.apache.maven:maven-settings:jar:2.0:runtime (selected for runtime)
[DEBUG]     org.codehaus.plexus:plexus-utils:jar:1.0.4:runtime (removed - nearer found: 1.1)
[DEBUG]   org.apache.maven:maven-plugin-api:jar:2.0:runtime (selected for runtime)
[DEBUG]   org.apache.maven.scm:maven-scm-manager-plexus:jar:1.0:runtime (selected for runtime)
[DEBUG]     org.apache.maven.scm:maven-scm-api:jar:1.0:runtime (selected for runtime)
[DEBUG]     org.codehaus.plexus:plexus-container-default:jar:1.0-alpha-9:runtime (removed - nearer found: 1.0-alpha-8)
[DEBUG]   org.apache.maven.scm:maven-scm-provider-bazaar:jar:1.0:runtime (selected for runtime)
[DEBUG]     regexp:regexp:jar:1.3:runtime (selected for runtime)
[DEBUG]     org.codehaus.plexus:plexus-container-default:jar:1.0-alpha-7:runtime (removed - nearer found: 1.0-alpha-8)
[DEBUG]   org.apache.maven.scm:maven-scm-provider-clearcase:jar:1.0:runtime (selected for runtime)
[DEBUG]   org.apache.maven.scm:maven-scm-provider-cvsexe:jar:1.0:runtime (selected for runtime)
[DEBUG]     org.apache.maven.scm:maven-scm-provider-cvs-commons:jar:1.0:runtime (selected for runtime)
[DEBUG]   org.apache.maven.scm:maven-scm-provider-cvsjava:jar:1.0:runtime (selected for runtime)
[DEBUG]     org.netbeans.lib:cvsclient:jar:20060125:runtime (selected for runtime)
[DEBUG]     ch.ethz.ganymed:ganymed-ssh2:jar:build210:runtime (selected for runtime)
[DEBUG]   org.apache.maven.scm:maven-scm-provider-hg:jar:1.0:runtime (selected for runtime)
[DEBUG]   org.apache.maven.scm:maven-scm-provider-local:jar:1.0:runtime (selected for runtime)
[DEBUG]   org.apache.maven.scm:maven-scm-provider-perforce:jar:1.0:runtime (selected for runtime)
[DEBUG]   org.apache.maven.scm:maven-scm-provider-starteam:jar:1.0:runtime (selected for runtime)
[DEBUG]   org.apache.maven.scm:maven-scm-provider-svnexe:jar:1.0:runtime (selected for runtime)
[DEBUG]     org.apache.maven.scm:maven-scm-provider-svn-commons:jar:1.0:runtime (selected for runtime)
[DEBUG]   org.apache.maven.scm:maven-scm-provider-synergy:jar:1.0:runtime (selected for runtime)
[DEBUG]   org.apache.maven.scm:maven-scm-provider-vss:jar:1.0:runtime (selected for runtime)
[DEBUG] Using the following artifacts for classpath of: org.apache.maven.plugins:maven-scm-plugin:maven-plugin:1.1-SNAPSHOT:

[org.apache.maven.scm:maven-scm-api:jar:1.0:runtime
 org.apache.maven.scm:maven-scm-provider-cvsexe:jar:1.0:runtime
 org.netbeans.lib:cvsclient:jar:20060125:runtime
 org.apache.maven.scm:maven-scm-manager-plexus:jar:1.0:runtime
 org.codehaus.plexus:plexus-utils:jar:1.1:runtime
 org.apache.maven.scm:maven-scm-provider-hg:jar:1.0:runtime
 org.apache.maven.scm:maven-scm-provider-bazaar:jar:1.0:runtime
 org.apache.maven.scm:maven-scm-provider-starteam:jar:1.0:runtime
 org.apache.maven.scm:maven-scm-provider-local:jar:1.0:runtime
 org.apache.maven.scm:maven-scm-provider-cvsjava:jar:1.0:runtime
 org.apache.maven.scm:maven-scm-provider-svnexe:jar:1.0:runtime
 org.apache.maven.scm:maven-scm-provider-synergy:jar:1.0:runtime
 org.apache.maven.scm:maven-scm-provider-clearcase:jar:1.0:runtime
 org.apache.maven.scm:maven-scm-provider-svn-commons:jar:1.0:runtime
 ch.ethz.ganymed:ganymed-ssh2:jar:build210:runtime
 org.apache.maven.scm:maven-scm-provider-perforce:jar:1.0:runtime
 org.apache.maven.scm:maven-scm-provider-vss:jar:1.0:runtime
 org.apache.maven.scm:maven-scm-provider-cvs-commons:jar:1.0:runtime
 regexp:regexp:jar:1.3:runtime]
[DEBUG] Realm already exists for: org.apache.maven.plugins:maven-scm-plugin. Skipping addition...
[DEBUG] In verifyVersionedPlugin for: org.apache.maven.plugins:maven-scm-plugin
[DEBUG] maven-scm-plugin: using locally installed snapshot
[DEBUG] org.apache.maven.plugins:maven-scm-plugin:maven-plugin:1.1-SNAPSHOT:runtime (selected for runtime)
[DEBUG]   org.codehaus.plexus:plexus-utils:jar:1.1:runtime (selected for runtime)
[DEBUG]   org.apache.maven:maven-project:jar:2.0:runtime (selected for runtime)
[DEBUG]     org.apache.maven:maven-profile:jar:2.0:runtime (selected for runtime)
[DEBUG]       org.apache.maven:maven-model:jar:2.0:runtime (selected for runtime)
[DEBUG]         org.codehaus.plexus:plexus-utils:jar:1.0.4:runtime (removed - nearer found: 1.1)
[DEBUG]       org.codehaus.plexus:plexus-utils:jar:1.0.4:runtime (removed - nearer found: 1.1)
[DEBUG]       org.codehaus.plexus:plexus-container-default:jar:1.0-alpha-8:runtime (selected for runtime)
[DEBUG]         org.codehaus.plexus:plexus-utils:jar:1.0.4:runtime (removed - nearer found: 1.1)
[DEBUG]         junit:junit:jar:3.8.1:runtime (selected for runtime)
[DEBUG]         classworlds:classworlds:jar:1.1-alpha-2:runtime (selected for runtime)
[DEBUG]     org.apache.maven:maven-model:jar:2.0:runtime (selected for runtime)
[DEBUG]       org.codehaus.plexus:plexus-utils:jar:1.0.4:runtime (removed - nearer found: 1.1)
[DEBUG]     org.apache.maven:maven-artifact-manager:jar:2.0:runtime (selected for runtime)
[DEBUG]       org.apache.maven:maven-repository-metadata:jar:2.0:runtime (selected for runtime)
[DEBUG]         org.codehaus.plexus:plexus-utils:jar:1.0.4:runtime (removed - nearer found: 1.1)
[DEBUG]       org.codehaus.plexus:plexus-utils:jar:1.0.4:runtime (removed - nearer found: 1.1)
[DEBUG]       org.apache.maven:maven-artifact:jar:2.0:runtime (selected for runtime)
[DEBUG]         org.codehaus.plexus:plexus-utils:jar:1.0.4:runtime (removed - nearer found: 1.1)
[DEBUG]       org.apache.maven.wagon:wagon-provider-api:jar:1.0-alpha-5:runtime (selected for runtime)
[DEBUG]         org.codehaus.plexus:plexus-utils:jar:1.0.4:runtime (removed - nearer found: 1.1)
[DEBUG]     org.codehaus.plexus:plexus-utils:jar:1.0.4:runtime (removed - nearer found: 1.1)
[DEBUG]     org.apache.maven:maven-artifact:jar:2.0:runtime (selected for runtime)
[DEBUG]       org.codehaus.plexus:plexus-utils:jar:1.0.4:runtime (removed - nearer found: 1.1)
[DEBUG]     org.codehaus.plexus:plexus-container-default:jar:1.0-alpha-8:runtime (selected for runtime)
[DEBUG]       org.codehaus.plexus:plexus-utils:jar:1.0.4:runtime (removed - nearer found: 1.1)
[DEBUG]       junit:junit:jar:3.8.1:runtime (selected for runtime)
[DEBUG]       classworlds:classworlds:jar:1.1-alpha-2:runtime (selected for runtime)
[DEBUG]   org.apache.maven:maven-settings:jar:2.0:runtime (selected for runtime)
[DEBUG]     org.codehaus.plexus:plexus-utils:jar:1.0.4:runtime (removed - nearer found: 1.1)
[DEBUG]   org.apache.maven:maven-plugin-api:jar:2.0:runtime (selected for runtime)
[DEBUG]   org.apache.maven.scm:maven-scm-manager-plexus:jar:1.0:runtime (selected for runtime)
[DEBUG]     org.apache.maven.scm:maven-scm-api:jar:1.0:runtime (selected for runtime)
[DEBUG]     org.codehaus.plexus:plexus-container-default:jar:1.0-alpha-9:runtime (removed - nearer found: 1.0-alpha-8)
[DEBUG]   org.apache.maven.scm:maven-scm-provider-bazaar:jar:1.0:runtime (selected for runtime)
[DEBUG]     regexp:regexp:jar:1.3:runtime (selected for runtime)
[DEBUG]     org.codehaus.plexus:plexus-container-default:jar:1.0-alpha-7:runtime (removed - nearer found: 1.0-alpha-8)
[DEBUG]   org.apache.maven.scm:maven-scm-provider-clearcase:jar:1.0:runtime (selected for runtime)
[DEBUG]   org.apache.maven.scm:maven-scm-provider-cvsexe:jar:1.0:runtime (selected for runtime)
[DEBUG]     org.apache.maven.scm:maven-scm-provider-cvs-commons:jar:1.0:runtime (selected for runtime)
[DEBUG]   org.apache.maven.scm:maven-scm-provider-cvsjava:jar:1.0:runtime (selected for runtime)
[DEBUG]     org.netbeans.lib:cvsclient:jar:20060125:runtime (selected for runtime)
[DEBUG]     ch.ethz.ganymed:ganymed-ssh2:jar:build210:runtime (selected for runtime)
[DEBUG]   org.apache.maven.scm:maven-scm-provider-hg:jar:1.0:runtime (selected for runtime)
[DEBUG]   org.apache.maven.scm:maven-scm-provider-local:jar:1.0:runtime (selected for runtime)
[DEBUG]   org.apache.maven.scm:maven-scm-provider-perforce:jar:1.0:runtime (selected for runtime)
[DEBUG]   org.apache.maven.scm:maven-scm-provider-starteam:jar:1.0:runtime (selected for runtime)
[DEBUG]   org.apache.maven.scm:maven-scm-provider-svnexe:jar:1.0:runtime (selected for runtime)
[DEBUG]     org.apache.maven.scm:maven-scm-provider-svn-commons:jar:1.0:runtime (selected for runtime)
[DEBUG]   org.apache.maven.scm:maven-scm-provider-synergy:jar:1.0:runtime (selected for runtime)
[DEBUG]   org.apache.maven.scm:maven-scm-provider-vss:jar:1.0:runtime (selected for runtime)
[DEBUG] Using the following artifacts for classpath of: org.apache.maven.plugins:maven-scm-plugin:maven-plugin:1.1-SNAPSHOT:

[org.apache.maven.scm:maven-scm-api:jar:1.0:runtime
 org.apache.maven.scm:maven-scm-provider-cvsexe:jar:1.0:runtime
 org.netbeans.lib:cvsclient:jar:20060125:runtime
 org.apache.maven.scm:maven-scm-manager-plexus:jar:1.0:runtime
 org.codehaus.plexus:plexus-utils:jar:1.1:runtime
 org.apache.maven.scm:maven-scm-provider-hg:jar:1.0:runtime
 org.apache.maven.scm:maven-scm-provider-bazaar:jar:1.0:runtime
 org.apache.maven.scm:maven-scm-provider-starteam:jar:1.0:runtime
 org.apache.maven.scm:maven-scm-provider-local:jar:1.0:runtime
 org.apache.maven.scm:maven-scm-provider-cvsjava:jar:1.0:runtime
 org.apache.maven.scm:maven-scm-provider-svnexe:jar:1.0:runtime
 org.apache.maven.scm:maven-scm-provider-synergy:jar:1.0:runtime
 org.apache.maven.scm:maven-scm-provider-clearcase:jar:1.0:runtime
 org.apache.maven.scm:maven-scm-provider-svn-commons:jar:1.0:runtime
 ch.ethz.ganymed:ganymed-ssh2:jar:build210:runtime
 org.apache.maven.scm:maven-scm-provider-perforce:jar:1.0:runtime
 org.apache.maven.scm:maven-scm-provider-vss:jar:1.0:runtime
 org.apache.maven.scm:maven-scm-provider-cvs-commons:jar:1.0:runtime
 regexp:regexp:jar:1.3:runtime]
[DEBUG] Realm already exists for: org.apache.maven.plugins:maven-scm-plugin. Skipping addition...
[DEBUG] 

Our build plan is:

1. org.apache.maven.plugins:maven-scm-plugin:1.1-SNAPSHOT:diff [executionId: default]


[DEBUG] In verifyVersionedPlugin for: org.apache.maven.plugins:maven-scm-plugin
[DEBUG] maven-scm-plugin: using locally installed snapshot
[DEBUG] org.apache.maven.plugins:maven-scm-plugin:maven-plugin:1.1-SNAPSHOT:runtime (selected for runtime)
[DEBUG]   org.codehaus.plexus:plexus-utils:jar:1.1:runtime (selected for runtime)
[DEBUG]   org.apache.maven:maven-project:jar:2.0:runtime (selected for runtime)
[DEBUG]     org.apache.maven:maven-profile:jar:2.0:runtime (selected for runtime)
[DEBUG]       org.apache.maven:maven-model:jar:2.0:runtime (selected for runtime)
[DEBUG]         org.codehaus.plexus:plexus-utils:jar:1.0.4:runtime (removed - nearer found: 1.1)
[DEBUG]       org.codehaus.plexus:plexus-utils:jar:1.0.4:runtime (removed - nearer found: 1.1)
[DEBUG]       org.codehaus.plexus:plexus-container-default:jar:1.0-alpha-8:runtime (selected for runtime)
[DEBUG]         org.codehaus.plexus:plexus-utils:jar:1.0.4:runtime (removed - nearer found: 1.1)
[DEBUG]         junit:junit:jar:3.8.1:runtime (selected for runtime)
[DEBUG]         classworlds:classworlds:jar:1.1-alpha-2:runtime (selected for runtime)
[DEBUG]     org.apache.maven:maven-model:jar:2.0:runtime (selected for runtime)
[DEBUG]       org.codehaus.plexus:plexus-utils:jar:1.0.4:runtime (removed - nearer found: 1.1)
[DEBUG]     org.apache.maven:maven-artifact-manager:jar:2.0:runtime (selected for runtime)
[DEBUG]       org.apache.maven:maven-repository-metadata:jar:2.0:runtime (selected for runtime)
[DEBUG]         org.codehaus.plexus:plexus-utils:jar:1.0.4:runtime (removed - nearer found: 1.1)
[DEBUG]       org.codehaus.plexus:plexus-utils:jar:1.0.4:runtime (removed - nearer found: 1.1)
[DEBUG]       org.apache.maven:maven-artifact:jar:2.0:runtime (selected for runtime)
[DEBUG]         org.codehaus.plexus:plexus-utils:jar:1.0.4:runtime (removed - nearer found: 1.1)
[DEBUG]       org.apache.maven.wagon:wagon-provider-api:jar:1.0-alpha-5:runtime (selected for runtime)
[DEBUG]         org.codehaus.plexus:plexus-utils:jar:1.0.4:runtime (removed - nearer found: 1.1)
[DEBUG]     org.codehaus.plexus:plexus-utils:jar:1.0.4:runtime (removed - nearer found: 1.1)
[DEBUG]     org.apache.maven:maven-artifact:jar:2.0:runtime (selected for runtime)
[DEBUG]       org.codehaus.plexus:plexus-utils:jar:1.0.4:runtime (removed - nearer found: 1.1)
[DEBUG]     org.codehaus.plexus:plexus-container-default:jar:1.0-alpha-8:runtime (selected for runtime)
[DEBUG]       org.codehaus.plexus:plexus-utils:jar:1.0.4:runtime (removed - nearer found: 1.1)
[DEBUG]       junit:junit:jar:3.8.1:runtime (selected for runtime)
[DEBUG]       classworlds:classworlds:jar:1.1-alpha-2:runtime (selected for runtime)
[DEBUG]   org.apache.maven:maven-settings:jar:2.0:runtime (selected for runtime)
[DEBUG]     org.codehaus.plexus:plexus-utils:jar:1.0.4:runtime (removed - nearer found: 1.1)
[DEBUG]   org.apache.maven:maven-plugin-api:jar:2.0:runtime (selected for runtime)
[DEBUG]   org.apache.maven.scm:maven-scm-manager-plexus:jar:1.0:runtime (selected for runtime)
[DEBUG]     org.apache.maven.scm:maven-scm-api:jar:1.0:runtime (selected for runtime)
[DEBUG]     org.codehaus.plexus:plexus-container-default:jar:1.0-alpha-9:runtime (removed - nearer found: 1.0-alpha-8)
[DEBUG]   org.apache.maven.scm:maven-scm-provider-bazaar:jar:1.0:runtime (selected for runtime)
[DEBUG]     regexp:regexp:jar:1.3:runtime (selected for runtime)
[DEBUG]     org.codehaus.plexus:plexus-container-default:jar:1.0-alpha-7:runtime (removed - nearer found: 1.0-alpha-8)
[DEBUG]   org.apache.maven.scm:maven-scm-provider-clearcase:jar:1.0:runtime (selected for runtime)
[DEBUG]   org.apache.maven.scm:maven-scm-provider-cvsexe:jar:1.0:runtime (selected for runtime)
[DEBUG]     org.apache.maven.scm:maven-scm-provider-cvs-commons:jar:1.0:runtime (selected for runtime)
[DEBUG]   org.apache.maven.scm:maven-scm-provider-cvsjava:jar:1.0:runtime (selected for runtime)
[DEBUG]     org.netbeans.lib:cvsclient:jar:20060125:runtime (selected for runtime)
[DEBUG]     ch.ethz.ganymed:ganymed-ssh2:jar:build210:runtime (selected for runtime)
[DEBUG]   org.apache.maven.scm:maven-scm-provider-hg:jar:1.0:runtime (selected for runtime)
[DEBUG]   org.apache.maven.scm:maven-scm-provider-local:jar:1.0:runtime (selected for runtime)
[DEBUG]   org.apache.maven.scm:maven-scm-provider-perforce:jar:1.0:runtime (selected for runtime)
[DEBUG]   org.apache.maven.scm:maven-scm-provider-starteam:jar:1.0:runtime (selected for runtime)
[DEBUG]   org.apache.maven.scm:maven-scm-provider-svnexe:jar:1.0:runtime (selected for runtime)
[DEBUG]     org.apache.maven.scm:maven-scm-provider-svn-commons:jar:1.0:runtime (selected for runtime)
[DEBUG]   org.apache.maven.scm:maven-scm-provider-synergy:jar:1.0:runtime (selected for runtime)
[DEBUG]   org.apache.maven.scm:maven-scm-provider-vss:jar:1.0:runtime (selected for runtime)
[DEBUG] Using the following artifacts for classpath of: org.apache.maven.plugins:maven-scm-plugin:maven-plugin:1.1-SNAPSHOT:

[org.apache.maven.scm:maven-scm-api:jar:1.0:runtime
 org.apache.maven.scm:maven-scm-provider-cvsexe:jar:1.0:runtime
 org.netbeans.lib:cvsclient:jar:20060125:runtime
 org.apache.maven.scm:maven-scm-manager-plexus:jar:1.0:runtime
 org.codehaus.plexus:plexus-utils:jar:1.1:runtime
 org.apache.maven.scm:maven-scm-provider-hg:jar:1.0:runtime
 org.apache.maven.scm:maven-scm-provider-bazaar:jar:1.0:runtime
 org.apache.maven.scm:maven-scm-provider-starteam:jar:1.0:runtime
 org.apache.maven.scm:maven-scm-provider-local:jar:1.0:runtime
 org.apache.maven.scm:maven-scm-provider-cvsjava:jar:1.0:runtime
 org.apache.maven.scm:maven-scm-provider-svnexe:jar:1.0:runtime
 org.apache.maven.scm:maven-scm-provider-synergy:jar:1.0:runtime
 org.apache.maven.scm:maven-scm-provider-clearcase:jar:1.0:runtime
 org.apache.maven.scm:maven-scm-provider-svn-commons:jar:1.0:runtime
 ch.ethz.ganymed:ganymed-ssh2:jar:build210:runtime
 org.apache.maven.scm:maven-scm-provider-perforce:jar:1.0:runtime
 org.apache.maven.scm:maven-scm-provider-vss:jar:1.0:runtime
 org.apache.maven.scm:maven-scm-provider-cvs-commons:jar:1.0:runtime
 regexp:regexp:jar:1.3:runtime]
[DEBUG] Realm already exists for: org.apache.maven.plugins:maven-scm-plugin. Skipping addition...
[DEBUG] Looking up mojo org.apache.maven.plugins:maven-scm-plugin:1.1-SNAPSHOT:diff in realm org.apache.maven.plugins:maven-scm-plugin - descRealmId=org.apache.maven.plugins:maven-scm-plugin
[DEBUG] Looked up - org.apache.maven.scm.plugin.DiffMojo@a20232 - ClassRealm[org.apache.maven.plugins:maven-scm-plugin, parent: ClassRealm[plexus.core, parent: null]]
[DEBUG] Configuring mojo 'org.apache.maven.plugins:maven-scm-plugin:1.1-SNAPSHOT:diff' -->
[DEBUG]   (f) basedir = /export/home/build/data/continuum/checkouts/486/target/scm-plugin-from-embedder
[DEBUG]   (f) connectionType = connection
[DEBUG]   (s) connectionUrl = scm:svn:http://svn.apache.org/repos/asf/maven/components/trunk/maven-embedder
[DEBUG]   (f) developerConnectionUrl = scm:svn:http://svn.apache.org/repos/asf/maven/components/trunk/maven-embedder
[DEBUG]   (f) outputFile = /export/home/build/data/continuum/checkouts/486/target/scm-plugin-from-embedder/embedder-test-project.diff
[DEBUG]   (f) settings = org.apache.maven.settings.Settings@190d1e8
[DEBUG] -- end configuration --
[INFO] [scm:diff]
[INFO] Executing: /bin/bash -c "cd /export/home/build/data/continuum/checkouts/486/target/scm-plugin-from-embedder && svn --non-interactive diff"
[INFO] Working directory: /export/home/build/data/continuum/checkouts/486/target/scm-plugin-from-embedder
[INFO] 
Tests run: 1, Failures: 0, Errors: 0, Skipped: 0, Time elapsed: 13.109 sec
Running org.apache.maven.embedder.MavenEmbedderProjectWithExtensionReadingTest
[INFO] Scanning for projects...
[INFO] ----------------------------------------------------------------------------
[INFO] Building Maven Quick Start Archetype
[INFO]    task-segment: [package]
[INFO] ----------------------------------------------------------------------------
[INFO] [resources:resources]
[INFO] Using default encoding to copy filtered resources.
[INFO] Resource directory does not exist: /export/home/build/data/continuum/checkouts/486/target/embedder-test-project0/src/main/resources
[INFO] [compiler:compile]
[INFO] Compiling 1 source file to /export/home/build/data/continuum/checkouts/486/target/embedder-test-project0/target/classes
[INFO] [resources:testResources]
[INFO] Using default encoding to copy filtered resources.
[INFO] Resource directory does not exist: /export/home/build/data/continuum/checkouts/486/target/embedder-test-project0/src/test/resources
[INFO] [compiler:testCompile]
[INFO] Compiling 1 source file to /export/home/build/data/continuum/checkouts/486/target/embedder-test-project0/target/test-classes
[INFO] [surefire:test]
[INFO] Surefire report directory: /export/home/build/data/continuum/checkouts/486/target/embedder-test-project0/target/surefire-reports

-------------------------------------------------------
 T E S T S
-------------------------------------------------------
Running org.apache.maven.AppTest
Tests run: 1, Failures: 0, Errors: 0, Skipped: 0, Time elapsed: 0.056 sec

Results :

Tests run: 1, Failures: 0, Errors: 0, Skipped: 0

[INFO] [jar:jar]
[INFO] Building jar: /export/home/build/data/continuum/checkouts/486/target/embedder-test-project0/target/embedder-test-project-1.0-SNAPSHOT.jar
[INFO] Scanning for projects...
[INFO] ----------------------------------------------------------------------------
[INFO] Building Maven Quick Start Archetype
[INFO]    task-segment: [package]
[INFO] ----------------------------------------------------------------------------
[INFO] [resources:resources]
[INFO] Using default encoding to copy filtered resources.
[INFO] Resource directory does not exist: /export/home/build/data/continuum/checkouts/486/target/embedder-test-project1/src/main/resources
[INFO] [compiler:compile]
[INFO] Compiling 1 source file to /export/home/build/data/continuum/checkouts/486/target/embedder-test-project1/target/classes
[INFO] [resources:testResources]
[INFO] Using default encoding to copy filtered resources.
[INFO] Resource directory does not exist: /export/home/build/data/continuum/checkouts/486/target/embedder-test-project1/src/test/resources
[INFO] [compiler:testCompile]
[INFO] Compiling 1 source file to /export/home/build/data/continuum/checkouts/486/target/embedder-test-project1/target/test-classes
[INFO] [surefire:test]
[INFO] Surefire report directory: /export/home/build/data/continuum/checkouts/486/target/embedder-test-project1/target/surefire-reports

-------------------------------------------------------
 T E S T S
-------------------------------------------------------
Running org.apache.maven.AppTest
Tests run: 1, Failures: 0, Errors: 0, Skipped: 0, Time elapsed: 0.053 sec

Results :

Tests run: 1, Failures: 0, Errors: 0, Skipped: 0

[INFO] [jar:jar]
[INFO] Building jar: /export/home/build/data/continuum/checkouts/486/target/embedder-test-project1/target/embedder-test-project-1.0-SNAPSHOT.jar
[INFO] Scanning for projects...
[INFO] ----------------------------------------------------------------------------
[INFO] Building Maven Quick Start Archetype
[INFO]    task-segment: [validate]
[INFO] ----------------------------------------------------------------------------
[INFO] Scanning for projects...
[INFO] ----------------------------------------------------------------------------
[INFO] Building Maven Quick Start Archetype
[INFO]    task-segment: [validate]
[INFO] ----------------------------------------------------------------------------
[INFO] Scanning for projects...
[INFO] ----------------------------------------------------------------------------
[INFO] Building Maven Quick Start Archetype
[INFO]    task-segment: [package]
[INFO] ----------------------------------------------------------------------------
[INFO] [resources:resources]
[INFO] Using default encoding to copy filtered resources.
[INFO] Resource directory does not exist: /export/home/build/data/continuum/checkouts/486/target/embedder-test-project-caching/src/main/resources
[INFO] [compiler:compile]
[INFO] Compiling 1 source file to /export/home/build/data/continuum/checkouts/486/target/embedder-test-project-caching/target/classes
[INFO] [resources:testResources]
[INFO] Using default encoding to copy filtered resources.
[INFO] Resource directory does not exist: /export/home/build/data/continuum/checkouts/486/target/embedder-test-project-caching/src/test/resources
[INFO] [compiler:testCompile]
[INFO] Compiling 1 source file to /export/home/build/data/continuum/checkouts/486/target/embedder-test-project-caching/target/test-classes
[INFO] [surefire:test]
[INFO] Surefire report directory: /export/home/build/data/continuum/checkouts/486/target/embedder-test-project-caching/target/surefire-reports

-------------------------------------------------------
 T E S T S
-------------------------------------------------------
Running org.apache.maven.AppTest
Tests run: 1, Failures: 0, Errors: 0, Skipped: 0, Time elapsed: 0.037 sec

Results :
Tests run: 1, Failures: 0, Errors: 0, Skipped: 0

[INFO] [jar:jar]
[INFO] Building jar: /export/home/build/data/continuum/checkouts/486/target/embedder-test-project-caching/target/embedder-test-project-1.0-SNAPSHOT.jar
[INFO] Scanning for projects...
[INFO] ----------------------------------------------------------------------------
[INFO] Building Maven Quick Start Archetype
[INFO]    task-segment: [package]
[INFO] ----------------------------------------------------------------------------
[INFO] [resources:resources]
[INFO] Using default encoding to copy filtered resources.
[INFO] Resource directory does not exist: /export/home/build/data/continuum/checkouts/486/target/embedder-test-project-caching/src/main/resources
[INFO] [compiler:compile]
[INFO] Nothing to compile - all classes are up to date
[INFO] [resources:testResources]
[INFO] Using default encoding to copy filtered resources.
[INFO] Resource directory does not exist: /export/home/build/data/continuum/checkouts/486/target/embedder-test-project-caching/src/test/resources
[INFO] [compiler:testCompile]
[INFO] Nothing to compile - all classes are up to date
[INFO] [surefire:test]
[INFO] Surefire report directory: /export/home/build/data/continuum/checkouts/486/target/embedder-test-project-caching/target/surefire-reports

-------------------------------------------------------
 T E S T S
-------------------------------------------------------
Running org.apache.maven.AppTest
Tests run: 1, Failures: 0, Errors: 0, Skipped: 0, Time elapsed: 0.036 sec

Results :
Tests run: 1, Failures: 0, Errors: 0, Skipped: 0

[INFO] [jar:jar]
[INFO] Building jar: /export/home/build/data/continuum/checkouts/486/target/embedder-test-project-caching/target/embedder-test-project-1.0-SNAPSHOT.jar
Tests run: 14, Failures: 0, Errors: 0, Skipped: 0, Time elapsed: 13.932 sec
Running org.apache.maven.embedder.MavenEmbedderExampleTest
[INFO] Scanning for projects...
[INFO] ----------------------------------------------------------------------------
[INFO] Building simple-project
[INFO]    task-segment: [clean, install]
[INFO] ----------------------------------------------------------------------------
[INFO] [clean:clean]
[INFO] Deleting directory /export/home/build/data/continuum/checkouts/486/src/examples/simple-project/target
[INFO] [resources:resources]
[INFO] Using default encoding to copy filtered resources.
[INFO] Resource directory does not exist: /export/home/build/data/continuum/checkouts/486/src/examples/simple-project/src/main/resources
[INFO] [compiler:compile]
[INFO] Compiling 1 source file to /export/home/build/data/continuum/checkouts/486/src/examples/simple-project/target/classes
[INFO] [resources:testResources]
[INFO] Using default encoding to copy filtered resources.
[INFO] Resource directory does not exist: /export/home/build/data/continuum/checkouts/486/src/examples/simple-project/src/test/resources
[INFO] [compiler:testCompile]
[INFO] Compiling 1 source file to /export/home/build/data/continuum/checkouts/486/src/examples/simple-project/target/test-classes
[INFO] [surefire:test]
[INFO] Surefire report directory: /export/home/build/data/continuum/checkouts/486/src/examples/simple-project/target/surefire-reports

-------------------------------------------------------
 T E S T S
-------------------------------------------------------
Running org.apache.maven.embedder.AppTest
Tests run: 1, Failures: 0, Errors: 0, Skipped: 0, Time elapsed: 0.04 sec

Results :

Tests run: 1, Failures: 0, Errors: 0, Skipped: 0

[INFO] [jar:jar]
[INFO] Building jar: /export/home/build/data/continuum/checkouts/486/src/examples/simple-project/target/simple-project-1.0-SNAPSHOT.jar
[INFO] [install:install]
[INFO] Installing /export/home/build/data/continuum/checkouts/486/src/examples/simple-project/target/simple-project-1.0-SNAPSHOT.jar to /export/home/build/.m2/repository/org/apache/maven/embedder/simple-project/1.0-SNAPSHOT/simple-project-1.0-SNAPSHOT.jar
You are working in the 'development' environment!
[ERROR] Failed to read settings from: /export/home/build/data/continuum/checkouts/486/conf/settings.xml. Throwing IOException...
Tests run: 3, Failures: 0, Errors: 0, Skipped: 0, Time elapsed: 4.278 sec
Running org.apache.maven.cli.MavenCliTest
Tests run: 1, Failures: 0, Errors: 0, Skipped: 0, Time elapsed: 0.077 sec

Results :

Tests run: 54, Failures: 0, Errors: 0, Skipped: 0

[INFO] [jar:jar]
[INFO] Building jar: /export/home/build/data/continuum/checkouts/486/target/maven-embedder-2.1-SNAPSHOT.jar
[WARNING] DEPRECATED [descriptor]: Please use descriptors instead
[INFO] [assembly:single {execution: create-distro}]
[INFO] Processing DependencySet (output=boot)
[INFO] Processing DependencySet (output=lib)
[WARNING] The following patterns were never triggered in this artifact exclusion filter:
o  'jmock:jmock'
o  'org.apache.maven:maven-artifact'

[INFO] Building tar : /export/home/build/data/continuum/checkouts/486/target/maven-2.1-SNAPSHOT-bin.tar.gz
[INFO] Processing DependencySet (output=boot)
[INFO] Processing DependencySet (output=lib)
[WARNING] The following patterns were never triggered in this artifact exclusion filter:
o  'jmock:jmock'
o  'org.apache.maven:maven-artifact'

[INFO] Building tar : /export/home/build/data/continuum/checkouts/486/target/maven-2.1-SNAPSHOT-bin.tar.bz2
[INFO] Processing DependencySet (output=boot)
[INFO] Processing DependencySet (output=lib)
[WARNING] The following patterns were never triggered in this artifact exclusion filter:
o  'jmock:jmock'
o  'org.apache.maven:maven-artifact'

[INFO] Building zip: /export/home/build/data/continuum/checkouts/486/target/maven-2.1-SNAPSHOT-bin.zip
[INFO] [install:install]
[INFO] Installing /export/home/build/data/continuum/checkouts/486/target/maven-embedder-2.1-SNAPSHOT.jar to /export/home/build/.m2/repository/org/apache/maven/maven-embedder/2.1-SNAPSHOT/maven-embedder-2.1-SNAPSHOT.jar
[INFO] Installing /export/home/build/data/continuum/checkouts/486/target/maven-2.1-SNAPSHOT-bin.tar.gz to /export/home/build/.m2/repository/org/apache/maven/maven-embedder/2.1-SNAPSHOT/maven-embedder-2.1-SNAPSHOT-bin.tar.gz
[INFO] Installing /export/home/build/data/continuum/checkouts/486/target/maven-2.1-SNAPSHOT-bin.tar.bz2 to /export/home/build/.m2/repository/org/apache/maven/maven-embedder/2.1-SNAPSHOT/maven-embedder-2.1-SNAPSHOT-bin.tar.bz2
[INFO] Installing /export/home/build/data/continuum/checkouts/486/target/maven-2.1-SNAPSHOT-bin.zip to /export/home/build/.m2/repository/org/apache/maven/maven-embedder/2.1-SNAPSHOT/maven-embedder-2.1-SNAPSHOT-bin.zip
[INFO] ------------------------------------------------------------------------
[INFO] BUILD SUCCESSFUL
[INFO] ------------------------------------------------------------------------
[INFO] Total time: 2 minutes 1 second
[INFO] Finished at: Fri Sep 07 21:42:49 GMT+00:00 2007
[INFO] Final Memory: 26M/336M
[INFO] ------------------------------------------------------------------------

****************************************************************************



Mime
View raw message