maven-notifications mailing list archives

Site index · List index
Message view « Date » · « Thread »
Top « Date » · « Thread »
From "Continuum@maven.zones.apache.org" <contin...@maven.zones.apache.org>
Subject [continuum] BUILD FAILURE: Maven Embedder
Date Fri, 07 Sep 2007 02:26:06 GMT
Online report : http://maven.zones.apache.org/continuum/buildResult.action?buildId=20360&projectId=486

Build statistics:
  State: Failed
  Previous State: Failed
  Started at: Fri 7 Sep 2007 02:24:37 +0000
  Finished at: Fri 7 Sep 2007 02:24:52 +0000
  Total time: 15s
  Build Trigger: Schedule
  Build Number: 1
  Exit code: 1
  Building machine hostname: maven.zones.apache.org
  Operating system : SunOS(unknown)
  Java Home version : 
          java version "1.5.0_12"
          Java(TM) 2 Runtime Environment, Standard Edition (build 1.5.0_12-b04)
          Java HotSpot(TM) Server VM (build 1.5.0_12-b04, mixed mode)
        
  Builder version :
          Maven version: 2.0.7
          Java version: 1.5.0_12
          OS name: "sunos" version: "5.10" arch: "x86"
    
****************************************************************************
SCM Changes:
****************************************************************************
No files changed

****************************************************************************
Dependencies Changes:
****************************************************************************
org.apache.maven:maven:2.1-SNAPSHOT

****************************************************************************
Test Summary:
****************************************************************************
Tests: 1
Failures: 0
Total time: 23

****************************************************************************
Output:
****************************************************************************
[INFO] Scanning for projects...
[INFO] ----------------------------------------------------------------------------
[INFO] Building Maven Embedder
[INFO]    task-segment: [clean, install]
[INFO] ----------------------------------------------------------------------------
[INFO] [clean:clean]
[INFO] Deleting directory /export/home/build/data/continuum/checkouts/486/target
[INFO] [resources:resources]
[INFO] Using default encoding to copy filtered resources.
[INFO] Copying 2 resources
[INFO] snapshot org.apache.maven:maven-core:2.1-SNAPSHOT: checking for updates from apache.snapshots
[INFO] [compiler:compile]
[INFO] Compiling 24 source files to /export/home/build/data/continuum/checkouts/486/target/classes
[INFO] ------------------------------------------------------------------------
[ERROR] BUILD FAILURE
[INFO] ------------------------------------------------------------------------
[INFO] Compilation failure

/export/home/build/data/continuum/checkouts/486/src/main/java/org/apache/maven/embedder/MavenEmbedder.java:[57,41]
package org.apache.maven.profiles.manager does not exist

/export/home/build/data/continuum/checkouts/486/src/main/java/org/apache/maven/embedder/MavenEmbedder.java:[58,41]
package org.apache.maven.profiles.manager does not exist

/export/home/build/data/continuum/checkouts/486/src/main/java/org/apache/maven/embedder/MavenEmbedder.java:[145,12]
cannot find symbol
symbol  : class ProfileManager
location: class org.apache.maven.embedder.MavenEmbedder

/export/home/build/data/continuum/checkouts/486/src/main/java/org/apache/maven/embedder/execution/DefaultMavenExecutionRequestPopulator.java:[33,41]
package org.apache.maven.profiles.manager does not exist

/export/home/build/data/continuum/checkouts/486/src/main/java/org/apache/maven/embedder/execution/DefaultMavenExecutionRequestPopulator.java:[34,41]
package org.apache.maven.profiles.manager does not exist

/export/home/build/data/continuum/checkouts/486/src/main/java/org/apache/maven/embedder/execution/DefaultMavenExecutionRequestPopulator.java:[236,11]
cannot find symbol
symbol  : class ProfileManager
location: class org.apache.maven.embedder.execution.DefaultMavenExecutionRequestPopulator

/export/home/build/data/continuum/checkouts/486/src/main/java/org/apache/maven/embedder/MavenEmbedder.java:[656,33]
cannot find symbol
symbol  : class DefaultProfileManager
location: class org.apache.maven.embedder.MavenEmbedder

/export/home/build/data/continuum/checkouts/486/src/main/java/org/apache/maven/embedder/execution/DefaultMavenExecutionRequestPopulator.java:[238,8]
cannot find symbol
symbol  : class ProfileManager
location: class org.apache.maven.embedder.execution.DefaultMavenExecutionRequestPopulator

/export/home/build/data/continuum/checkouts/486/src/main/java/org/apache/maven/embedder/execution/DefaultMavenExecutionRequestPopulator.java:[238,50]
cannot find symbol
symbol  : class DefaultProfileManager
location: class org.apache.maven.embedder.execution.DefaultMavenExecutionRequestPopulator


[INFO] ------------------------------------------------------------------------
[INFO] For more information, run Maven with the -e switch
[INFO] ------------------------------------------------------------------------
[INFO] Total time: 12 seconds
[INFO] Finished at: Fri Sep 07 02:24:52 GMT+00:00 2007
[INFO] Final Memory: 10M/322M
[INFO] ------------------------------------------------------------------------

****************************************************************************



Mime
View raw message