maven-notifications mailing list archives

Site index · List index
Message view « Date » · « Thread »
Top « Date » · « Thread »
From "Continuum@maven.zones.apache.org" <contin...@maven.zones.apache.org>
Subject [continuum] BUILD FAILURE: Maven Embedder
Date Sun, 09 Sep 2007 00:47:47 GMT
Online report : http://maven.zones.apache.org/continuum/buildResult.action?buildId=20872&projectId=486

Build statistics:
  State: Failed
  Previous State: Ok
  Started at: Sun 9 Sep 2007 00:46:49 +0000
  Finished at: Sun 9 Sep 2007 00:47:25 +0000
  Total time: 36s
  Build Trigger: Schedule
  Build Number: 8
  Exit code: 1
  Building machine hostname: maven.zones.apache.org
  Operating system : SunOS(unknown)
  Java Home version : 
          java version "1.4.2_06"
          Java(TM) 2 Runtime Environment, Standard Edition (build 1.4.2_06-b03)
          Java HotSpot(TM) Client VM (build 1.4.2_06-b03, mixed mode)
        
  Builder version :
          Maven version: 2.0.7
          Java version: 1.4.2_06
          OS name: "sunos" version: "5.10" arch: "x86"
    
****************************************************************************
SCM Changes:
****************************************************************************
Changed: brett @ Sat 8 Sep 2007 23:42:20 +0000
Comment: [MNG-3088] s/maven/apache-maven/ in the assembly
Files changed:
  /maven/components/trunk/build.xml ( 573932 )
  /maven/components/trunk/maven-embedder/pom.xml ( 573932 )

****************************************************************************
Dependencies Changes:
****************************************************************************
org.apache.maven:maven-core:2.1-SNAPSHOT

org.apache.maven:maven:2.1-SNAPSHOT

****************************************************************************
Test Summary:
****************************************************************************
Tests: 1
Failures: 0
Total time: 30

****************************************************************************
Output:
****************************************************************************
[INFO] Scanning for projects...
[INFO] ----------------------------------------------------------------------------
[INFO] Building Maven Embedder
[INFO]    task-segment: [clean, install]
[INFO] ----------------------------------------------------------------------------
[INFO] [clean:clean]
[INFO] Deleting directory /export/home/build/data/continuum/checkouts/486/target
[INFO] [resources:resources]
[INFO] Using default encoding to copy filtered resources.
[INFO] Copying 2 resources
[INFO] snapshot org.apache.maven:maven-core:2.1-SNAPSHOT: checking for updates from apache.snapshots
[INFO] [compiler:compile]
[INFO] Compiling 24 source files to /export/home/build/data/continuum/checkouts/486/target/classes
[INFO] ------------------------------------------------------------------------
[ERROR] BUILD FAILURE
[INFO] ------------------------------------------------------------------------
[INFO] Compilation failure
/export/home/build/data/continuum/checkouts/486/src/main/java/org/apache/maven/embedder/MavenEmbedderFileLogger.java:[38,23]
cannot resolve symbol
symbol  : constructor PrintWriter (java.io.File)
location: class java.io.PrintWriter



/export/home/build/data/continuum/checkouts/486/src/main/java/org/apache/maven/embedder/MavenEmbedderFileLogger.java:[38,23]
cannot resolve symbol
symbol  : constructor PrintWriter (java.io.File)
location: class java.io.PrintWriter


[INFO] ------------------------------------------------------------------------
[INFO] For more information, run Maven with the -e switch
[INFO] ------------------------------------------------------------------------
[INFO] Total time: 34 seconds
[INFO] Finished at: Sun Sep 09 00:47:25 GMT+00:00 2007
[INFO] Final Memory: 8M/21M
[INFO] ------------------------------------------------------------------------

****************************************************************************



Mime
View raw message