maven-notifications mailing list archives

Site index · List index
Message view « Date » · « Thread »
Top « Date » · « Thread »
From "Continuum@maven.zones.apache.org" <contin...@maven.zones.apache.org>
Subject [continuum] BUILD FAILURE: Maven Wagon Manager
Date Sun, 02 Sep 2007 03:15:14 GMT
Online report : http://maven.zones.apache.org/continuum/buildResult.action?buildId=19113&projectId=395

Build statistics:
  State: Failed
  Previous State: Failed
  Started at: Sun 2 Sep 2007 03:14:45 +0000
  Finished at: Sun 2 Sep 2007 03:15:12 +0000
  Total time: 27s
  Build Trigger: Forced
  Build Number: 8
  Exit code: 1
  Building machine hostname: maven.zones.apache.org
  Operating system : SunOS(unknown)
  Java Home version : 
          java version "1.5.0_12"
          Java(TM) 2 Runtime Environment, Standard Edition (build 1.5.0_12-b04)
          Java HotSpot(TM) Server VM (build 1.5.0_12-b04, mixed mode)
        
  Builder version :
          Maven version: 2.0.7
          Java version: 1.5.0_12
          OS name: "sunos" version: "5.10" arch: "x86"
    
****************************************************************************
SCM Changes:
****************************************************************************
No files changed

****************************************************************************
Dependencies Changes:
****************************************************************************
org.apache.maven.wagon:wagon-ssh-external:2.0-SNAPSHOT

org.apache.maven.wagon:wagon-webdav:2.0-SNAPSHOT

org.apache.maven.wagon:wagon:2.0-SNAPSHOT

****************************************************************************
Test Summary:
****************************************************************************
Tests: 4
Failures: 4
Total time: 113

****************************************************************************
Output:
****************************************************************************
[INFO] Scanning for projects...
[INFO] ----------------------------------------------------------------------------
[INFO] Building Maven Wagon Manager
[INFO]    task-segment: [clean, install]
[INFO] ----------------------------------------------------------------------------
[INFO] [clean:clean]
[INFO] Deleting directory /export/home/build/data/continuum/checkouts/395/target
[INFO] [plexus:descriptor {execution: generate}]
[INFO] [resources:resources]
[INFO] Using default encoding to copy filtered resources.
[INFO] Copying 1 resource
[INFO] Copying 1 resource
[INFO] snapshot org.apache.maven.wagon:wagon-file:2.0-SNAPSHOT: checking for updates from
apache.snapshots
[INFO] snapshot org.apache.maven.wagon:wagon-providers:2.0-SNAPSHOT: checking for updates
from apache.snapshots
[INFO] snapshot org.apache.maven.wagon:wagon-ftp:2.0-SNAPSHOT: checking for updates from apache.snapshots
[INFO] snapshot org.apache.maven.wagon:wagon-http-lightweight:2.0-SNAPSHOT: checking for updates
from apache.snapshots
[INFO] snapshot org.apache.maven.wagon:wagon-http-shared:2.0-SNAPSHOT: checking for updates
from apache.snapshots
[INFO] snapshot org.apache.maven.wagon:wagon-ssh:2.0-SNAPSHOT: checking for updates from apache.snapshots
[INFO] snapshot org.apache.maven.wagon:wagon-ssh-external:2.0-SNAPSHOT: checking for updates
from apache.snapshots
[INFO] snapshot org.apache.maven.wagon:wagon-webdav:2.0-SNAPSHOT: checking for updates from
apache.snapshots
[INFO] [compiler:compile]
[INFO] Compiling 11 source files to /export/home/build/data/continuum/checkouts/395/target/classes
[INFO] [resources:testResources]
[INFO] Using default encoding to copy filtered resources.
[INFO] Copying 1 resource
[INFO] [compiler:testCompile]
[INFO] Compiling 1 source file to /export/home/build/data/continuum/checkouts/395/target/test-classes
[INFO] [surefire:test]
[INFO] Surefire report directory: /export/home/build/data/continuum/checkouts/395/target/surefire-reports

-------------------------------------------------------
 T E S T S
-------------------------------------------------------
Running org.apache.maven.wagon.manager.WagonManagerTest
Tests run: 4, Failures: 0, Errors: 4, Skipped: 0, Time elapsed: 0.134 sec <<< FAILURE!

Results :

Tests in error: 
  testSupportedProtocols(org.apache.maven.wagon.manager.WagonManagerTest)
  testRepositoryPut(org.apache.maven.wagon.manager.WagonManagerTest)
  testStatistics(org.apache.maven.wagon.manager.WagonManagerTest)
  testMirroredWagon(org.apache.maven.wagon.manager.WagonManagerTest)

Tests run: 4, Failures: 0, Errors: 4, Skipped: 0

[INFO] ------------------------------------------------------------------------
[ERROR] BUILD FAILURE
[INFO] ------------------------------------------------------------------------
[INFO] There are test failures.

Please refer to /export/home/build/data/continuum/checkouts/395/target/surefire-reports for
the individual test results.
[INFO] ------------------------------------------------------------------------
[INFO] For more information, run Maven with the -e switch
[INFO] ------------------------------------------------------------------------
[INFO] Total time: 24 seconds
[INFO] Finished at: Sun Sep 02 03:15:11 GMT+00:00 2007
[INFO] Final Memory: 10M/334M
[INFO] ------------------------------------------------------------------------

****************************************************************************



Mime
View raw message