maven-notifications mailing list archives

Site index · List index
Message view « Date » · « Thread »
Top « Date » · « Thread »
From "Continuum@maven.zones.apache.org" <contin...@maven.zones.apache.org>
Subject [continuum] BUILD FAILURE: Maven Eclipse Plugin
Date Mon, 29 Oct 2007 13:31:35 GMT
Online report : http://maven.zones.apache.org/continuum/buildResult.action?buildId=31977&projectId=17

Build statistics:
  State: Failed
  Previous State: Failed
  Started at: Mon 29 Oct 2007 13:25:55 +0000
  Finished at: Mon 29 Oct 2007 13:31:04 +0000
  Total time: 5m 9s
  Build Trigger: Forced
  Build Number: 45
  Exit code: 1
  Building machine hostname: maven.zones.apache.org
  Operating system : SunOS(unknown)
  Java Home version : 
          java version "1.4.2_09"
          Java(TM) 2 Runtime Environment, Standard Edition (build 1.4.2_09-b05)
          Java HotSpot(TM) Client VM (build 1.4.2_09-b05, mixed mode)
        
  Builder version :
          Maven version: 2.0.7
          Java version: 1.4.2_09
          OS name: "sunos" version: "5.10" arch: "x86"
    
****************************************************************************
SCM Changes:
****************************************************************************
Changed: no author @ no date
Comment: no comment
Files changed:
  pom.xml ( no revision )

****************************************************************************
Dependencies Changes:
****************************************************************************
org.apache.maven.shared:maven-plugin-testing-tools:1.0-alpha-3-SNAPSHOT


****************************************************************************
Build Defintion:
****************************************************************************
POM filename: pom.xml
Goals: clean install   
Arguments: -B -N
Build Fresh: false
Always Build: false
Default Build Definition: true
Schedule: DEFAULT_SCHEDULE
Profile Name: JDK 1.4.2
Description: 


****************************************************************************
Test Summary:
****************************************************************************
Tests: 67
Failures: 1
Total time: 249936

****************************************************************************
Output:
****************************************************************************
[INFO] Scanning for projects...
[INFO] ----------------------------------------------------------------------------
[INFO] Building Maven Eclipse Plugin
[INFO]    task-segment: [clean, install]
[INFO] ----------------------------------------------------------------------------
[INFO] [clean:clean]
[INFO] Deleting directory /export/home/build/data/continuum/checkouts/17/target
[INFO] [plugin:descriptor]
[INFO] Using 2 extractors.
[INFO] Applying extractor for language: java
[INFO] Extractor for language: java found 10 mojo descriptors.
[INFO] Applying extractor for language: bsh
[INFO] Extractor for language: bsh found 0 mojo descriptors.
[INFO] [resources:resources]
[INFO] Using default encoding to copy filtered resources.
[INFO] Copying 3 resources
[INFO] [compiler:compile]
[INFO] Compiling 54 source files to /export/home/build/data/continuum/checkouts/17/target/classes
[INFO] [resources:testResources]
[INFO] Using default encoding to copy filtered resources.
[INFO] Copying 284 resources
[INFO] [compiler:testCompile]
[INFO] Compiling 17 source files to /export/home/build/data/continuum/checkouts/17/target/test-classes
[INFO] [surefire:test]
[INFO] Surefire report directory: /export/home/build/data/continuum/checkouts/17/target/surefire-reports

-------------------------------------------------------
 T E S T S
-------------------------------------------------------
Running org.apache.maven.plugin.eclipse.AddMavenRepoMojoTest
Tests run: 1, Failures: 0, Errors: 0, Skipped: 0, Time elapsed: 0.459 sec
Running org.apache.maven.plugin.ide.IdeUtilsTest
Tests run: 1, Failures: 0, Errors: 0, Skipped: 0, Time elapsed: 0.016 sec
Running org.apache.maven.plugin.eclipse.BuildCommandTest
Tests run: 1, Failures: 0, Errors: 0, Skipped: 0, Time elapsed: 0.008 sec
Running org.apache.maven.plugin.eclipse.RadPluginTest
*** Running test builds; output will be directed to: target/surefire-reports/build-output

Using target/it-build-target and target/it-build-target/classes to build IT version of plugin
Now Building test version of the plugin...
Using staged plugin-pom: /export/home/build/data/continuum/checkouts/17/pom-test.xml
Using IT Plugin Jar: /export/home/build/data/continuum/checkouts/17/target/it-build-target/maven-eclipse-plugin-test.jar
[INFO] Installing /export/home/build/data/continuum/checkouts/17/target/it-build-target/maven-eclipse-plugin-test.jar
to /export/home/build/data/continuum/checkouts/17/target/test-classes/m2repo/org/apache/maven/plugins/maven-eclipse-plugin/test/maven-eclipse-plugin-test.jar
*** Installed test-version of the Eclipse plugin to: /export/home/build/data/continuum/checkouts/17/target/test-classes/m2repo

Tests run: 6, Failures: 1, Errors: 0, Skipped: 0, Time elapsed: 113.228 sec <<< FAILURE!
Running org.apache.maven.plugin.eclipse.writers.EclipseOSGiManifestWriterTest
Tests run: 3, Failures: 0, Errors: 0, Skipped: 0, Time elapsed: 0.01 sec
Running org.apache.maven.plugin.eclipse.writers.workspace.EclipseCodeFormatterTest
Tests run: 1, Failures: 0, Errors: 0, Skipped: 0, Time elapsed: 0.007 sec
Running org.apache.maven.plugin.eclipse.EclipseWorkspaceTest
Tests run: 2, Failures: 0, Errors: 0, Skipped: 0, Time elapsed: 5.359 sec
Running org.apache.maven.plugin.eclipse.writers.EclipseClasspathWriterUnitTest
[debug] Processing resource src/main/resources: output=target/classes; default output=target/classes
[debug] Processing resource src/test/resources: output=target/classes/test-resources; default
output=target/classes
[debug] Marking as special to prevent output folder nesting: src/test/resources (output=target/classes/test-resources)
[info] Creating maven-eclipse.xml Ant file to handle resources
[info] Creating external launcher file
Tests run: 1, Failures: 0, Errors: 0, Skipped: 0, Time elapsed: 0.188 sec
Running org.apache.maven.plugin.eclipse.EclipsePluginMasterProjectTest
Tests run: 6, Failures: 0, Errors: 0, Skipped: 0, Time elapsed: 17.427 sec
Running org.apache.maven.plugin.eclipse.writers.testutils.TestEclipseWriterConfig
Tests run: 0, Failures: 0, Errors: 0, Skipped: 0, Time elapsed: 0.003 sec
Running org.apache.maven.plugin.eclipse.EclipsePluginTest
Tests run: 30, Failures: 0, Errors: 0, Skipped: 0, Time elapsed: 112.748 sec
Running org.apache.maven.plugin.eclipse.EclipsePluginUnitTest
[debug] testOutput toRelativeAndFixSeparator /var/tmp/EclipsePlugin.unitTest.1193664663215
, target/main-output
[debug] testOutput after toRelative : target/main-output
[debug] Processing resource dir: src/main/resources
[debug] Making relative and fixing separator: { /var/tmp/EclipsePlugin.unitTest.1193664663215,
/var/tmp/EclipsePlugin.unitTest.1193664663215/target/main-output, false }.
[debug] Adding eclipse source dir: { src/main/resources, target/main-output, true, true, null,
null }.
[debug] Processing resource dir: src/main/resources
[debug] Making relative and fixing separator: { /var/tmp/EclipsePlugin.unitTest.1193664663565,
/var/tmp/EclipsePlugin.unitTest.1193664663565/target/classes/main-output, false }.
[debug] Adding eclipse source dir: { src/main/resources, target/classes/main-output, true,
false, null, null }.
[debug] Processing resource dir: src/main/resources
[debug] Making relative and fixing separator: { /var/tmp/EclipsePlugin.unitTest.1193664663596,
/var/tmp/EclipsePlugin.unitTest.1193664663596/target/main-output, false }.
[debug] Adding eclipse source dir: { src/main/resources, target/main-output, true, false,
null, null }.
[debug] Processing resource dir: src/main/resources
[debug] Making relative and fixing separator: { /var/tmp/EclipsePlugin.unitTest.1193664663625,
/var/tmp/EclipsePlugin.unitTest.1193664663625/target/classes, false }.
[debug] Adding eclipse source dir: { src/main/resources, target/classes, true, false, null,
null }.
[debug] Processing resource dir: src/test/resources
[debug] Making relative and fixing separator: { /var/tmp/EclipsePlugin.unitTest.1193664663625,
/var/tmp/EclipsePlugin.unitTest.1193664663625/target/test-classes, false }.
[debug] Adding eclipse source dir: { src/test/resources, target/test-classes, true, false,
null, null }.
[debug] Processing resource dir: src/main/resources
[debug] Making relative and fixing separator: { /var/tmp/EclipsePlugin.unitTest.1193664663685,
/var/tmp/EclipsePlugin.unitTest.1193664663685/target/classes, false }.
[debug] Adding eclipse source dir: { src-main-resources, target/classes, true, false, null,
null }.
[debug] Processing resource dir: src/test/resources
[debug] Making relative and fixing separator: { /var/tmp/EclipsePlugin.unitTest.1193664663685,
/var/tmp/EclipsePlugin.unitTest.1193664663685/target/test-classes, false }.
[debug] Adding eclipse source dir: { src-test-resources, target/test-classes, true, false,
null, null }.
Tests run: 5, Failures: 0, Errors: 0, Skipped: 0, Time elapsed: 0.505 sec
Running org.apache.maven.plugin.eclipse.EclipseToMavenTest
Tests run: 5, Failures: 0, Errors: 0, Skipped: 0, Time elapsed: 0.034 sec
Running org.apache.maven.plugin.eclipse.MakeArtifactsTest
Tests run: 5, Failures: 0, Errors: 0, Skipped: 0, Time elapsed: 0.006 sec

Results :

Failed tests: 
  testProject2(org.apache.maven.plugin.eclipse.RadPluginTest)

Tests run: 67, Failures: 1, Errors: 0, Skipped: 0

[INFO] ------------------------------------------------------------------------
[ERROR] BUILD FAILURE
[INFO] ------------------------------------------------------------------------
[INFO] There are test failures.

Please refer to /export/home/build/data/continuum/checkouts/17/target/surefire-reports for
the individual test results.
[INFO] ------------------------------------------------------------------------
[INFO] For more information, run Maven with the -e switch
[INFO] ------------------------------------------------------------------------
[INFO] Total time: 5 minutes 7 seconds
[INFO] Finished at: Mon Oct 29 13:31:03 GMT+00:00 2007
[INFO] Final Memory: 28M/50M
[INFO] ------------------------------------------------------------------------

****************************************************************************



Mime
View raw message