maven-notifications mailing list archives

Site index · List index
Message view « Date » · « Thread »
Top « Date » · « Thread »
From "Continuum@maven.zones.apache.org" <contin...@maven.zones.apache.org>
Subject [continuum] BUILD FAILURE: Integration Test Executor
Date Mon, 29 Oct 2007 16:54:54 GMT
Online report : http://maven.zones.apache.org/continuum/buildResult.action?buildId=32107&projectId=514

Build statistics:
  State: Failed
  Previous State: Failed
  Started at: Mon 29 Oct 2007 16:54:11 +0000
  Finished at: Mon 29 Oct 2007 16:54:51 +0000
  Total time: 39s
  Build Trigger: Schedule
  Build Number: 14
  Exit code: 1
  Building machine hostname: maven.zones.apache.org
  Operating system : SunOS(unknown)
  Java Home version : 
          java version "1.4.2_09"
          Java(TM) 2 Runtime Environment, Standard Edition (build 1.4.2_09-b05)
          Java HotSpot(TM) Client VM (build 1.4.2_09-b05, mixed mode)
        
  Builder version :
          Maven version: 2.0.7
          Java version: 1.4.2_09
          OS name: "sunos" version: "5.10" arch: "x86"
    
****************************************************************************
SCM Changes:
****************************************************************************
No files changed

****************************************************************************
Dependencies Changes:
****************************************************************************
org.apache.maven.its:core-integration-tests:2.1-SNAPSHOT


****************************************************************************
Build Defintion:
****************************************************************************
POM filename: pom.xml
Goals: clean install   
Arguments: --batch-mode --non-recursive -Pstandard
Build Fresh: false
Always Build: false
Default Build Definition: true
Schedule: DEFAULT_SCHEDULE
Profile Name: JDK 1.4.2
Description: 


****************************************************************************
Test Summary:
****************************************************************************
Tests: 0
Failures: 0
Total time: 0

****************************************************************************
Output:
****************************************************************************
[INFO] Scanning for projects...
[INFO] ----------------------------------------------------------------------------
[INFO] Building Integration Test Executor
[INFO]    task-segment: [clean, install]
[INFO] ----------------------------------------------------------------------------
[INFO] [clean:clean]
[INFO] Deleting directory /export/home/build/data/continuum/checkouts/514/target
[INFO] [dependency:unpack {execution: default}]
[INFO] Configured Artifact: org.apache.maven:maven-embedder:bin:2.1-SNAPSHOT:tar.gz
[INFO] Unpacking /export/home/build/.m2/repository/org/apache/maven/maven-embedder/2.1-SNAPSHOT/maven-embedder-2.1-SNAPSHOT-bin.tar.gzto
 /export/home/build/data/continuum/checkouts/514/target/maven-installation
with Includes null and excludes:null
[INFO] Expanding /export/home/build/.m2/repository/org/apache/maven/maven-embedder/2.1-SNAPSHOT/maven-embedder-2.1-SNAPSHOT-bin.tar.gz
to /var/tmp/tmp42265.tar
[INFO] Expanding: /var/tmp/tmp42265.tar into /export/home/build/data/continuum/checkouts/514/target/maven-installation
[INFO] [antrun:run {execution: default}]
[INFO] Executing tasks
[INFO] Executed tasks
[INFO] [resources:resources]
[INFO] Using default encoding to copy filtered resources.
[INFO] Resource directory does not exist: /export/home/build/data/continuum/checkouts/514/src/main/resources
[INFO] [compiler:compile]
[INFO] No sources to compile
[INFO] [resources:testResources]
[INFO] Using default encoding to copy filtered resources.
[INFO] Resource directory does not exist: /export/home/build/data/continuum/checkouts/514/src/test/resources
[INFO] [compiler:testCompile]
[INFO] Compiling 1 source file to /export/home/build/data/continuum/checkouts/514/target/test-classes
[INFO] [surefire:test]
[INFO] Surefire report directory: /export/home/build/data/continuum/checkouts/514/target/surefire-reports
[INFO] ------------------------------------------------------------------------
[ERROR] BUILD ERROR
[INFO] ------------------------------------------------------------------------
[INFO] org.apache.maven.its.Suite; nested exception is org.apache.maven.it.VerificationException:
Illegal maven output: String 'Maven version: ' not found in the following output:
Exception in thread "main" java.lang.NoClassDefFoundError: org/codehaus/plexus/classworlds/launcher/Launcher;
nested exception is org.apache.maven.surefire.testset.TestSetFailedException: org.apache.maven.its.Suite;
nested exception is org.apache.maven.it.VerificationException: Illegal maven output: String
'Maven version: ' not found in the following output:
Exception in thread "main" java.lang.NoClassDefFoundError: org/codehaus/plexus/classworlds/launcher/Launcher

[INFO] ------------------------------------------------------------------------
[INFO] For more information, run Maven with the -e switch
[INFO] ------------------------------------------------------------------------
[INFO] Total time: 37 seconds
[INFO] Finished at: Mon Oct 29 16:54:51 GMT+00:00 2007
[INFO] Final Memory: 13M/24M
[INFO] ------------------------------------------------------------------------

****************************************************************************



Mime
View raw message