maven-notifications mailing list archives

Site index · List index
Message view « Date » · « Thread »
Top « Date » · « Thread »
From "Continuum@maven.zones.apache.org" <contin...@maven.zones.apache.org>
Subject [continuum] BUILD FAILURE: Continuum Web APP
Date Thu, 04 Oct 2007 21:34:37 GMT
Online report : http://maven.zones.apache.org/continuum/buildResult.action?buildId=26560&projectId=115

Build statistics:
  State: Failed
  Previous State: Ok
  Started at: Thu 4 Oct 2007 21:33:50 +0000
  Finished at: Thu 4 Oct 2007 21:34:34 +0000
  Total time: 43s
  Build Trigger: Schedule
  Build Number: 248
  Exit code: 1
  Building machine hostname: maven.zones.apache.org
  Operating system : SunOS(unknown)
  Java Home version : 
          java version "1.5.0_12"
          Java(TM) 2 Runtime Environment, Standard Edition (build 1.5.0_12-b04)
          Java HotSpot(TM) Server VM (build 1.5.0_12-b04, mixed mode)
        
  Builder version :
          Maven version: 2.0.7
          Java version: 1.5.0_12
          OS name: "sunos" version: "5.10" arch: "x86"
    
****************************************************************************
SCM Changes:
****************************************************************************
Changed: no author @ no date
Comment: no comment
Files changed:
  src/main/java/org/apache/maven/continuum/web/action/admin/ProfileAction.java ( no revision
)

****************************************************************************
Dependencies Changes:
****************************************************************************
org.apache.maven.continuum:continuum-configuration:1.1-beta-4-SNAPSHOT

org.apache.maven.continuum:continuum-core:1.1-beta-4-SNAPSHOT

org.apache.maven.continuum:continuum-security:1.1-beta-4-SNAPSHOT

org.apache.maven.continuum:continuum-notifier-irc:1.1-beta-4-SNAPSHOT

org.apache.maven.continuum:continuum-notifier-jabber:1.1-beta-4-SNAPSHOT

org.apache.maven.continuum:continuum-notifier-msn:1.1-beta-4-SNAPSHOT

org.apache.maven.continuum:continuum-notifier-wagon:1.1-beta-4-SNAPSHOT

org.apache.maven.continuum:continuum-xmlrpc-server:1.1-beta-4-SNAPSHOT

org.apache.maven.continuum:continuum-parent:1.1-beta-4-SNAPSHOT


****************************************************************************
Build Defintion:
****************************************************************************
POM filename: pom.xml
Goals: clean install   
Arguments: --batch-mode --non-recursive
Build Fresh: false
Always Build: false
Default Build Definition: true
Schedule: DEFAULT_SCHEDULE
Profile Name: Maven-2.0.7
Description: 


****************************************************************************
Test Summary:
****************************************************************************
Tests: 0
Failures: 0
Total time: 0

****************************************************************************
Output:
****************************************************************************
[INFO] Scanning for projects...
[INFO] ----------------------------------------------------------------------------
[INFO] Building Continuum Web APP
[INFO]    task-segment: [clean, install]
[INFO] ----------------------------------------------------------------------------
[INFO] [clean:clean]
[INFO] Deleting directory /export/home/build/data/continuum/checkouts/115/target
[INFO] Deleting directory /export/home/build/data/continuum/checkouts/115/target/classes
[INFO] Deleting directory /export/home/build/data/continuum/checkouts/115/target/test-classes
[INFO] Deleting directory /export/home/build/data/continuum/checkouts/115/target/site
[INFO] Deleting file-set: /export/home/build/data/continuum/checkouts/115/src/main/webapp
(included: [META-INF, images/redback, template/, template/redback, WEB-INF/classes, WEB-INF/lib,
WEB-INF/database, WEB-INF/logs, redback, css/redback, WEB-INF/jsp/redback, WEB-INF/template/redback,
WEB-INF/build-output-directory, WEB-INF/working-directory, WEB-INF/logs, WEB-INF/temp], excluded:
[])
[INFO] [modello:java {execution: web summary model classes}]
[INFO] outputDirectory: /export/home/build/data/continuum/checkouts/115/target/generated-sources/modello
[INFO] Generating current version: 1.0.0
[INFO] [modello:java {execution: session model classes}]
[INFO] outputDirectory: /export/home/build/data/continuum/checkouts/115/target/generated-sources/modello
[INFO] Generating current version: 1.0.0
[INFO] [plexus:descriptor {execution: generate}]
[INFO] Setting property: classpath.resource.loader.class => 'org.codehaus.plexus.velocity.ContextClassLoaderResourceLoader'.
[INFO] Setting property: velocimacro.messages.on => 'false'.
[INFO] Setting property: resource.loader => 'classpath'.
[INFO] Setting property: resource.manager.logwhenfound => 'false'.
[INFO] [remote-resources:process {execution: default}]
[INFO] [antrun:run {execution: default}]
[INFO] Executing tasks
     [copy] Copying 1 file to /export/home/build/data/continuum/checkouts/115/target/appserver-base
     [copy] Copying 1 file to /export/home/build/data/continuum/checkouts/115/src/main/webapp/template
[INFO] Executed tasks
[INFO] [resources:resources]
[INFO] Using default encoding to copy filtered resources.
[INFO] [compiler:compile]
[INFO] Compiling 92 source files to /export/home/build/data/continuum/checkouts/115/target/classes
[INFO] ------------------------------------------------------------------------
[ERROR] BUILD FAILURE
[INFO] ------------------------------------------------------------------------
[INFO] Compilation failure
/export/home/build/data/continuum/checkouts/115/src/main/java/org/apache/maven/continuum/web/action/admin/ProfileAction.java:[167,22]
cannot find symbol
symbol  : method removeInstallationFromProfile(org.apache.maven.continuum.model.system.Profile,org.apache.maven.continuum.model.system.Installation)
location: interface org.apache.maven.continuum.profile.ProfileService



/export/home/build/data/continuum/checkouts/115/src/main/java/org/apache/maven/continuum/web/action/admin/ProfileAction.java:[167,22]
cannot find symbol
symbol  : method removeInstallationFromProfile(org.apache.maven.continuum.model.system.Profile,org.apache.maven.continuum.model.system.Installation)
location: interface org.apache.maven.continuum.profile.ProfileService


[INFO] ------------------------------------------------------------------------
[INFO] For more information, run Maven with the -e switch
[INFO] ------------------------------------------------------------------------
[INFO] Total time: 40 seconds
[INFO] Finished at: Thu Oct 04 21:34:33 GMT+00:00 2007
[INFO] Final Memory: 33M/313M
[INFO] ------------------------------------------------------------------------

****************************************************************************



Mime
View raw message