maven-notifications mailing list archives

Site index · List index
Message view « Date » · « Thread »
Top « Date » · « Thread »
From "Continuum@maven.zones.apache.org" <contin...@maven.zones.apache.org>
Subject [continuum] BUILD FAILURE: Maven Embedder
Date Mon, 22 Oct 2007 07:14:59 GMT
Online report : http://maven.zones.apache.org/continuum/buildResult.action?buildId=29645&projectId=486

Build statistics:
  State: Failed
  Previous State: Ok
  Started at: Mon 22 Oct 2007 07:14:44 +0000
  Finished at: Mon 22 Oct 2007 07:14:52 +0000
  Total time: 7s
  Build Trigger: Schedule
  Build Number: 55
  Exit code: 1
  Building machine hostname: maven.zones.apache.org
  Operating system : SunOS(unknown)
  Java Home version : 
          java version "1.4.2_06"
          Java(TM) 2 Runtime Environment, Standard Edition (build 1.4.2_06-b03)
          Java HotSpot(TM) Client VM (build 1.4.2_06-b03, mixed mode)
        
  Builder version :
          Maven version: 2.0.7
          Java version: 1.4.2_06
          OS name: "sunos" version: "5.10" arch: "x86"
    
****************************************************************************
SCM Changes:
****************************************************************************
Changed: jvanzyl @ Mon 22 Oct 2007 07:07:29 +0000
Comment: o use the programmatic setup of the container
o use the new active collections in Pleuxus
Files changed:
  /maven/components/trunk/build.properties ( 587015 )
  /maven/components/trunk/build.xml ( 587015 )
  /maven/components/trunk/maven-core/pom.xml ( 587015 )
  /maven/components/trunk/maven-core/src/main/java/org/apache/maven/lifecycle/binding/DefaultLifecycleBindingManager.java
( 587015 )
  /maven/components/trunk/maven-core/src/main/java/org/apache/maven/plugin/DefaultPluginManager.java
( 587015 )
  /maven/components/trunk/maven-core/src/main/java/org/apache/maven/plugin/MavenPluginCollector.java
( 587015 )
  /maven/components/trunk/maven-core/src/main/java/org/apache/maven/plugin/MavenPluginDiscoverer.java
( 587015 )
  /maven/components/trunk/maven-core/src/main/resources/META-INF/plexus/components.xml ( 587015
)
  /maven/components/trunk/maven-core/src/main/resources/META-INF/plexus/plexus.xml ( 587015
)
  /maven/components/trunk/maven-embedder/src/main/java/org/apache/maven/embedder/MavenEmbedder.java
( 587015 )
  /maven/components/trunk/maven-embedder/src/test/java/org/apache/maven/embedder/MavenEmbedderProjectWithExtensionReadingTest.java
( 587015 )
  /maven/components/trunk/maven-embedder/src/test/projects/complex-project/maven-core/src/main/resources/META-INF/plexus/components.xml
( 587015 )
  /maven/components/trunk/pom.xml ( 587015 )

****************************************************************************
Dependencies Changes:
****************************************************************************
org.apache.maven:maven-core:2.1-SNAPSHOT


****************************************************************************
Build Defintion:
****************************************************************************
POM filename: pom.xml
Goals: clean install   
Arguments: --batch-mode --non-recursive -Pstandard
Build Fresh: false
Always Build: false
Default Build Definition: true
Schedule: DEFAULT_SCHEDULE
Profile Name: j2sdk1.4.2_06
Description: 


****************************************************************************
Test Summary:
****************************************************************************
Tests: 1
Failures: 0
Total time: 24

****************************************************************************
Output:
****************************************************************************
[INFO] Scanning for projects...
[INFO] ----------------------------------------------------------------------------
[INFO] Building Maven Embedder
[INFO]    task-segment: [clean, install]
[INFO] ----------------------------------------------------------------------------
[INFO] [clean:clean]
[INFO] Deleting directory /export/home/build/data/continuum/checkouts/486/target
[INFO] Deleting directory /export/home/build/data/continuum/checkouts/486/target/classes
[INFO] Deleting directory /export/home/build/data/continuum/checkouts/486/target/test-classes
[INFO] Deleting directory /export/home/build/data/continuum/checkouts/486/target/site
[INFO] [resources:resources]
[INFO] Using default encoding to copy filtered resources.
[INFO] Copying 2 resources
[INFO] [compiler:compile]
[INFO] Compiling 26 source files to /export/home/build/data/continuum/checkouts/486/target/classes
[INFO] ------------------------------------------------------------------------
[ERROR] BUILD FAILURE
[INFO] ------------------------------------------------------------------------
[INFO] Compilation failure
/export/home/build/data/continuum/checkouts/486/src/main/java/org/apache/maven/embedder/MavenEmbedder.java:[648,40]
cannot resolve symbol
symbol  : method addComponentDiscoverer (org.apache.maven.plugin.MavenPluginDiscoverer)
location: class org.codehaus.plexus.DefaultContainerConfiguration



/export/home/build/data/continuum/checkouts/486/src/main/java/org/apache/maven/embedder/MavenEmbedder.java:[648,40]
cannot resolve symbol
symbol  : method addComponentDiscoverer (org.apache.maven.plugin.MavenPluginDiscoverer)
location: class org.codehaus.plexus.DefaultContainerConfiguration


[INFO] ------------------------------------------------------------------------
[INFO] For more information, run Maven with the -e switch
[INFO] ------------------------------------------------------------------------
[INFO] Total time: 5 seconds
[INFO] Finished at: Mon Oct 22 07:14:52 GMT+00:00 2007
[INFO] Final Memory: 7M/19M
[INFO] ------------------------------------------------------------------------

****************************************************************************



Mime
View raw message