maven-notifications mailing list archives

Site index · List index
Message view « Date » · « Thread »
Top « Date » · « Thread »
From "Continuum@maven.zones.apache.org" <contin...@maven.zones.apache.org>
Subject [continuum] BUILD ERROR: Maven Eclipse Plugin
Date Mon, 04 Feb 2008 05:09:29 GMT
Online report : http://maven.zones.apache.org/continuum/buildResult.action?buildId=41289&projectId=17

Build statistics:
  State: Error
  Previous State: Failed
  Started at: Mon 4 Feb 2008 04:16:15 +0000
  Finished at: Mon 4 Feb 2008 05:07:57 +0000
  Total time: 51m 41s
  Build Trigger: Schedule
  Build Number: 97
  Exit code: 0
  Building machine hostname: maven.zones.apache.org
  Operating system : SunOS(unknown)
  Java Home version : 
          java version "1.4.2_09"
          Java(TM) 2 Runtime Environment, Standard Edition (build 1.4.2_09-b05)
          Java HotSpot(TM) Client VM (build 1.4.2_09-b05, mixed mode)
        
  Builder version :
          Maven version: 2.0.7
          Java version: 1.4.2_09
          OS name: "sunos" version: "5.10" arch: "x86"
    
****************************************************************************
SCM Changes:
****************************************************************************
No files changed

****************************************************************************
Dependencies Changes:
****************************************************************************
No dependencies changed


****************************************************************************
Build Defintion:
****************************************************************************
POM filename: pom.xml
Goals: clean install   
Arguments: -B -N
Build Fresh: false
Always Build: false
Default Build Definition: true
Schedule: DEFAULT_SCHEDULE
Profile Name: JDK 1.4.2
Description: 


****************************************************************************
Test Summary:
****************************************************************************
Tests: 88
Failures: 3
Total time: 2402832

****************************************************************************
Build Error:
****************************************************************************
org.apache.maven.continuum.execution.ContinuumBuildCancelledException: The build was cancelled
	at org.apache.maven.continuum.execution.AbstractBuildExecutor.executeShellCommand(AbstractBuildExecutor.java:216)
	at org.apache.maven.continuum.execution.maven.m2.MavenTwoBuildExecutor.build(MavenTwoBuildExecutor.java:149)
	at org.apache.maven.continuum.core.action.ExecuteBuilderContinuumAction.execute(ExecuteBuilderContinuumAction.java:140)
	at org.apache.maven.continuum.buildcontroller.DefaultBuildController.performAction(DefaultBuildController.java:417)
	at org.apache.maven.continuum.buildcontroller.DefaultBuildController.build(DefaultBuildController.java:156)
	at org.apache.maven.continuum.buildcontroller.BuildProjectTaskExecutor.executeTask(BuildProjectTaskExecutor.java:50)
	at org.codehaus.plexus.taskqueue.execution.ThreadedTaskQueueExecutor$ExecutorRunnable$1.run(ThreadedTaskQueueExecutor.java:116)
	at edu.emory.mathcs.backport.java.util.concurrent.Executors$RunnableAdapter.call(Executors.java:442)
	at edu.emory.mathcs.backport.java.util.concurrent.FutureTask.run(FutureTask.java:176)
	at edu.emory.mathcs.backport.java.util.concurrent.ThreadPoolExecutor$Worker.runTask(ThreadPoolExecutor.java:665)
	at edu.emory.mathcs.backport.java.util.concurrent.ThreadPoolExecutor$Worker.run(ThreadPoolExecutor.java:690)
	at java.lang.Thread.run(Thread.java:595)
Caused by: org.codehaus.plexus.util.cli.CommandLineException: Error while executing external
command, process killed.
	at org.codehaus.plexus.util.cli.CommandLineUtils.executeCommandLine(CommandLineUtils.java:164)
	at org.codehaus.plexus.util.cli.CommandLineUtils.executeCommandLine(CommandLineUtils.java:89)
	at org.apache.maven.continuum.utils.shell.DefaultShellCommandHelper.executeShellCommand(DefaultShellCommandHelper.java:114)
	at org.apache.maven.continuum.utils.shell.DefaultShellCommandHelper.executeShellCommand(DefaultShellCommandHelper.java:59)
	at org.apache.maven.continuum.execution.AbstractBuildExecutor.executeShellCommand(AbstractBuildExecutor.java:204)
	... 11 more
Caused by: java.lang.InterruptedException
	at java.lang.Object.wait(Native Method)
	at java.lang.Object.wait(Object.java:474)
	at java.lang.UNIXProcess.waitFor(UNIXProcess.java:115)
	at org.codehaus.plexus.util.cli.CommandLineUtils.executeCommandLine(CommandLineUtils.java:128)
	... 15 more


****************************************************************************
Test Failures:
****************************************************************************

org.apache.maven.plugin.eclipse.EclipsePluginTest
    testProject16
  org.apache.maven.plugin.eclipse.ExecutionFailedException: Failed to execute build.
POM: /export/home/build/data/continuum/checkouts/17/target/test-classes/projects/project-16/pom.xml
Goals: org.apache.maven.plugins:maven-eclipse-plugin:test:clean, org.apache.maven.plugins:maven-eclipse-plugin:test:eclipse
Exit Code: 1
Error: null
Build Log: file:/export/home/build/data/continuum/checkouts/17/target/surefire-reports/build-output/org.apache.maven.plugin.eclipse.EclipsePluginTest_testProject16.build.log
 (Resulting exit code: 1)
	at org.apache.maven.plugin.eclipse.AbstractEclipsePluginTestCase.executeMaven(AbstractEclipsePluginTestCase.java:399)
	at org.apache.maven.plugin.eclipse.AbstractEclipsePluginTestCase.executeMaven(AbstractEclipsePluginTestCase.java:340)
	at org.apache.maven.plugin.eclipse.AbstractEclipsePluginTestCase.testProject(AbstractEclipsePluginTestCase.java:229)
	at org.apache.maven.plugin.eclipse.AbstractEclipsePluginTestCase.testProject(AbstractEclipsePluginTestCase.java:189)
	at org.apache.maven.plugin.eclipse.EclipsePluginTest.testProject16(EclipsePluginTest.java:178)
	at org.apache.maven.plugin.eclipse.EclipsePluginTest.testProject16(EclipsePluginTest.java:178)
	at sun.reflect.NativeMethodAccessorImpl.invoke0(Native Method)
	at sun.reflect.NativeMethodAccessorImpl.invoke(NativeMethodAccessorImpl.java:39)
	at sun.reflect.DelegatingMethodAccessorImpl.invoke(DelegatingMethodAccessorImpl.java:25)
	at java.lang.reflect.Method.invoke(Method.java:324)
	at junit.framework.TestCase.runTest(TestCase.java:164)
	at junit.framework.TestCase.runBare(TestCase.java:130)
	at junit.framework.TestResult$1.protect(TestResult.java:106)
	at junit.framework.TestResult.runProtected(TestResult.java:124)
	at junit.framework.TestResult.run(TestResult.java:109)
	at junit.framework.TestCase.run(TestCase.java:120)
	at junit.framework.TestSuite.runTest(TestSuite.java:230)
	at junit.framework.TestSuite.run(TestSuite.java:225)
	at sun.reflect.NativeMethodAccessorImpl.invoke0(Native Method)
	at sun.reflect.NativeMethodAccessorImpl.invoke(NativeMethodAccessorImpl.java:39)
	at sun.reflect.DelegatingMethodAccessorImpl.invoke(DelegatingMethodAccessorImpl.java:25)
	at java.lang.reflect.Method.invoke(Method.java:324)
	at org.apache.maven.surefire.junit.JUnitTestSet.execute(JUnitTestSet.java:213)
	at org.apache.maven.surefire.suite.AbstractDirectoryTestSuite.executeTestSet(AbstractDirectoryTestSuite.java:138)
	at org.apache.maven.surefire.suite.AbstractDirectoryTestSuite.execute(AbstractDirectoryTestSuite.java:125)
	at org.apache.maven.surefire.Surefire.run(Surefire.java:132)
	at sun.reflect.NativeMethodAccessorImpl.invoke0(Native Method)
	at sun.reflect.NativeMethodAccessorImpl.invoke(NativeMethodAccessorImpl.java:39)
	at sun.reflect.DelegatingMethodAccessorImpl.invoke(DelegatingMethodAccessorImpl.java:25)
	at java.lang.reflect.Method.invoke(Method.java:324)
	at org.apache.maven.surefire.booter.SurefireBooter.runSuitesInProcess(SurefireBooter.java:308)
	at org.apache.maven.surefire.booter.SurefireBooter.main(SurefireBooter.java:879)


    testProject17
  org.apache.maven.plugin.eclipse.ExecutionFailedException: Failed to execute build.
POM: /export/home/build/data/continuum/checkouts/17/target/test-classes/projects/project-17/pom.xml
Goals: org.apache.maven.plugins:maven-eclipse-plugin:test:clean, org.apache.maven.plugins:maven-eclipse-plugin:test:eclipse
Exit Code: 1
Error: null
Build Log: file:/export/home/build/data/continuum/checkouts/17/target/surefire-reports/build-output/org.apache.maven.plugin.eclipse.EclipsePluginTest_testProject17.build.log
 (Resulting exit code: 1)
	at org.apache.maven.plugin.eclipse.AbstractEclipsePluginTestCase.executeMaven(AbstractEclipsePluginTestCase.java:399)
	at org.apache.maven.plugin.eclipse.AbstractEclipsePluginTestCase.executeMaven(AbstractEclipsePluginTestCase.java:340)
	at org.apache.maven.plugin.eclipse.AbstractEclipsePluginTestCase.testProject(AbstractEclipsePluginTestCase.java:229)
	at org.apache.maven.plugin.eclipse.AbstractEclipsePluginTestCase.testProject(AbstractEclipsePluginTestCase.java:189)
	at org.apache.maven.plugin.eclipse.EclipsePluginTest.testProject17(EclipsePluginTest.java:190)
	at org.apache.maven.plugin.eclipse.EclipsePluginTest.testProject17(EclipsePluginTest.java:190)
	at sun.reflect.NativeMethodAccessorImpl.invoke0(Native Method)
	at sun.reflect.NativeMethodAccessorImpl.invoke(NativeMethodAccessorImpl.java:39)
	at sun.reflect.DelegatingMethodAccessorImpl.invoke(DelegatingMethodAccessorImpl.java:25)
	at java.lang.reflect.Method.invoke(Method.java:324)
	at junit.framework.TestCase.runTest(TestCase.java:164)
	at junit.framework.TestCase.runBare(TestCase.java:130)
	at junit.framework.TestResult$1.protect(TestResult.java:106)
	at junit.framework.TestResult.runProtected(TestResult.java:124)
	at junit.framework.TestResult.run(TestResult.java:109)
	at junit.framework.TestCase.run(TestCase.java:120)
	at junit.framework.TestSuite.runTest(TestSuite.java:230)
	at junit.framework.TestSuite.run(TestSuite.java:225)
	at sun.reflect.NativeMethodAccessorImpl.invoke0(Native Method)
	at sun.reflect.NativeMethodAccessorImpl.invoke(NativeMethodAccessorImpl.java:39)
	at sun.reflect.DelegatingMethodAccessorImpl.invoke(DelegatingMethodAccessorImpl.java:25)
	at java.lang.reflect.Method.invoke(Method.java:324)
	at org.apache.maven.surefire.junit.JUnitTestSet.execute(JUnitTestSet.java:213)
	at org.apache.maven.surefire.suite.AbstractDirectoryTestSuite.executeTestSet(AbstractDirectoryTestSuite.java:138)
	at org.apache.maven.surefire.suite.AbstractDirectoryTestSuite.execute(AbstractDirectoryTestSuite.java:125)
	at org.apache.maven.surefire.Surefire.run(Surefire.java:132)
	at sun.reflect.NativeMethodAccessorImpl.invoke0(Native Method)
	at sun.reflect.NativeMethodAccessorImpl.invoke(NativeMethodAccessorImpl.java:39)
	at sun.reflect.DelegatingMethodAccessorImpl.invoke(DelegatingMethodAccessorImpl.java:25)
	at java.lang.reflect.Method.invoke(Method.java:324)
	at org.apache.maven.surefire.booter.SurefireBooter.runSuitesInProcess(SurefireBooter.java:308)
	at org.apache.maven.surefire.booter.SurefireBooter.main(SurefireBooter.java:879)


    testMECLIPSE_56_encoding
  org.apache.maven.plugin.eclipse.ExecutionFailedException: Failed to execute build.
POM: /export/home/build/data/continuum/checkouts/17/target/test-classes/projects/MECLIPSE-56_encoding/pom.xml
Goals: org.apache.maven.plugins:maven-eclipse-plugin:test:clean, org.apache.maven.plugins:maven-eclipse-plugin:test:eclipse
Exit Code: 1
Error: null
Build Log: file:/export/home/build/data/continuum/checkouts/17/target/surefire-reports/build-output/org.apache.maven.plugin.eclipse.EclipsePluginTest_testMECLIPSE_56_encoding.build.log
 (Resulting exit code: 1)
	at org.apache.maven.plugin.eclipse.AbstractEclipsePluginTestCase.executeMaven(AbstractEclipsePluginTestCase.java:399)
	at org.apache.maven.plugin.eclipse.AbstractEclipsePluginTestCase.executeMaven(AbstractEclipsePluginTestCase.java:340)
	at org.apache.maven.plugin.eclipse.AbstractEclipsePluginTestCase.testProject(AbstractEclipsePluginTestCase.java:229)
	at org.apache.maven.plugin.eclipse.AbstractEclipsePluginTestCase.testProject(AbstractEclipsePluginTestCase.java:189)
	at org.apache.maven.plugin.eclipse.EclipsePluginTest.testMECLIPSE_56_encoding(EclipsePluginTest.java:449)
	at org.apache.maven.plugin.eclipse.EclipsePluginTest.testMECLIPSE_56_encoding(EclipsePluginTest.java:449)
	at sun.reflect.NativeMethodAccessorImpl.invoke0(Native Method)
	at sun.reflect.NativeMethodAccessorImpl.invoke(NativeMethodAccessorImpl.java:39)
	at sun.reflect.DelegatingMethodAccessorImpl.invoke(DelegatingMethodAccessorImpl.java:25)
	at java.lang.reflect.Method.invoke(Method.java:324)
	at junit.framework.TestCase.runTest(TestCase.java:164)
	at junit.framework.TestCase.runBare(TestCase.java:130)
	at junit.framework.TestResult$1.protect(TestResult.java:106)
	at junit.framework.TestResult.runProtected(TestResult.java:124)
	at junit.framework.TestResult.run(TestResult.java:109)
	at junit.framework.TestCase.run(TestCase.java:120)
	at junit.framework.TestSuite.runTest(TestSuite.java:230)
	at junit.framework.TestSuite.run(TestSuite.java:225)
	at sun.reflect.NativeMethodAccessorImpl.invoke0(Native Method)
	at sun.reflect.NativeMethodAccessorImpl.invoke(NativeMethodAccessorImpl.java:39)
	at sun.reflect.DelegatingMethodAccessorImpl.invoke(DelegatingMethodAccessorImpl.java:25)
	at java.lang.reflect.Method.invoke(Method.java:324)
	at org.apache.maven.surefire.junit.JUnitTestSet.execute(JUnitTestSet.java:213)
	at org.apache.maven.surefire.suite.AbstractDirectoryTestSuite.executeTestSet(AbstractDirectoryTestSuite.java:138)
	at org.apache.maven.surefire.suite.AbstractDirectoryTestSuite.execute(AbstractDirectoryTestSuite.java:125)
	at org.apache.maven.surefire.Surefire.run(Surefire.java:132)
	at sun.reflect.NativeMethodAccessorImpl.invoke0(Native Method)
	at sun.reflect.NativeMethodAccessorImpl.invoke(NativeMethodAccessorImpl.java:39)
	at sun.reflect.DelegatingMethodAccessorImpl.invoke(DelegatingMethodAccessorImpl.java:25)
	at java.lang.reflect.Method.invoke(Method.java:324)
	at org.apache.maven.surefire.booter.SurefireBooter.runSuitesInProcess(SurefireBooter.java:308)
	at org.apache.maven.surefire.booter.SurefireBooter.main(SurefireBooter.java:879)


  

Mime
View raw message