maven-notifications mailing list archives

Site index · List index
Message view « Date » · « Thread »
Top « Date » · « Thread »
From "Continuum@maven.zones.apache.org" <contin...@maven.zones.apache.org>
Subject [continuum] BUILD FAILURE: Maven Javadoc Plugin
Date Mon, 04 Feb 2008 05:27:09 GMT
Online report : http://maven.zones.apache.org/continuum/buildResult.action?buildId=41303&projectId=23

Build statistics:
  State: Failed
  Previous State: Ok
  Started at: Mon 4 Feb 2008 05:25:59 +0000
  Finished at: Mon 4 Feb 2008 05:26:03 +0000
  Total time: 3s
  Build Trigger: Schedule
  Build Number: 137
  Exit code: 1
  Building machine hostname: maven.zones.apache.org
  Operating system : SunOS(unknown)
  Java Home version : 
          java version "1.4.2_09"
          Java(TM) 2 Runtime Environment, Standard Edition (build 1.4.2_09-b05)
          Java HotSpot(TM) Client VM (build 1.4.2_09-b05, mixed mode)
        
  Builder version :
          Maven version: 2.0.7
          Java version: 1.4.2_09
          OS name: "sunos" version: "5.10" arch: "x86"
    
****************************************************************************
SCM Changes:
****************************************************************************
Changed: no author @ no date
Comment: no comment
Files changed:
  src/test/java/org/apache/maven/plugin/javadoc/JavadocReportTest.java ( no revision )
  src/test/resources/unit/resources-test/resources-test-plugin-config.xml ( no revision )
  src/test/resources/unit/aggregate-resources-test/aggregate-resources-test-plugin-config.xml
( no revision )
  src/main/java/org/apache/maven/plugin/javadoc/AbstractJavadocMojo.java ( no revision )
  src/main/java/org/apache/maven/plugin/javadoc/TestJavadocReport.java ( no revision )
  src/main/java/org/apache/maven/plugin/javadoc/JavadocJar.java ( no revision )
  src/main/java/org/apache/maven/plugin/javadoc/JavadocUtil.java ( no revision )
  src/it/MJAVADOC-172/verify.bsh ( no revision )
  src/it/MJAVADOC-172/test-module1/src/main/java/Test.java ( no revision )
  src/it/MJAVADOC-172/test-module1/pom.xml ( no revision )
  src/it/MJAVADOC-172/test-module2/src/main/java/Test.java ( no revision )
  src/it/MJAVADOC-172/test-module2/pom.xml ( no revision )
  src/it/MJAVADOC-172/pom.xml ( no revision )
  pom.xml ( no revision )

****************************************************************************
Dependencies Changes:
****************************************************************************
No dependencies changed


****************************************************************************
Build Defintion:
****************************************************************************
POM filename: pom.xml
Goals: clean install   
Arguments: -B -N
Build Fresh: false
Always Build: false
Default Build Definition: true
Schedule: DEFAULT_SCHEDULE
Profile Name: JDK 1.4.2
Description: 


****************************************************************************
Test Summary:
****************************************************************************
Tests: 35
Failures: 0
Total time: 37743

****************************************************************************
Output:
****************************************************************************
[INFO] Scanning for projects...
[INFO] ------------------------------------------------------------------------
[ERROR] BUILD FAILURE
[INFO] ------------------------------------------------------------------------
[INFO] Unable to build project '/export/home/build/data/continuum/checkouts/23/pom.xml; it
requires Maven version 2.0.8
[INFO] ------------------------------------------------------------------------
[INFO] For more information, run Maven with the -e switch
[INFO] ------------------------------------------------------------------------
[INFO] Total time: < 1 second
[INFO] Finished at: Mon Feb 04 05:26:03 GMT+00:00 2008
[INFO] Final Memory: 1M/3M
[INFO] ------------------------------------------------------------------------

****************************************************************************



Mime
View raw message