maven-notifications mailing list archives

Site index · List index
Message view « Date » · « Thread »
Top « Date » · « Thread »
From "Continuum@maven.zones.apache.org" <contin...@maven.zones.apache.org>
Subject [continuum] BUILD FAILURE: Archiva Web :: Application
Date Mon, 04 Feb 2008 09:21:15 GMT
Online report : http://maven.zones.apache.org/continuum/buildResult.action?buildId=41361&projectId=296

Build statistics:
  State: Failed
  Previous State: Failed
  Started at: Mon 4 Feb 2008 09:18:22 +0000
  Finished at: Mon 4 Feb 2008 09:20:56 +0000
  Total time: 2m 34s
  Build Trigger: Schedule
  Build Number: 214
  Exit code: 1
  Building machine hostname: maven.zones.apache.org
  Operating system : SunOS(unknown)
  Java Home version : 
          java version "1.5.0_13"
          Java(TM) 2 Runtime Environment, Standard Edition (build 1.5.0_13-b05)
          Java HotSpot(TM) Server VM (build 1.5.0_13-b05, mixed mode)
        
  Builder version :
          Maven version: 2.0.7
          Java version: 1.5.0_13
          OS name: "sunos" version: "5.10" arch: "x86"
    
****************************************************************************
SCM Changes:
****************************************************************************
No files changed

****************************************************************************
Dependencies Changes:
****************************************************************************
org.apache.maven.archiva:archiva-proxy:1.1-SNAPSHOT

org.apache.maven.wagon:wagon-http:1.0-rc1-SNAPSHOT

org.apache.maven.wagon:wagon-file:1.0-rc1-SNAPSHOT


****************************************************************************
Build Defintion:
****************************************************************************
POM filename: pom.xml
Goals: clean install   
Arguments: --batch-mode --non-recursive
Build Fresh: false
Always Build: false
Default Build Definition: true
Schedule: DEFAULT_SCHEDULE
Description: 


****************************************************************************
Test Summary:
****************************************************************************
Tests: 2050
Failures: 2
Total time: 104533

****************************************************************************
Output:
****************************************************************************
[INFO] Scanning for projects...
[INFO] ----------------------------------------------------------------------------
[INFO] Building Archiva Web :: Application
[INFO]    task-segment: [clean, install]
[INFO] ----------------------------------------------------------------------------
[INFO] [clean:clean]
[INFO] Deleting directory /export/home/build/data/continuum/checkouts/296/target
[INFO] Deleting directory /export/home/build/data/continuum/checkouts/296/target/classes
[INFO] Deleting directory /export/home/build/data/continuum/checkouts/296/target/test-classes
[INFO] Deleting directory /export/home/build/data/continuum/checkouts/296/target/site
[INFO] Deleting file-set: /export/home/build/data/continuum/checkouts/296/src/main/webapp (included: [META-INF, archiva-applet.jar, images/redback, template/redback, WEB-INF/classes, WEB-INF/lib, WEB-INF/database, WEB-INF/logs, redback, css/redback, WEB-INF/jsp/redback, WEB-INF/template/redback, WEB-INF/logs, WEB-INF/temp, WEB-INF/jasperreports], excluded: [])
[INFO] [plexus:descriptor {execution: generate}]
[WARNING] POM for 'jpox:jpox:pom:1.1.9:compile' is invalid. It will be ignored for artifact resolution. Reason: Not a v4.0.0 POM. for project jpox:jpox at /export/home/build/.m2/repository/jpox/jpox/1.1.9/jpox-1.1.9.pom
[WARNING] POM for 'jpox:jpox:pom:1.1.9:compile' is invalid. It will be ignored for artifact resolution. Reason: Not a v4.0.0 POM. for project jpox:jpox at /export/home/build/.m2/repository/jpox/jpox/1.1.9/jpox-1.1.9.pom
[WARNING] POM for 'jpox:jpox:pom:1.1.9:compile' is invalid. It will be ignored for artifact resolution. Reason: Not a v4.0.0 POM. for project jpox:jpox at /export/home/build/.m2/repository/jpox/jpox/1.1.9/jpox-1.1.9.pom
[WARNING] POM for 'jpox:jpox:pom:1.1.9:compile' is invalid. It will be ignored for artifact resolution. Reason: Not a v4.0.0 POM. for project jpox:jpox at /export/home/build/.m2/repository/jpox/jpox/1.1.9/jpox-1.1.9.pom
[INFO] Setting property: classpath.resource.loader.class => 'org.codehaus.plexus.velocity.ContextClassLoaderResourceLoader'.
[INFO] Setting property: velocimacro.messages.on => 'false'.
[INFO] Setting property: resource.loader => 'classpath'.
[INFO] Setting property: resource.manager.logwhenfound => 'false'.
[INFO] [remote-resources:process {execution: default}]
[WARNING] Attempting to build MavenProject instance for Artifact of type: jar; constructing POM artifact instead.
[WARNING] Invalid project model for artifact [jpox:jpox:1.1.9]. It will be ignored by the remote resources Mojo.
[WARNING] POM for 'jpox:jpox:pom:1.1.9:compile' is invalid. It will be ignored for artifact resolution. Reason: Not a v4.0.0 POM. for project jpox:jpox at /export/home/build/.m2/repository/jpox/jpox/1.1.9/jpox-1.1.9.pom
[WARNING] POM for 'jpox:jpox:pom:1.1.9:compile' is invalid. It will be ignored for artifact resolution. Reason: Not a v4.0.0 POM. for project jpox:jpox at /export/home/build/.m2/repository/jpox/jpox/1.1.9/jpox-1.1.9.pom
[WARNING] POM for 'jpox:jpox:pom:1.1.9:compile' is invalid. It will be ignored for artifact resolution. Reason: Not a v4.0.0 POM. for project jpox:jpox at /export/home/build/.m2/repository/jpox/jpox/1.1.9/jpox-1.1.9.pom
[WARNING] POM for 'jpox:jpox:pom:1.1.9:compile' is invalid. It will be ignored for artifact resolution. Reason: Not a v4.0.0 POM. for project jpox:jpox at /export/home/build/.m2/repository/jpox/jpox/1.1.9/jpox-1.1.9.pom
[INFO] [antrun:run {execution: default}]
[INFO] Executing tasks
     [copy] Copying 2 files to /export/home/build/data/continuum/checkouts/296/target/appserver-base
[INFO] Executed tasks
[INFO] [resources:resources]
[INFO] Using default encoding to copy filtered resources.
[INFO] Copying 27 resources
[INFO] Copying 1 resource
[INFO] Copying 2 resources
[INFO] [dependency:copy {execution: copy}]
[INFO] Configured Artifact: org.apache.maven.archiva:archiva-applet:null:1.1-SNAPSHOT:jar
[INFO] Copying /export/home/build/.m2/repository/org/apache/maven/archiva/archiva-applet/1.1-SNAPSHOT/archiva-applet-1.1-SNAPSHOT.jar to /export/home/build/data/continuum/checkouts/296/src/main/webapp/archiva-applet.jar
[WARNING] POM for 'jpox:jpox:pom:1.1.9:compile' is invalid. It will be ignored for artifact resolution. Reason: Not a v4.0.0 POM. for project jpox:jpox at /export/home/build/.m2/repository/jpox/jpox/1.1.9/jpox-1.1.9.pom
[WARNING] POM for 'jpox:jpox:pom:1.1.9:compile' is invalid. It will be ignored for artifact resolution. Reason: Not a v4.0.0 POM. for project jpox:jpox at /export/home/build/.m2/repository/jpox/jpox/1.1.9/jpox-1.1.9.pom
[WARNING] POM for 'jpox:jpox:pom:1.1.9:compile' is invalid. It will be ignored for artifact resolution. Reason: Not a v4.0.0 POM. for project jpox:jpox at /export/home/build/.m2/repository/jpox/jpox/1.1.9/jpox-1.1.9.pom
[WARNING] POM for 'jpox:jpox:pom:1.1.9:compile' is invalid. It will be ignored for artifact resolution. Reason: Not a v4.0.0 POM. for project jpox:jpox at /export/home/build/.m2/repository/jpox/jpox/1.1.9/jpox-1.1.9.pom
[INFO] [compiler:compile]
[INFO] Compiling 66 source files to /export/home/build/data/continuum/checkouts/296/target/classes
[WARNING] POM for 'jpox:jpox:pom:1.1.9:compile' is invalid. It will be ignored for artifact resolution. Reason: Not a v4.0.0 POM. for project jpox:jpox at /export/home/build/.m2/repository/jpox/jpox/1.1.9/jpox-1.1.9.pom
[WARNING] POM for 'jpox:jpox:pom:1.1.9:compile' is invalid. It will be ignored for artifact resolution. Reason: Not a v4.0.0 POM. for project jpox:jpox at /export/home/build/.m2/repository/jpox/jpox/1.1.9/jpox-1.1.9.pom
[WARNING] POM for 'jpox:jpox:pom:1.1.9:compile' is invalid. It will be ignored for artifact resolution. Reason: Not a v4.0.0 POM. for project jpox:jpox at /export/home/build/.m2/repository/jpox/jpox/1.1.9/jpox-1.1.9.pom
[WARNING] POM for 'jpox:jpox:pom:1.1.9:compile' is invalid. It will be ignored for artifact resolution. Reason: Not a v4.0.0 POM. for project jpox:jpox at /export/home/build/.m2/repository/jpox/jpox/1.1.9/jpox-1.1.9.pom
[INFO] [war:inplace {execution: default}]
[INFO] Generating webapp in source directory... /export/home/build/data/continuum/checkouts/296/src/main/webapp
[INFO] Exploding webapp...
[INFO] Assembling webapp archiva-webapp in /export/home/build/data/continuum/checkouts/296/src/main/webapp
[INFO] Expanding: /export/home/build/.m2/repository/org/codehaus/plexus/redback/redback-xwork-content/1.0-alpha-4/redback-xwork-content-1.0-alpha-4.war into /export/home/build/data/continuum/checkouts/296/target/war/work/redback-xwork-content-1.0-alpha-4
[INFO] Overlaying 1 war(s).
[INFO] [resources:testResources]
[INFO] Using default encoding to copy filtered resources.
[INFO] Copying 12 resources
[INFO] Copying 2 resources
[WARNING] POM for 'jpox:jpox:pom:1.1.9:compile' is invalid. It will be ignored for artifact resolution. Reason: Not a v4.0.0 POM. for project jpox:jpox at /export/home/build/.m2/repository/jpox/jpox/1.1.9/jpox-1.1.9.pom
[WARNING] POM for 'jpox:jpox:pom:1.1.9:compile' is invalid. It will be ignored for artifact resolution. Reason: Not a v4.0.0 POM. for project jpox:jpox at /export/home/build/.m2/repository/jpox/jpox/1.1.9/jpox-1.1.9.pom
[WARNING] POM for 'jpox:jpox:pom:1.1.9:compile' is invalid. It will be ignored for artifact resolution. Reason: Not a v4.0.0 POM. for project jpox:jpox at /export/home/build/.m2/repository/jpox/jpox/1.1.9/jpox-1.1.9.pom
[WARNING] POM for 'jpox:jpox:pom:1.1.9:compile' is invalid. It will be ignored for artifact resolution. Reason: Not a v4.0.0 POM. for project jpox:jpox at /export/home/build/.m2/repository/jpox/jpox/1.1.9/jpox-1.1.9.pom
[INFO] [compiler:testCompile]
[INFO] Compiling 39 source files to /export/home/build/data/continuum/checkouts/296/target/test-classes
[WARNING] POM for 'jpox:jpox:pom:1.1.9:compile' is invalid. It will be ignored for artifact resolution. Reason: Not a v4.0.0 POM. for project jpox:jpox at /export/home/build/.m2/repository/jpox/jpox/1.1.9/jpox-1.1.9.pom
[WARNING] POM for 'jpox:jpox:pom:1.1.9:compile' is invalid. It will be ignored for artifact resolution. Reason: Not a v4.0.0 POM. for project jpox:jpox at /export/home/build/.m2/repository/jpox/jpox/1.1.9/jpox-1.1.9.pom
[WARNING] POM for 'jpox:jpox:pom:1.1.9:compile' is invalid. It will be ignored for artifact resolution. Reason: Not a v4.0.0 POM. for project jpox:jpox at /export/home/build/.m2/repository/jpox/jpox/1.1.9/jpox-1.1.9.pom
[WARNING] POM for 'jpox:jpox:pom:1.1.9:compile' is invalid. It will be ignored for artifact resolution. Reason: Not a v4.0.0 POM. for project jpox:jpox at /export/home/build/.m2/repository/jpox/jpox/1.1.9/jpox-1.1.9.pom
[INFO] [surefire:test]
[INFO] Surefire report directory: /export/home/build/data/continuum/checkouts/296/target/surefire-reports

-------------------------------------------------------
 T E S T S
-------------------------------------------------------
Running org.apache.maven.archiva.web.repository.RepositoryServletNoProxyMetadataTest
 WARN|main|    1|ConfigurationFactory           - No configuration found. Configuring ehcache from ehcache-failsafe.xml  found in the classpath: jar:file:/export/home/build/.m2/repository/net/sf/ehcache/ehcache/1.3.0/ehcache-1.3.0.jar!/ehcache-failsafe.xml
Rhino classes (js.jar) not found - Javascript disabled
 INFO|main| 1117|AuditLog                       - internal guest 127.0.0.1 "/commons-lang/commons-lang/2.1/maven-metadata.xml" "Modify File (proxied)"
 INFO|main| 1142|Cache:url-failures-cache       - Disposing cache: [ name = url-failures-cache status = STATUS_ALIVE eternal = false overflowToDisk = false maxElementsInMemory = 1000 maxElementsOnDisk = 0 memoryStoreEvictionPolicy = LRU timeToLiveSeconds = 1800 timeToIdleSeconds = 2700 diskPersistent = false diskExpiryThreadIntervalSeconds = 600 cacheEventListeners:  hitCount = 0 memoryStoreHitCount = 0 diskStoreHitCount = 0 missCountNotFound = 0 missCountExpired = 0 ]
 WARN|main| 1143|PlexusContainer                - Component manager not found for returned component. Ignored. component=org.apache.maven.archiva.web.repository.ProxiedDavServer@e22f2b
There was no such logger 'org.codehaus.plexus.redback.xwork.filter.authentication.HttpAuthenticator:basic' 6259058.
 INFO|main| 1417|AuditLog                       - internal guest 127.0.0.1 "/commons-lang/commons-lang/maven-metadata.xml" "Modify File (proxied)"
 INFO|main| 1420|Cache:url-failures-cache       - Disposing cache: [ name = url-failures-cache status = STATUS_ALIVE eternal = false overflowToDisk = false maxElementsInMemory = 1000 maxElementsOnDisk = 0 memoryStoreEvictionPolicy = LRU timeToLiveSeconds = 1800 timeToIdleSeconds = 2700 diskPersistent = false diskExpiryThreadIntervalSeconds = 600 cacheEventListeners:  hitCount = 0 memoryStoreHitCount = 0 diskStoreHitCount = 0 missCountNotFound = 0 missCountExpired = 0 ]
There was no such logger 'org.codehaus.plexus.redback.xwork.filter.authentication.HttpAuthenticator:basic' 18997034.
 WARN|main| 1421|PlexusContainer                - Component manager not found for returned component. Ignored. component=org.apache.maven.archiva.web.repository.ProxiedDavServer@12462b3
 INFO|main| 1727|AuditLog                       - internal guest 127.0.0.1 "/org/apache/maven/plugins/maven-assembly-plugin/2.2-beta-2-SNAPSHOT/maven-metadata.xml" "Modify File (proxied)"
 INFO|main| 1732|Cache:url-failures-cache       - Disposing cache: [ name = url-failures-cache status = STATUS_ALIVE eternal = false overflowToDisk = false maxElementsInMemory = 1000 maxElementsOnDisk = 0 memoryStoreEvictionPolicy = LRU timeToLiveSeconds = 1800 timeToIdleSeconds = 2700 diskPersistent = false diskExpiryThreadIntervalSeconds = 600 cacheEventListeners:  hitCount = 0 memoryStoreHitCount = 0 diskStoreHitCount = 0 missCountNotFound = 0 missCountExpired = 0 ]
 WARN|main| 1732|PlexusContainer                - Component manager not found for returned component. Ignored. component=org.apache.maven.archiva.web.repository.ProxiedDavServer@f42160
Tests run: 3, Failures: 0, Errors: 0, Skipped: 0, Time elapsed: 3.104 sec
Running org.apache.maven.archiva.web.repository.ArchivaMimeTypeLoaderTest
There was no such logger 'org.codehaus.plexus.redback.xwork.filter.authentication.HttpAuthenticator:basic' 22571162.
Tests run: 1, Failures: 0, Errors: 0, Skipped: 0, Time elapsed: 0.245 sec
Running org.apache.maven.archiva.web.repository.RepositoryServletProxiedPluginSnapshotPolicyTest
 INFO|main| 2229|log                            - Logging to org.slf4j.impl.Log4jLoggerAdapter(org.mortbay.log) via org.mortbay.log.Slf4jLog
 INFO|main| 2287|log                            - jetty-6.1.5
 INFO|main| 2367|log                            - Started SocketConnector@0.0.0.0:42829
Remote HTTP Server started on http://localhost:42829/snapshots
 INFO|main| 3809|Cache:url-failures-cache       - Disposing cache: [ name = url-failures-cache status = STATUS_ALIVE eternal = false overflowToDisk = false maxElementsInMemory = 1000 maxElementsOnDisk = 0 memoryStoreEvictionPolicy = LRU timeToLiveSeconds = 1800 timeToIdleSeconds = 2700 diskPersistent = false diskExpiryThreadIntervalSeconds = 600 cacheEventListeners:  hitCount = 0 memoryStoreHitCount = 0 diskStoreHitCount = 0 missCountNotFound = 0 missCountExpired = 0 ]
 WARN|main| 3809|PlexusContainer                - Component manager not found for returned component. Ignored. component=org.apache.maven.archiva.web.repository.ProxiedDavServer@134c5ff
There was no such logger 'org.codehaus.plexus.redback.xwork.filter.authentication.HttpAuthenticator:basic' 25120699.
 INFO|main| 4214|log                            - jetty-6.1.5
 INFO|main| 4215|log                            - Started SocketConnector@0.0.0.0:42836
Remote HTTP Server started on http://localhost:42836/snapshots
 INFO|main| 5197|AuditLog                       - internal guest 127.0.0.1 "org/apache/archiva/archivatest-maven-plugin/4.0-alpha-1-SNAPSHOT/archivatest-maven-plugin-4.0-alpha-1-20070822.033400-42.jar" "Modify File (proxied)"
 INFO|main| 5311|Cache:url-failures-cache       - Disposing cache: [ name = url-failures-cache status = STATUS_ALIVE eternal = false overflowToDisk = false maxElementsInMemory = 1000 maxElementsOnDisk = 0 memoryStoreEvictionPolicy = LRU timeToLiveSeconds = 1800 timeToIdleSeconds = 2700 diskPersistent = false diskExpiryThreadIntervalSeconds = 600 cacheEventListeners:  hitCount = 0 memoryStoreHitCount = 0 diskStoreHitCount = 0 missCountNotFound = 0 missCountExpired = 0 ]
There was no such logger 'org.codehaus.plexus.redback.xwork.filter.authentication.HttpAuthenticator:basic' 24191379.
 WARN|main| 5311|PlexusContainer                - Component manager not found for returned component. Ignored. component=org.apache.maven.archiva.web.repository.ProxiedDavServer@91a4fb
 INFO|main| 5455|log                            - jetty-6.1.5
 INFO|main| 5456|log                            - Started SocketConnector@0.0.0.0:42841
Remote HTTP Server started on http://localhost:42841/snapshots
 INFO|main| 6426|AuditLog                       - internal guest 127.0.0.1 "org/apache/archiva/archivatest-maven-plugin/4.0-alpha-1-SNAPSHOT/archivatest-maven-plugin-4.0-alpha-1-20070822.033400-42.jar" "Modify File (proxied)"
 INFO|main| 6531|Cache:url-failures-cache       - Disposing cache: [ name = url-failures-cache status = STATUS_ALIVE eternal = false overflowToDisk = false maxElementsInMemory = 1000 maxElementsOnDisk = 0 memoryStoreEvictionPolicy = LRU timeToLiveSeconds = 1800 timeToIdleSeconds = 2700 diskPersistent = false diskExpiryThreadIntervalSeconds = 600 cacheEventListeners:  hitCount = 0 memoryStoreHitCount = 0 diskStoreHitCount = 0 missCountNotFound = 0 missCountExpired = 0 ]
There was no such logger 'org.codehaus.plexus.redback.xwork.filter.authentication.HttpAuthenticator:basic' 387569.
 WARN|main| 6531|PlexusContainer                - Component manager not found for returned component. Ignored. component=org.apache.maven.archiva.web.repository.ProxiedDavServer@577c5e
 INFO|main| 6717|log                            - jetty-6.1.5
 INFO|main| 6718|log                            - Started SocketConnector@0.0.0.0:42846
Remote HTTP Server started on http://localhost:42846/snapshots
 INFO|main| 7695|RepositoryProxyConnectors:default - Transfer not attempted on http://localhost:42846/snapshots/org/apache/archiva/archivatest-maven-plugin/4.0-alpha-1-SNAPSHOT/archivatest-maven-plugin-4.0-alpha-1-20070822.033400-42.jar : NO to update snapshots, policy is DAILY, local file exist, and has been updated within the last day.: using already present local file.
 INFO|main| 7699|AuditLog                       - internal guest 127.0.0.1 "org/apache/archiva/archivatest-maven-plugin/4.0-alpha-1-SNAPSHOT/archivatest-maven-plugin-4.0-alpha-1-20070822.033400-42.jar" "Modify File (proxied)"
 INFO|main| 7705|Cache:url-failures-cache       - Disposing cache: [ name = url-failures-cache status = STATUS_ALIVE eternal = false overflowToDisk = false maxElementsInMemory = 1000 maxElementsOnDisk = 0 memoryStoreEvictionPolicy = LRU timeToLiveSeconds = 1800 timeToIdleSeconds = 2700 diskPersistent = false diskExpiryThreadIntervalSeconds = 600 cacheEventListeners:  hitCount = 0 memoryStoreHitCount = 0 diskStoreHitCount = 0 missCountNotFound = 0 missCountExpired = 0 ]
 WARN|main| 7705|PlexusContainer                - Component manager not found for returned component. Ignored. component=org.apache.maven.archiva.web.repository.ProxiedDavServer@1b2b450
There was no such logger 'org.codehaus.plexus.redback.xwork.filter.authentication.HttpAuthenticator:basic' 26976728.
 INFO|main| 7977|log                            - jetty-6.1.5
 INFO|main| 7978|log                            - Started SocketConnector@0.0.0.0:42851
Remote HTTP Server started on http://localhost:42851/snapshots
 INFO|main| 9345|AuditLog                       - internal guest 127.0.0.1 "org/apache/archiva/archivatest-maven-plugin/4.0-alpha-1-SNAPSHOT/archivatest-maven-plugin-4.0-alpha-1-20070822.033400-42.jar" "Modify File (proxied)"
 INFO|main| 9450|Cache:url-failures-cache       - Disposing cache: [ name = url-failures-cache status = STATUS_ALIVE eternal = false overflowToDisk = false maxElementsInMemory = 1000 maxElementsOnDisk = 0 memoryStoreEvictionPolicy = LRU timeToLiveSeconds = 1800 timeToIdleSeconds = 2700 diskPersistent = false diskExpiryThreadIntervalSeconds = 600 cacheEventListeners:  hitCount = 0 memoryStoreHitCount = 0 diskStoreHitCount = 0 missCountNotFound = 0 missCountExpired = 0 ]
There was no such logger 'org.codehaus.plexus.redback.xwork.filter.authentication.HttpAuthenticator:basic' 20319379.
 WARN|main| 9451|PlexusContainer                - Component manager not found for returned component. Ignored. component=org.apache.maven.archiva.web.repository.ProxiedDavServer@1cb048e
 INFO|main| 9689|log                            - jetty-6.1.5
 INFO|main| 9690|log                            - Started SocketConnector@0.0.0.0:42858
Remote HTTP Server started on http://localhost:42858/snapshots
 INFO|main|10875|AuditLog                       - internal guest 127.0.0.1 "org/apache/archiva/archivatest-maven-plugin/4.0-alpha-1-SNAPSHOT/archivatest-maven-plugin-4.0-alpha-1-20070822.033400-42.jar" "Modify File (proxied)"
 INFO|main|10884|Cache:url-failures-cache       - Disposing cache: [ name = url-failures-cache status = STATUS_ALIVE eternal = false overflowToDisk = false maxElementsInMemory = 1000 maxElementsOnDisk = 0 memoryStoreEvictionPolicy = LRU timeToLiveSeconds = 1800 timeToIdleSeconds = 2700 diskPersistent = false diskExpiryThreadIntervalSeconds = 600 cacheEventListeners:  hitCount = 0 memoryStoreHitCount = 0 diskStoreHitCount = 0 missCountNotFound = 0 missCountExpired = 0 ]
 WARN|main|10884|PlexusContainer                - Component manager not found for returned component. Ignored. component=org.apache.maven.archiva.web.repository.ProxiedDavServer@e6361e
There was no such logger 'org.codehaus.plexus.redback.xwork.filter.authentication.HttpAuthenticator:basic' 23387737.
 INFO|main|11081|log                            - jetty-6.1.5
 INFO|main|11083|log                            - Started SocketConnector@0.0.0.0:42864
Remote HTTP Server started on http://localhost:42864/snapshots
 INFO|main|12082|RepositoryProxyConnectors:default - Transfer not attempted on http://localhost:42864/snapshots/org/apache/archiva/archivatest-maven-plugin/4.0-alpha-1-SNAPSHOT/archivatest-maven-plugin-4.0-alpha-1-20070822.033400-42.pom : NO to update, snapshots policy set to NEVER.
 INFO|main|12082|RepositoryProxyConnectors:default - Transfer not attempted on http://localhost:42864/snapshots/org/apache/archiva/archivatest-maven-plugin/4.0-alpha-1-SNAPSHOT/archivatest-maven-plugin-4.0-alpha-1-20070822.033400-42.jar : NO to update, snapshots policy set to NEVER.: using already present local file.
 INFO|main|12085|AuditLog                       - internal guest 127.0.0.1 "org/apache/archiva/archivatest-maven-plugin/4.0-alpha-1-SNAPSHOT/archivatest-maven-plugin-4.0-alpha-1-20070822.033400-42.jar" "Modify File (proxied)"
 INFO|main|12190|Cache:url-failures-cache       - Disposing cache: [ name = url-failures-cache status = STATUS_ALIVE eternal = false overflowToDisk = false maxElementsInMemory = 1000 maxElementsOnDisk = 0 memoryStoreEvictionPolicy = LRU timeToLiveSeconds = 1800 timeToIdleSeconds = 2700 diskPersistent = false diskExpiryThreadIntervalSeconds = 600 cacheEventListeners:  hitCount = 0 memoryStoreHitCount = 0 diskStoreHitCount = 0 missCountNotFound = 0 missCountExpired = 0 ]
There was no such logger 'org.codehaus.plexus.redback.xwork.filter.authentication.HttpAuthenticator:basic' 21250902.
 WARN|main|12191|PlexusContainer                - Component manager not found for returned component. Ignored. component=org.apache.maven.archiva.web.repository.ProxiedDavServer@19d4f72
 INFO|main|12370|log                            - jetty-6.1.5
 INFO|main|12371|log                            - Started SocketConnector@0.0.0.0:42869
Remote HTTP Server started on http://localhost:42869/snapshots
 INFO|main|13309|RepositoryProxyConnectors:default - Transfer not attempted on http://localhost:42869/snapshots/org/apache/archiva/archivatest-maven-plugin/4.0-alpha-1-SNAPSHOT/archivatest-maven-plugin-4.0-alpha-1-20070822.033400-42.pom : NO to update, snapshots policy set to NEVER.
 INFO|main|13309|RepositoryProxyConnectors:default - Transfer not attempted on http://localhost:42869/snapshots/org/apache/archiva/archivatest-maven-plugin/4.0-alpha-1-SNAPSHOT/archivatest-maven-plugin-4.0-alpha-1-20070822.033400-42.jar : NO to update, snapshots policy set to NEVER.
 INFO|main|13430|Cache:url-failures-cache       - Disposing cache: [ name = url-failures-cache status = STATUS_ALIVE eternal = false overflowToDisk = false maxElementsInMemory = 1000 maxElementsOnDisk = 0 memoryStoreEvictionPolicy = LRU timeToLiveSeconds = 1800 timeToIdleSeconds = 2700 diskPersistent = false diskExpiryThreadIntervalSeconds = 600 cacheEventListeners:  hitCount = 0 memoryStoreHitCount = 0 diskStoreHitCount = 0 missCountNotFound = 0 missCountExpired = 0 ]
 WARN|main|13430|PlexusContainer                - Component manager not found for returned component. Ignored. component=org.apache.maven.archiva.web.repository.ProxiedDavServer@135d18b
There was no such logger 'org.codehaus.plexus.redback.xwork.filter.authentication.HttpAuthenticator:basic' 12833564.
 INFO|main|13751|log                            - jetty-6.1.5
 INFO|main|13752|log                            - Started SocketConnector@0.0.0.0:42873
Remote HTTP Server started on http://localhost:42873/snapshots
 INFO|main|14734|RepositoryProxyConnectors:default - Transfer not attempted on http://localhost:42873/snapshots/org/apache/archiva/archivatest-maven-plugin/4.0-alpha-1-SNAPSHOT/archivatest-maven-plugin-4.0-alpha-1-20070822.033400-42.pom : NO to update, snapshots policy set to NEVER.
 INFO|main|14735|RepositoryProxyConnectors:default - Transfer not attempted on http://localhost:42873/snapshots/org/apache/archiva/archivatest-maven-plugin/4.0-alpha-1-SNAPSHOT/archivatest-maven-plugin-4.0-alpha-1-20070822.033400-42.jar : NO to update, snapshots policy set to NEVER.: using already present local file.
 INFO|main|14737|AuditLog                       - internal guest 127.0.0.1 "org/apache/archiva/archivatest-maven-plugin/4.0-alpha-1-SNAPSHOT/archivatest-maven-plugin-4.0-alpha-1-20070822.033400-42.jar" "Modify File (proxied)"
There was no such logger 'org.codehaus.plexus.redback.xwork.filter.authentication.HttpAuthenticator:basic' 26270841.
 INFO|main|14740|Cache:url-failures-cache       - Disposing cache: [ name = url-failures-cache status = STATUS_ALIVE eternal = false overflowToDisk = false maxElementsInMemory = 1000 maxElementsOnDisk = 0 memoryStoreEvictionPolicy = LRU timeToLiveSeconds = 1800 timeToIdleSeconds = 2700 diskPersistent = false diskExpiryThreadIntervalSeconds = 600 cacheEventListeners:  hitCount = 0 memoryStoreHitCount = 0 diskStoreHitCount = 0 missCountNotFound = 0 missCountExpired = 0 ]
 WARN|main|14741|PlexusContainer                - Component manager not found for returned component. Ignored. component=org.apache.maven.archiva.web.repository.ProxiedDavServer@1cdc190
 INFO|main|15155|log                            - jetty-6.1.5
 INFO|main|15156|log                            - Started SocketConnector@0.0.0.0:42878
Remote HTTP Server started on http://localhost:42878/snapshots
 INFO|main|16104|RepositoryProxyConnectors:default - Transfer not attempted on http://localhost:42878/snapshots/org/apache/archiva/archivatest-maven-plugin/4.0-alpha-1-SNAPSHOT/archivatest-maven-plugin-4.0-alpha-1-20070822.033400-42.jar : NO to update snapshots, policy is HOURLY, local file exist, and has been updated within the last hour.: using already present local file.
 INFO|main|16111|AuditLog                       - internal guest 127.0.0.1 "org/apache/archiva/archivatest-maven-plugin/4.0-alpha-1-SNAPSHOT/archivatest-maven-plugin-4.0-alpha-1-20070822.033400-42.jar" "Modify File (proxied)"
 INFO|main|16116|Cache:url-failures-cache       - Disposing cache: [ name = url-failures-cache status = STATUS_ALIVE eternal = false overflowToDisk = false maxElementsInMemory = 1000 maxElementsOnDisk = 0 memoryStoreEvictionPolicy = LRU timeToLiveSeconds = 1800 timeToIdleSeconds = 2700 diskPersistent = false diskExpiryThreadIntervalSeconds = 600 cacheEventListeners:  hitCount = 0 memoryStoreHitCount = 0 diskStoreHitCount = 0 missCountNotFound = 0 missCountExpired = 0 ]
 WARN|main|16116|PlexusContainer                - Component manager not found for returned component. Ignored. component=org.apache.maven.archiva.web.repository.ProxiedDavServer@1697d14
There was no such logger 'org.codehaus.plexus.redback.xwork.filter.authentication.HttpAuthenticator:basic' 17385679.
 INFO|main|16256|log                            - jetty-6.1.5
 INFO|main|16257|log                            - Started SocketConnector@0.0.0.0:42884
Remote HTTP Server started on http://localhost:42884/snapshots
 INFO|main|17303|AuditLog                       - internal guest 127.0.0.1 "org/apache/archiva/archivatest-maven-plugin/4.0-alpha-1-SNAPSHOT/archivatest-maven-plugin-4.0-alpha-1-20070822.033400-42.jar" "Modify File (proxied)"
 INFO|main|17409|Cache:url-failures-cache       - Disposing cache: [ name = url-failures-cache status = STATUS_ALIVE eternal = false overflowToDisk = false maxElementsInMemory = 1000 maxElementsOnDisk = 0 memoryStoreEvictionPolicy = LRU timeToLiveSeconds = 1800 timeToIdleSeconds = 2700 diskPersistent = false diskExpiryThreadIntervalSeconds = 600 cacheEventListeners:  hitCount = 0 memoryStoreHitCount = 0 diskStoreHitCount = 0 missCountNotFound = 0 missCountExpired = 0 ]
There was no such logger 'org.codehaus.plexus.redback.xwork.filter.authentication.HttpAuthenticator:basic' 28501069.
 WARN|main|17410|PlexusContainer                - Component manager not found for returned component. Ignored. component=org.apache.maven.archiva.web.repository.ProxiedDavServer@8c4b5f
 INFO|main|17615|log                            - jetty-6.1.5
 INFO|main|17616|log                            - Started SocketConnector@0.0.0.0:42889
Remote HTTP Server started on http://localhost:42889/snapshots
 INFO|main|18602|AuditLog                       - internal guest 127.0.0.1 "org/apache/archiva/archivatest-maven-plugin/4.0-alpha-1-SNAPSHOT/archivatest-maven-plugin-4.0-alpha-1-20070822.033400-42.jar" "Modify File (proxied)"
 INFO|main|18709|Cache:url-failures-cache       - Disposing cache: [ name = url-failures-cache status = STATUS_ALIVE eternal = false overflowToDisk = false maxElementsInMemory = 1000 maxElementsOnDisk = 0 memoryStoreEvictionPolicy = LRU timeToLiveSeconds = 1800 timeToIdleSeconds = 2700 diskPersistent = false diskExpiryThreadIntervalSeconds = 600 cacheEventListeners:  hitCount = 0 memoryStoreHitCount = 0 diskStoreHitCount = 0 missCountNotFound = 0 missCountExpired = 0 ]
 WARN|main|18710|PlexusContainer                - Component manager not found for returned component. Ignored. component=org.apache.maven.archiva.web.repository.ProxiedDavServer@92015d
There was no such logger 'org.codehaus.plexus.redback.xwork.filter.authentication.HttpAuthenticator:basic' 14227847.
 INFO|main|19089|log                            - jetty-6.1.5
 INFO|main|19090|log                            - Started SocketConnector@0.0.0.0:42895
Remote HTTP Server started on http://localhost:42895/snapshots
 INFO|main|20033|RepositoryProxyConnectors:default - Transfer not attempted on http://localhost:42895/snapshots/org/apache/archiva/archivatest-maven-plugin/4.0-alpha-1-SNAPSHOT/archivatest-maven-plugin-4.0-alpha-1-20070822.033400-42.jar : NO to update snapshots, policy is ONCE, and local file exist.: using already present local file.
 INFO|main|20035|AuditLog                       - internal guest 127.0.0.1 "org/apache/archiva/archivatest-maven-plugin/4.0-alpha-1-SNAPSHOT/archivatest-maven-plugin-4.0-alpha-1-20070822.033400-42.jar" "Modify File (proxied)"
 INFO|main|20139|Cache:url-failures-cache       - Disposing cache: [ name = url-failures-cache status = STATUS_ALIVE eternal = false overflowToDisk = false maxElementsInMemory = 1000 maxElementsOnDisk = 0 memoryStoreEvictionPolicy = LRU timeToLiveSeconds = 1800 timeToIdleSeconds = 2700 diskPersistent = false diskExpiryThreadIntervalSeconds = 600 cacheEventListeners:  hitCount = 0 memoryStoreHitCount = 0 diskStoreHitCount = 0 missCountNotFound = 0 missCountExpired = 0 ]
There was no such logger 'org.codehaus.plexus.redback.xwork.filter.authentication.HttpAuthenticator:basic' 29486315.
 WARN|main|20140|PlexusContainer                - Component manager not found for returned component. Ignored. component=org.apache.maven.archiva.web.repository.ProxiedDavServer@19ff66f
 INFO|main|20288|log                            - jetty-6.1.5
 INFO|main|20290|log                            - Started SocketConnector@0.0.0.0:42900
Remote HTTP Server started on http://localhost:42900/snapshots
 INFO|main|21233|AuditLog                       - internal guest 127.0.0.1 "org/apache/archiva/archivatest-maven-plugin/4.0-alpha-1-SNAPSHOT/archivatest-maven-plugin-4.0-alpha-1-20070822.033400-42.jar" "Modify File (proxied)"
 INFO|main|21339|Cache:url-failures-cache       - Disposing cache: [ name = url-failures-cache status = STATUS_ALIVE eternal = false overflowToDisk = false maxElementsInMemory = 1000 maxElementsOnDisk = 0 memoryStoreEvictionPolicy = LRU timeToLiveSeconds = 1800 timeToIdleSeconds = 2700 diskPersistent = false diskExpiryThreadIntervalSeconds = 600 cacheEventListeners:  hitCount = 0 memoryStoreHitCount = 0 diskStoreHitCount = 0 missCountNotFound = 0 missCountExpired = 0 ]
There was no such logger 'org.codehaus.plexus.redback.xwork.filter.authentication.HttpAuthenticator:basic' 7663968.
 WARN|main|21339|PlexusContainer                - Component manager not found for returned component. Ignored. component=org.apache.maven.archiva.web.repository.ProxiedDavServer@15cb235
 INFO|main|21500|log                            - jetty-6.1.5
 INFO|main|21502|log                            - Started SocketConnector@0.0.0.0:42904
Remote HTTP Server started on http://localhost:42904/snapshots
 INFO|main|22442|AuditLog                       - internal guest 127.0.0.1 "org/apache/archiva/archivatest-maven-plugin/4.0-alpha-1-SNAPSHOT/archivatest-maven-plugin-4.0-alpha-1-20070822.033400-42.jar" "Modify File (proxied)"
 INFO|main|22549|Cache:url-failures-cache       - Disposing cache: [ name = url-failures-cache status = STATUS_ALIVE eternal = false overflowToDisk = false maxElementsInMemory = 1000 maxElementsOnDisk = 0 memoryStoreEvictionPolicy = LRU timeToLiveSeconds = 1800 timeToIdleSeconds = 2700 diskPersistent = false diskExpiryThreadIntervalSeconds = 600 cacheEventListeners:  hitCount = 0 memoryStoreHitCount = 0 diskStoreHitCount = 0 missCountNotFound = 0 missCountExpired = 0 ]
There was no such logger 'org.codehaus.plexus.redback.xwork.filter.authentication.HttpAuthenticator:basic' 6467398.
 WARN|main|22549|PlexusContainer                - Component manager not found for returned component. Ignored. component=org.apache.maven.archiva.web.repository.ProxiedDavServer@1d3633c
Tests run: 15, Failures: 0, Errors: 0, Skipped: 0, Time elapsed: 20.556 sec
Running org.apache.maven.archiva.web.action.admin.repositories.EditManagedRepositoryActionTest
Tests run: 3, Failures: 0, Errors: 0, Skipped: 0, Time elapsed: 0.649 sec
Running org.apache.maven.archiva.web.action.admin.connectors.proxy.AddProxyConnectorActionTest
 INFO|main|23293|Cache:url-failures-cache       - Disposing cache: [ name = url-failures-cache status = STATUS_ALIVE eternal = false overflowToDisk = false maxElementsInMemory = 1000 maxElementsOnDisk = 0 memoryStoreEvictionPolicy = LRU timeToLiveSeconds = 1800 timeToIdleSeconds = 2700 diskPersistent = false diskExpiryThreadIntervalSeconds = 600 cacheEventListeners:  hitCount = 0 memoryStoreHitCount = 0 diskStoreHitCount = 0 missCountNotFound = 0 missCountExpired = 0 ]
 INFO|main|23574|Cache:url-failures-cache       - Disposing cache: [ name = url-failures-cache status = STATUS_ALIVE eternal = false overflowToDisk = false maxElementsInMemory = 1000 maxElementsOnDisk = 0 memoryStoreEvictionPolicy = LRU timeToLiveSeconds = 1800 timeToIdleSeconds = 2700 diskPersistent = false diskExpiryThreadIntervalSeconds = 600 cacheEventListeners:  hitCount = 0 memoryStoreHitCount = 0 diskStoreHitCount = 0 missCountNotFound = 0 missCountExpired = 0 ]
 INFO|main|23651|Cache:url-failures-cache       - Disposing cache: [ name = url-failures-cache status = STATUS_ALIVE eternal = false overflowToDisk = false maxElementsInMemory = 1000 maxElementsOnDisk = 0 memoryStoreEvictionPolicy = LRU timeToLiveSeconds = 1800 timeToIdleSeconds = 2700 diskPersistent = false diskExpiryThreadIntervalSeconds = 600 cacheEventListeners:  hitCount = 0 memoryStoreHitCount = 0 diskStoreHitCount = 0 missCountNotFound = 0 missCountExpired = 0 ]
 INFO|main|23727|Cache:url-failures-cache       - Disposing cache: [ name = url-failures-cache status = STATUS_ALIVE eternal = false overflowToDisk = false maxElementsInMemory = 1000 maxElementsOnDisk = 0 memoryStoreEvictionPolicy = LRU timeToLiveSeconds = 1800 timeToIdleSeconds = 2700 diskPersistent = false diskExpiryThreadIntervalSeconds = 600 cacheEventListeners:  hitCount = 0 memoryStoreHitCount = 0 diskStoreHitCount = 0 missCountNotFound = 0 missCountExpired = 0 ]
 INFO|main|23803|Cache:url-failures-cache       - Disposing cache: [ name = url-failures-cache status = STATUS_ALIVE eternal = false overflowToDisk = false maxElementsInMemory = 1000 maxElementsOnDisk = 0 memoryStoreEvictionPolicy = LRU timeToLiveSeconds = 1800 timeToIdleSeconds = 2700 diskPersistent = false diskExpiryThreadIntervalSeconds = 600 cacheEventListeners:  hitCount = 0 memoryStoreHitCount = 0 diskStoreHitCount = 0 missCountNotFound = 0 missCountExpired = 0 ]
 INFO|main|24025|Cache:url-failures-cache       - Disposing cache: [ name = url-failures-cache status = STATUS_ALIVE eternal = false overflowToDisk = false maxElementsInMemory = 1000 maxElementsOnDisk = 0 memoryStoreEvictionPolicy = LRU timeToLiveSeconds = 1800 timeToIdleSeconds = 2700 diskPersistent = false diskExpiryThreadIntervalSeconds = 600 cacheEventListeners:  hitCount = 0 memoryStoreHitCount = 0 diskStoreHitCount = 0 missCountNotFound = 0 missCountExpired = 0 ]
 INFO|main|24102|Cache:url-failures-cache       - Disposing cache: [ name = url-failures-cache status = STATUS_ALIVE eternal = false overflowToDisk = false maxElementsInMemory = 1000 maxElementsOnDisk = 0 memoryStoreEvictionPolicy = LRU timeToLiveSeconds = 1800 timeToIdleSeconds = 2700 diskPersistent = false diskExpiryThreadIntervalSeconds = 600 cacheEventListeners:  hitCount = 0 memoryStoreHitCount = 0 diskStoreHitCount = 0 missCountNotFound = 0 missCountExpired = 0 ]
 INFO|main|24181|Cache:url-failures-cache       - Disposing cache: [ name = url-failures-cache status = STATUS_ALIVE eternal = false overflowToDisk = false maxElementsInMemory = 1000 maxElementsOnDisk = 0 memoryStoreEvictionPolicy = LRU timeToLiveSeconds = 1800 timeToIdleSeconds = 2700 diskPersistent = false diskExpiryThreadIntervalSeconds = 600 cacheEventListeners:  hitCount = 0 memoryStoreHitCount = 0 diskStoreHitCount = 0 missCountNotFound = 0 missCountExpired = 0 ]
 INFO|main|24612|Cache:url-failures-cache       - Disposing cache: [ name = url-failures-cache status = STATUS_ALIVE eternal = false overflowToDisk = false maxElementsInMemory = 1000 maxElementsOnDisk = 0 memoryStoreEvictionPolicy = LRU timeToLiveSeconds = 1800 timeToIdleSeconds = 2700 diskPersistent = false diskExpiryThreadIntervalSeconds = 600 cacheEventListeners:  hitCount = 0 memoryStoreHitCount = 0 diskStoreHitCount = 0 missCountNotFound = 0 missCountExpired = 0 ]
Tests run: 9, Failures: 0, Errors: 0, Skipped: 0, Time elapsed: 1.404 sec
Running org.apache.maven.archiva.web.action.admin.repositories.DeleteManagedRepositoryActionTest
 INFO|main|24862|Action:deleteManagedRepositoryAction - Removing artifact org.apache.maven.archiva:test-artifact:jar:1.0 from the database.
 INFO|main|25216|Action:deleteManagedRepositoryAction - Removing artifact org.apache.maven.archiva:test-artifact:jar:1.0 from the database.
 INFO|main|25295|Action:deleteManagedRepositoryAction - Removing artifact org.apache.maven.archiva:test-artifact:jar:1.0 from the database.
Tests run: 6, Failures: 0, Errors: 0, Skipped: 0, Time elapsed: 0.758 sec
Running org.apache.maven.archiva.web.startup.BannerTest
Tests run: 3, Failures: 0, Errors: 0, Skipped: 0, Time elapsed: 0.005 sec
Running org.apache.maven.archiva.web.action.admin.connectors.proxy.DeleteProxyConnectorActionTest
[INFO] Disposing cache: [ name = url-failures-cache status = STATUS_ALIVE eternal = false overflowToDisk = false maxElementsInMemory = 1000 maxElementsOnDisk = 0 memoryStoreEvictionPolicy = LRU timeToLiveSeconds = 1800 timeToIdleSeconds = 2700 diskPersistent = true diskExpiryThreadIntervalSeconds = 600 cacheEventListeners:  hitCount = 0 memoryStoreHitCount = 0 diskStoreHitCount = 0 missCountNotFound = 0 missCountExpired = 0 ]
[INFO] Disposing cache: [ name = url-failures-cache status = STATUS_ALIVE eternal = false overflowToDisk = false maxElementsInMemory = 1000 maxElementsOnDisk = 0 memoryStoreEvictionPolicy = LRU timeToLiveSeconds = 1800 timeToIdleSeconds = 2700 diskPersistent = true diskExpiryThreadIntervalSeconds = 600 cacheEventListeners:  hitCount = 0 memoryStoreHitCount = 0 diskStoreHitCount = 0 missCountNotFound = 0 missCountExpired = 0 ]
[INFO] Disposing cache: [ name = url-failures-cache status = STATUS_ALIVE eternal = false overflowToDisk = false maxElementsInMemory = 1000 maxElementsOnDisk = 0 memoryStoreEvictionPolicy = LRU timeToLiveSeconds = 1800 timeToIdleSeconds = 2700 diskPersistent = true diskExpiryThreadIntervalSeconds = 600 cacheEventListeners:  hitCount = 0 memoryStoreHitCount = 0 diskStoreHitCount = 0 missCountNotFound = 0 missCountExpired = 0 ]
[INFO] Disposing cache: [ name = url-failures-cache status = STATUS_ALIVE eternal = false overflowToDisk = false maxElementsInMemory = 1000 maxElementsOnDisk = 0 memoryStoreEvictionPolicy = LRU timeToLiveSeconds = 1800 timeToIdleSeconds = 2700 diskPersistent = true diskExpiryThreadIntervalSeconds = 600 cacheEventListeners:  hitCount = 0 memoryStoreHitCount = 0 diskStoreHitCount = 0 missCountNotFound = 0 missCountExpired = 0 ]
[INFO] Disposing cache: [ name = url-failures-cache status = STATUS_ALIVE eternal = false overflowToDisk = false maxElementsInMemory = 1000 maxElementsOnDisk = 0 memoryStoreEvictionPolicy = LRU timeToLiveSeconds = 1800 timeToIdleSeconds = 2700 diskPersistent = true diskExpiryThreadIntervalSeconds = 600 cacheEventListeners:  hitCount = 0 memoryStoreHitCount = 0 diskStoreHitCount = 0 missCountNotFound = 0 missCountExpired = 0 ]
Tests run: 5, Failures: 0, Errors: 0, Skipped: 0, Time elapsed: 0.409 sec
Running org.apache.maven.archiva.web.action.admin.repositories.DeleteRemoteRepositoryActionTest
[INFO] Disposing cache: [ name = url-failures-cache status = STATUS_ALIVE eternal = false overflowToDisk = false maxElementsInMemory = 1000 maxElementsOnDisk = 0 memoryStoreEvictionPolicy = LRU timeToLiveSeconds = 1800 timeToIdleSeconds = 2700 diskPersistent = true diskExpiryThreadIntervalSeconds = 600 cacheEventListeners:  hitCount = 0 memoryStoreHitCount = 0 diskStoreHitCount = 0 missCountNotFound = 0 missCountExpired = 0 ]
[INFO] Disposing cache: [ name = url-failures-cache status = STATUS_ALIVE eternal = false overflowToDisk = false maxElementsInMemory = 1000 maxElementsOnDisk = 0 memoryStoreEvictionPolicy = LRU timeToLiveSeconds = 1800 timeToIdleSeconds = 2700 diskPersistent = true diskExpiryThreadIntervalSeconds = 600 cacheEventListeners:  hitCount = 0 memoryStoreHitCount = 0 diskStoreHitCount = 0 missCountNotFound = 0 missCountExpired = 0 ]
[INFO] Disposing cache: [ name = url-failures-cache status = STATUS_ALIVE eternal = false overflowToDisk = false maxElementsInMemory = 1000 maxElementsOnDisk = 0 memoryStoreEvictionPolicy = LRU timeToLiveSeconds = 1800 timeToIdleSeconds = 2700 diskPersistent = true diskExpiryThreadIntervalSeconds = 600 cacheEventListeners:  hitCount = 0 memoryStoreHitCount = 0 diskStoreHitCount = 0 missCountNotFound = 0 missCountExpired = 0 ]
Tests run: 3, Failures: 0, Errors: 0, Skipped: 0, Time elapsed: 0.265 sec
Running org.apache.maven.archiva.web.action.admin.connectors.proxy.EditProxyConnectorActionTest
 INFO|main|26158|Cache:url-failures-cache       - Disposing cache: [ name = url-failures-cache status = STATUS_ALIVE eternal = false overflowToDisk = false maxElementsInMemory = 1000 maxElementsOnDisk = 0 memoryStoreEvictionPolicy = LRU timeToLiveSeconds = 1800 timeToIdleSeconds = 2700 diskPersistent = false diskExpiryThreadIntervalSeconds = 600 cacheEventListeners:  hitCount = 0 memoryStoreHitCount = 0 diskStoreHitCount = 0 missCountNotFound = 0 missCountExpired = 0 ]
 INFO|main|26254|Cache:url-failures-cache       - Disposing cache: [ name = url-failures-cache status = STATUS_ALIVE eternal = false overflowToDisk = false maxElementsInMemory = 1000 maxElementsOnDisk = 0 memoryStoreEvictionPolicy = LRU timeToLiveSeconds = 1800 timeToIdleSeconds = 2700 diskPersistent = false diskExpiryThreadIntervalSeconds = 600 cacheEventListeners:  hitCount = 0 memoryStoreHitCount = 0 diskStoreHitCount = 0 missCountNotFound = 0 missCountExpired = 0 ]
 INFO|main|26324|Cache:url-failures-cache       - Disposing cache: [ name = url-failures-cache status = STATUS_ALIVE eternal = false overflowToDisk = false maxElementsInMemory = 1000 maxElementsOnDisk = 0 memoryStoreEvictionPolicy = LRU timeToLiveSeconds = 1800 timeToIdleSeconds = 2700 diskPersistent = false diskExpiryThreadIntervalSeconds = 600 cacheEventListeners:  hitCount = 0 memoryStoreHitCount = 0 diskStoreHitCount = 0 missCountNotFound = 0 missCountExpired = 0 ]
 INFO|main|26400|Cache:url-failures-cache       - Disposing cache: [ name = url-failures-cache status = STATUS_ALIVE eternal = false overflowToDisk = false maxElementsInMemory = 1000 maxElementsOnDisk = 0 memoryStoreEvictionPolicy = LRU timeToLiveSeconds = 1800 timeToIdleSeconds = 2700 diskPersistent = false diskExpiryThreadIntervalSeconds = 600 cacheEventListeners:  hitCount = 0 memoryStoreHitCount = 0 diskStoreHitCount = 0 missCountNotFound = 0 missCountExpired = 0 ]
 INFO|main|26474|Cache:url-failures-cache       - Disposing cache: [ name = url-failures-cache status = STATUS_ALIVE eternal = false overflowToDisk = false maxElementsInMemory = 1000 maxElementsOnDisk = 0 memoryStoreEvictionPolicy = LRU timeToLiveSeconds = 1800 timeToIdleSeconds = 2700 diskPersistent = false diskExpiryThreadIntervalSeconds = 600 cacheEventListeners:  hitCount = 0 memoryStoreHitCount = 0 diskStoreHitCount = 0 missCountNotFound = 0 missCountExpired = 0 ]
 INFO|main|26648|Cache:url-failures-cache       - Disposing cache: [ name = url-failures-cache status = STATUS_ALIVE eternal = false overflowToDisk = false maxElementsInMemory = 1000 maxElementsOnDisk = 0 memoryStoreEvictionPolicy = LRU timeToLiveSeconds = 1800 timeToIdleSeconds = 2700 diskPersistent = false diskExpiryThreadIntervalSeconds = 600 cacheEventListeners:  hitCount = 0 memoryStoreHitCount = 0 diskStoreHitCount = 0 missCountNotFound = 0 missCountExpired = 0 ]
 INFO|main|26720|Cache:url-failures-cache       - Disposing cache: [ name = url-failures-cache status = STATUS_ALIVE eternal = false overflowToDisk = false maxElementsInMemory = 1000 maxElementsOnDisk = 0 memoryStoreEvictionPolicy = LRU timeToLiveSeconds = 1800 timeToIdleSeconds = 2700 diskPersistent = false diskExpiryThreadIntervalSeconds = 600 cacheEventListeners:  hitCount = 0 memoryStoreHitCount = 0 diskStoreHitCount = 0 missCountNotFound = 0 missCountExpired = 0 ]
 INFO|main|26791|Cache:url-failures-cache       - Disposing cache: [ name = url-failures-cache status = STATUS_ALIVE eternal = false overflowToDisk = false maxElementsInMemory = 1000 maxElementsOnDisk = 0 memoryStoreEvictionPolicy = LRU timeToLiveSeconds = 1800 timeToIdleSeconds = 2700 diskPersistent = false diskExpiryThreadIntervalSeconds = 600 cacheEventListeners:  hitCount = 0 memoryStoreHitCount = 0 diskStoreHitCount = 0 missCountNotFound = 0 missCountExpired = 0 ]
 INFO|main|26863|Cache:url-failures-cache       - Disposing cache: [ name = url-failures-cache status = STATUS_ALIVE eternal = false overflowToDisk = false maxElementsInMemory = 1000 maxElementsOnDisk = 0 memoryStoreEvictionPolicy = LRU timeToLiveSeconds = 1800 timeToIdleSeconds = 2700 diskPersistent = false diskExpiryThreadIntervalSeconds = 600 cacheEventListeners:  hitCount = 0 memoryStoreHitCount = 0 diskStoreHitCount = 0 missCountNotFound = 0 missCountExpired = 0 ]
Tests run: 9, Failures: 0, Errors: 0, Skipped: 0, Time elapsed: 0.784 sec
Running org.apache.maven.archiva.web.action.admin.repositories.AddRemoteRepositoryActionTest
[INFO] Disposing cache: [ name = url-failures-cache status = STATUS_ALIVE eternal = false overflowToDisk = false maxElementsInMemory = 1000 maxElementsOnDisk = 0 memoryStoreEvictionPolicy = LRU timeToLiveSeconds = 1800 timeToIdleSeconds = 2700 diskPersistent = true diskExpiryThreadIntervalSeconds = 600 cacheEventListeners:  hitCount = 0 memoryStoreHitCount = 0 diskStoreHitCount = 0 missCountNotFound = 0 missCountExpired = 0 ]
[INFO] Disposing cache: [ name = url-failures-cache status = STATUS_ALIVE eternal = false overflowToDisk = false maxElementsInMemory = 1000 maxElementsOnDisk = 0 memoryStoreEvictionPolicy = LRU timeToLiveSeconds = 1800 timeToIdleSeconds = 2700 diskPersistent = true diskExpiryThreadIntervalSeconds = 600 cacheEventListeners:  hitCount = 0 memoryStoreHitCount = 0 diskStoreHitCount = 0 missCountNotFound = 0 missCountExpired = 0 ]
[INFO] Disposing cache: [ name = url-failures-cache status = STATUS_ALIVE eternal = false overflowToDisk = false maxElementsInMemory = 1000 maxElementsOnDisk = 0 memoryStoreEvictionPolicy = LRU timeToLiveSeconds = 1800 timeToIdleSeconds = 2700 diskPersistent = true diskExpiryThreadIntervalSeconds = 600 cacheEventListeners:  hitCount = 0 memoryStoreHitCount = 0 diskStoreHitCount = 0 missCountNotFound = 0 missCountExpired = 0 ]
Tests run: 3, Failures: 0, Errors: 0, Skipped: 0, Time elapsed: 0.304 sec
Running org.apache.maven.archiva.web.action.admin.repositories.AddManagedRepositoryActionTest
Tests run: 3, Failures: 0, Errors: 0, Skipped: 0, Time elapsed: 0.479 sec
Running org.apache.maven.archiva.web.repository.RepositoryServletSecurityTest
There was no such logger 'org.apache.maven.archiva.configuration.ArchivaConfiguration:default' 11051417.
 INFO|main|28081|Cache:url-failures-cache       - Disposing cache: [ name = url-failures-cache status = STATUS_ALIVE eternal = false overflowToDisk = false maxElementsInMemory = 1000 maxElementsOnDisk = 0 memoryStoreEvictionPolicy = LRU timeToLiveSeconds = 1800 timeToIdleSeconds = 2700 diskPersistent = false diskExpiryThreadIntervalSeconds = 600 cacheEventListeners:  hitCount = 0 memoryStoreHitCount = 0 diskStoreHitCount = 0 missCountNotFound = 0 missCountExpired = 0 ]
 INFO|main|28221|Cache:url-failures-cache       - Disposing cache: [ name = url-failures-cache status = STATUS_ALIVE eternal = false overflowToDisk = false maxElementsInMemory = 1000 maxElementsOnDisk = 0 memoryStoreEvictionPolicy = LRU timeToLiveSeconds = 1800 timeToIdleSeconds = 2700 diskPersistent = false diskExpiryThreadIntervalSeconds = 600 cacheEventListeners:  hitCount = 0 memoryStoreHitCount = 0 diskStoreHitCount = 0 missCountNotFound = 0 missCountExpired = 0 ]
Tests run: 2, Failures: 0, Errors: 0, Skipped: 0, Time elapsed: 0.281 sec
There was no such logger 'org.apache.maven.archiva.configuration.ArchivaConfiguration:default' 9844362.
Running org.apache.maven.archiva.web.repository.RepositoryServletProxiedMetadataRemoteOnlyTest
 INFO|main|28350|log                            - jetty-6.1.5
 INFO|main|28351|log                            - Started SocketConnector@0.0.0.0:42915
Remote HTTP Server started on http://localhost:42915/snapshots
 INFO|main|29263|log                            - jetty-6.1.5
 INFO|main|29264|log                            - Started SocketConnector@0.0.0.0:42917
Remote HTTP Server started on http://localhost:42917/private-snapshots
 INFO|main|30484|AuditLog                       - internal guest 127.0.0.1 "/org/apache/archiva/archivatest-maven-plugin/4.0-alpha-1-SNAPSHOT/maven-metadata.xml" "Modify File (proxied)"
 INFO|main|30728|Cache:url-failures-cache       - Disposing cache: [ name = url-failures-cache status = STATUS_ALIVE eternal = false overflowToDisk = false maxElementsInMemory = 1000 maxElementsOnDisk = 0 memoryStoreEvictionPolicy = LRU timeToLiveSeconds = 1800 timeToIdleSeconds = 2700 diskPersistent = false diskExpiryThreadIntervalSeconds = 600 cacheEventListeners:  hitCount = 0 memoryStoreHitCount = 0 diskStoreHitCount = 0 missCountNotFound = 0 missCountExpired = 0 ]
There was no such logger 'org.codehaus.plexus.redback.xwork.filter.authentication.HttpAuthenticator:basic' 19446596.
 WARN|main|30729|PlexusContainer                - Component manager not found for returned component. Ignored. component=org.apache.maven.archiva.web.repository.ProxiedDavServer@16e523d
 INFO|main|30859|log                            - jetty-6.1.5
 INFO|main|30860|log                            - Started SocketConnector@0.0.0.0:42924
Remote HTTP Server started on http://localhost:42924/snapshots
 INFO|main|31782|log                            - jetty-6.1.5
 INFO|main|31783|log                            - Started SocketConnector@0.0.0.0:42927
Remote HTTP Server started on http://localhost:42927/private-snapshots
 INFO|main|32811|AuditLog                       - internal guest 127.0.0.1 "/org/apache/maven/plugins/maven-assembly-plugin/2.2-beta-2-SNAPSHOT/maven-metadata.xml" "Modify File (proxied)"
 INFO|main|33038|Cache:url-failures-cache       - Disposing cache: [ name = url-failures-cache status = STATUS_ALIVE eternal = false overflowToDisk = false maxElementsInMemory = 1000 maxElementsOnDisk = 0 memoryStoreEvictionPolicy = LRU timeToLiveSeconds = 1800 timeToIdleSeconds = 2700 diskPersistent = false diskExpiryThreadIntervalSeconds = 600 cacheEventListeners:  hitCount = 0 memoryStoreHitCount = 0 diskStoreHitCount = 0 missCountNotFound = 0 missCountExpired = 0 ]
There was no such logger 'org.codehaus.plexus.redback.xwork.filter.authentication.HttpAuthenticator:basic' 30671204.
 WARN|main|33038|PlexusContainer                - Component manager not found for returned component. Ignored. component=org.apache.maven.archiva.web.repository.ProxiedDavServer@115272a
 INFO|main|33202|log                            - jetty-6.1.5
 INFO|main|33203|log                            - Started SocketConnector@0.0.0.0:42933
Remote HTTP Server started on http://localhost:42933/snapshots
 INFO|main|34082|log                            - jetty-6.1.5
 INFO|main|34083|log                            - Started SocketConnector@0.0.0.0:42940
Remote HTTP Server started on http://localhost:42940/private-snapshots
 INFO|main|35123|AuditLog                       - internal guest 127.0.0.1 "/org/apache/archiva/archivatest-maven-plugin/4.0-alpha-2/maven-metadata.xml" "Modify File (proxied)"
 INFO|main|35347|Cache:url-failures-cache       - Disposing cache: [ name = url-failures-cache status = STATUS_ALIVE eternal = false overflowToDisk = false maxElementsInMemory = 1000 maxElementsOnDisk = 0 memoryStoreEvictionPolicy = LRU timeToLiveSeconds = 1800 timeToIdleSeconds = 2700 diskPersistent = false diskExpiryThreadIntervalSeconds = 600 cacheEventListeners:  hitCount = 0 memoryStoreHitCount = 0 diskStoreHitCount = 0 missCountNotFound = 0 missCountExpired = 0 ]
 WARN|main|35348|PlexusContainer                - Component manager not found for returned component. Ignored. component=org.apache.maven.archiva.web.repository.ProxiedDavServer@1d3c2fa
There was no such logger 'org.codehaus.plexus.redback.xwork.filter.authentication.HttpAuthenticator:basic' 1001246.
 INFO|main|35477|log                            - jetty-6.1.5
 INFO|main|35478|log                            - Started SocketConnector@0.0.0.0:42947
Remote HTTP Server started on http://localhost:42947/snapshots
 INFO|main|36382|log                            - jetty-6.1.5
 INFO|main|36383|log                            - Started SocketConnector@0.0.0.0:42949
Remote HTTP Server started on http://localhost:42949/private-snapshots
 INFO|main|37381|AuditLog                       - internal guest 127.0.0.1 "/org/apache/archiva/archivatest-maven-plugin/maven-metadata.xml" "Modify File (proxied)"
 INFO|main|37498|Cache:url-failures-cache       - Disposing cache: [ name = url-failures-cache status = STATUS_ALIVE eternal = false overflowToDisk = false maxElementsInMemory = 1000 maxElementsOnDisk = 0 memoryStoreEvictionPolicy = LRU timeToLiveSeconds = 1800 timeToIdleSeconds = 2700 diskPersistent = false diskExpiryThreadIntervalSeconds = 600 cacheEventListeners:  hitCount = 0 memoryStoreHitCount = 0 diskStoreHitCount = 0 missCountNotFound = 0 missCountExpired = 0 ]
 WARN|main|37498|PlexusContainer                - Component manager not found for returned component. Ignored. component=org.apache.maven.archiva.web.repository.ProxiedDavServer@1ebde03
Tests run: 4, Failures: 0, Errors: 0, Skipped: 0, Time elapsed: 9.275 sec
Running org.apache.maven.archiva.web.action.admin.repositories.RepositoriesActionTest
There was no such logger 'org.codehaus.plexus.redback.xwork.filter.authentication.HttpAuthenticator:basic' 24998777.
 INFO|main|37787|Cache:url-failures-cache       - Disposing cache: [ name = url-failures-cache status = STATUS_ALIVE eternal = false overflowToDisk = false maxElementsInMemory = 1000 maxElementsOnDisk = 0 memoryStoreEvictionPolicy = LRU timeToLiveSeconds = 1800 timeToIdleSeconds = 2700 diskPersistent = true diskExpiryThreadIntervalSeconds = 600 cacheEventListeners:  hitCount = 0 memoryStoreHitCount = 0 diskStoreHitCount = 0 missCountNotFound = 0 missCountExpired = 0 ]
 INFO|main|37887|Cache:url-failures-cache       - Disposing cache: [ name = url-failures-cache status = STATUS_ALIVE eternal = false overflowToDisk = false maxElementsInMemory = 1000 maxElementsOnDisk = 0 memoryStoreEvictionPolicy = LRU timeToLiveSeconds = 1800 timeToIdleSeconds = 2700 diskPersistent = true diskExpiryThreadIntervalSeconds = 600 cacheEventListeners:  hitCount = 0 memoryStoreHitCount = 0 diskStoreHitCount = 0 missCountNotFound = 0 missCountExpired = 0 ]
Tests run: 2, Failures: 0, Errors: 0, Skipped: 0, Time elapsed: 0.386 sec
Running org.apache.maven.archiva.web.repository.RepositoryServletProxiedTimestampedSnapshotPolicyTest
 INFO|main|38068|log                            - jetty-6.1.5
 INFO|main|38069|log                            - Started SocketConnector@0.0.0.0:42953
Remote HTTP Server started on http://localhost:42953/snapshots
 INFO|main|39157|Cache:url-failures-cache       - Disposing cache: [ name = url-failures-cache status = STATUS_ALIVE eternal = false overflowToDisk = false maxElementsInMemory = 1000 maxElementsOnDisk = 0 memoryStoreEvictionPolicy = LRU timeToLiveSeconds = 1800 timeToIdleSeconds = 2700 diskPersistent = false diskExpiryThreadIntervalSeconds = 600 cacheEventListeners:  hitCount = 0 memoryStoreHitCount = 0 diskStoreHitCount = 0 missCountNotFound = 0 missCountExpired = 0 ]
There was no such logger 'org.codehaus.plexus.redback.xwork.filter.authentication.HttpAuthenticator:basic' 24860134.
 WARN|main|39157|PlexusContainer                - Component manager not found for returned component. Ignored. component=org.apache.maven.archiva.web.repository.ProxiedDavServer@164b143
 INFO|main|39294|log                            - jetty-6.1.5
 INFO|main|39295|log                            - Started SocketConnector@0.0.0.0:42956
Remote HTTP Server started on http://localhost:42956/snapshots
 INFO|main|40270|AuditLog                       - internal guest 127.0.0.1 "org/apache/archiva/test/3.0-SNAPSHOT/test-3.0-20070822.033400-42.jar" "Modify File (proxied)"
 INFO|main|40377|Cache:url-failures-cache       - Disposing cache: [ name = url-failures-cache status = STATUS_ALIVE eternal = false overflowToDisk = false maxElementsInMemory = 1000 maxElementsOnDisk = 0 memoryStoreEvictionPolicy = LRU timeToLiveSeconds = 1800 timeToIdleSeconds = 2700 diskPersistent = false diskExpiryThreadIntervalSeconds = 600 cacheEventListeners:  hitCount = 0 memoryStoreHitCount = 0 diskStoreHitCount = 0 missCountNotFound = 0 missCountExpired = 0 ]
 WARN|main|40377|PlexusContainer                - Component manager not found for returned component. Ignored. component=org.apache.maven.archiva.web.repository.ProxiedDavServer@179d4fb
There was no such logger 'org.codehaus.plexus.redback.xwork.filter.authentication.HttpAuthenticator:basic' 16102106.
 INFO|main|40536|log                            - jetty-6.1.5
 INFO|main|40537|log                            - Started SocketConnector@0.0.0.0:42959
Remote HTTP Server started on http://localhost:42959/snapshots
 INFO|main|41499|AuditLog                       - internal guest 127.0.0.1 "org/apache/archiva/test/3.0-SNAPSHOT/test-3.0-20070822.033400-42.jar" "Modify File (proxied)"
 INFO|main|41607|Cache:url-failures-cache       - Disposing cache: [ name = url-failures-cache status = STATUS_ALIVE eternal = false overflowToDisk = false maxElementsInMemory = 1000 maxElementsOnDisk = 0 memoryStoreEvictionPolicy = LRU timeToLiveSeconds = 1800 timeToIdleSeconds = 2700 diskPersistent = false diskExpiryThreadIntervalSeconds = 600 cacheEventListeners:  hitCount = 0 memoryStoreHitCount = 0 diskStoreHitCount = 0 missCountNotFound = 0 missCountExpired = 0 ]
There was no such logger 'org.codehaus.plexus.redback.xwork.filter.authentication.HttpAuthenticator:basic' 1566281.
 WARN|main|41607|PlexusContainer                - Component manager not found for returned component. Ignored. component=org.apache.maven.archiva.web.repository.ProxiedDavServer@d78fb4
 INFO|main|41787|log                            - jetty-6.1.5
 INFO|main|41788|log                            - Started SocketConnector@0.0.0.0:42962
Remote HTTP Server started on http://localhost:42962/snapshots
 INFO|main|42780|RepositoryProxyConnectors:default - Transfer not attempted on http://localhost:42962/snapshots/org/apache/archiva/test/3.0-SNAPSHOT/test-3.0-20070822.033400-42.jar : NO to update snapshots, policy is DAILY, local file exist, and has been updated within the last day.: using already present local file.
 INFO|main|42781|AuditLog                       - internal guest 127.0.0.1 "org/apache/archiva/test/3.0-SNAPSHOT/test-3.0-20070822.033400-42.jar" "Modify File (proxied)"
 INFO|main|42887|Cache:url-failures-cache       - Disposing cache: [ name = url-failures-cache status = STATUS_ALIVE eternal = false overflowToDisk = false maxElementsInMemory = 1000 maxElementsOnDisk = 0 memoryStoreEvictionPolicy = LRU timeToLiveSeconds = 1800 timeToIdleSeconds = 2700 diskPersistent = false diskExpiryThreadIntervalSeconds = 600 cacheEventListeners:  hitCount = 0 memoryStoreHitCount = 0 diskStoreHitCount = 0 missCountNotFound = 0 missCountExpired = 0 ]
There was no such logger 'org.codehaus.plexus.redback.xwork.filter.authentication.HttpAuthenticator:basic' 32944130.
 WARN|main|42887|PlexusContainer                - Component manager not found for returned component. Ignored. component=org.apache.maven.archiva.web.repository.ProxiedDavServer@1a8019f
 INFO|main|43028|log                            - jetty-6.1.5
 INFO|main|43029|log                            - Started SocketConnector@0.0.0.0:42965
Remote HTTP Server started on http://localhost:42965/snapshots
 INFO|main|44039|AuditLog                       - internal guest 127.0.0.1 "org/apache/archiva/test/3.0-SNAPSHOT/test-3.0-20070822.033400-42.jar" "Modify File (proxied)"
 INFO|main|44146|Cache:url-failures-cache       - Disposing cache: [ name = url-failures-cache status = STATUS_ALIVE eternal = false overflowToDisk = false maxElementsInMemory = 1000 maxElementsOnDisk = 0 memoryStoreEvictionPolicy = LRU timeToLiveSeconds = 1800 timeToIdleSeconds = 2700 diskPersistent = false diskExpiryThreadIntervalSeconds = 600 cacheEventListeners:  hitCount = 0 memoryStoreHitCount = 0 diskStoreHitCount = 0 missCountNotFound = 0 missCountExpired = 0 ]
There was no such logger 'org.codehaus.plexus.redback.xwork.filter.authentication.HttpAuthenticator:basic' 22025519.
 WARN|main|44147|PlexusContainer                - Component manager not found for returned component. Ignored. component=org.apache.maven.archiva.web.repository.ProxiedDavServer@37d830
 INFO|main|44456|log                            - jetty-6.1.5
 INFO|main|44457|log                            - Started SocketConnector@0.0.0.0:42968
Remote HTTP Server started on http://localhost:42968/snapshots
 INFO|main|45378|AuditLog                       - internal guest 127.0.0.1 "org/apache/archiva/test/3.0-SNAPSHOT/test-3.0-20070822.033400-42.jar" "Modify File (proxied)"
 INFO|main|45486|Cache:url-failures-cache       - Disposing cache: [ name = url-failures-cache status = STATUS_ALIVE eternal = false overflowToDisk = false maxElementsInMemory = 1000 maxElementsOnDisk = 0 memoryStoreEvictionPolicy = LRU timeToLiveSeconds = 1800 timeToIdleSeconds = 2700 diskPersistent = false diskExpiryThreadIntervalSeconds = 600 cacheEventListeners:  hitCount = 0 memoryStoreHitCount = 0 diskStoreHitCount = 0 missCountNotFound = 0 missCountExpired = 0 ]
There was no such logger 'org.codehaus.plexus.redback.xwork.filter.authentication.HttpAuthenticator:basic' 28857253.
 WARN|main|45487|PlexusContainer                - Component manager not found for returned component. Ignored. component=org.apache.maven.archiva.web.repository.ProxiedDavServer@9ea89f
 INFO|main|45632|log                            - jetty-6.1.5
 INFO|main|45633|log                            - Started SocketConnector@0.0.0.0:42971
Remote HTTP Server started on http://localhost:42971/snapshots
 INFO|main|46569|RepositoryProxyConnectors:default - Transfer not attempted on http://localhost:42971/snapshots/org/apache/archiva/test/3.0-SNAPSHOT/test-3.0-20070822.033400-42.pom : NO to update, snapshots policy set to NEVER.
 INFO|main|46569|RepositoryProxyConnectors:default - Transfer not attempted on http://localhost:42971/snapshots/org/apache/archiva/test/3.0-SNAPSHOT/test-3.0-20070822.033400-42.jar : NO to update, snapshots policy set to NEVER.: using already present local file.
 INFO|main|46570|AuditLog                       - internal guest 127.0.0.1 "org/apache/archiva/test/3.0-SNAPSHOT/test-3.0-20070822.033400-42.jar" "Modify File (proxied)"
 INFO|main|46676|Cache:url-failures-cache       - Disposing cache: [ name = url-failures-cache status = STATUS_ALIVE eternal = false overflowToDisk = false maxElementsInMemory = 1000 maxElementsOnDisk = 0 memoryStoreEvictionPolicy = LRU timeToLiveSeconds = 1800 timeToIdleSeconds = 2700 diskPersistent = false diskExpiryThreadIntervalSeconds = 600 cacheEventListeners:  hitCount = 0 memoryStoreHitCount = 0 diskStoreHitCount = 0 missCountNotFound = 0 missCountExpired = 0 ]
There was no such logger 'org.codehaus.plexus.redback.xwork.filter.authentication.HttpAuthenticator:basic' 25779704.
 WARN|main|46676|PlexusContainer                - Component manager not found for returned component. Ignored. component=org.apache.maven.archiva.web.repository.ProxiedDavServer@1d1395
 INFO|main|46798|log                            - jetty-6.1.5
 INFO|main|46799|log                            - Started SocketConnector@0.0.0.0:42973
Remote HTTP Server started on http://localhost:42973/snapshots
 INFO|main|47712|RepositoryProxyConnectors:default - Transfer not attempted on http://localhost:42973/snapshots/org/apache/archiva/test/3.0-SNAPSHOT/test-3.0-20070822.033400-42.pom : NO to update, snapshots policy set to NEVER.
 INFO|main|47712|RepositoryProxyConnectors:default - Transfer not attempted on http://localhost:42973/snapshots/org/apache/archiva/test/3.0-SNAPSHOT/test-3.0-20070822.033400-42.jar : NO to update, snapshots policy set to NEVER.
 INFO|main|47826|Cache:url-failures-cache       - Disposing cache: [ name = url-failures-cache status = STATUS_ALIVE eternal = false overflowToDisk = false maxElementsInMemory = 1000 maxElementsOnDisk = 0 memoryStoreEvictionPolicy = LRU timeToLiveSeconds = 1800 timeToIdleSeconds = 2700 diskPersistent = false diskExpiryThreadIntervalSeconds = 600 cacheEventListeners:  hitCount = 0 memoryStoreHitCount = 0 diskStoreHitCount = 0 missCountNotFound = 0 missCountExpired = 0 ]
There was no such logger 'org.codehaus.plexus.redback.xwork.filter.authentication.HttpAuthenticator:basic' 2549208.
 WARN|main|47827|PlexusContainer                - Component manager not found for returned component. Ignored. component=org.apache.maven.archiva.web.repository.ProxiedDavServer@d40c4e
 INFO|main|48191|log                            - jetty-6.1.5
 INFO|main|48192|log                            - Started SocketConnector@0.0.0.0:42975
Remote HTTP Server started on http://localhost:42975/snapshots
 INFO|main|49111|RepositoryProxyConnectors:default - Transfer not attempted on http://localhost:42975/snapshots/org/apache/archiva/test/3.0-SNAPSHOT/test-3.0-20070822.033400-42.pom : NO to update, snapshots policy set to NEVER.
 INFO|main|49111|RepositoryProxyConnectors:default - Transfer not attempted on http://localhost:42975/snapshots/org/apache/archiva/test/3.0-SNAPSHOT/test-3.0-20070822.033400-42.jar : NO to update, snapshots policy set to NEVER.: using already present local file.
 INFO|main|49112|AuditLog                       - internal guest 127.0.0.1 "org/apache/archiva/test/3.0-SNAPSHOT/test-3.0-20070822.033400-42.jar" "Modify File (proxied)"
 INFO|main|49216|Cache:url-failures-cache       - Disposing cache: [ name = url-failures-cache status = STATUS_ALIVE eternal = false overflowToDisk = false maxElementsInMemory = 1000 maxElementsOnDisk = 0 memoryStoreEvictionPolicy = LRU timeToLiveSeconds = 1800 timeToIdleSeconds = 2700 diskPersistent = false diskExpiryThreadIntervalSeconds = 600 cacheEventListeners:  hitCount = 0 memoryStoreHitCount = 0 diskStoreHitCount = 0 missCountNotFound = 0 missCountExpired = 0 ]
There was no such logger 'org.codehaus.plexus.redback.xwork.filter.authentication.HttpAuthenticator:basic' 591409.
 WARN|main|49216|PlexusContainer                - Component manager not found for returned component. Ignored. component=org.apache.maven.archiva.web.repository.ProxiedDavServer@5e3ad0
 INFO|main|49332|log                            - jetty-6.1.5
 INFO|main|49333|log                            - Started SocketConnector@0.0.0.0:42977
Remote HTTP Server started on http://localhost:42977/snapshots
 INFO|main|50268|RepositoryProxyConnectors:default - Transfer not attempted on http://localhost:42977/snapshots/org/apache/archiva/test/3.0-SNAPSHOT/test-3.0-20070822.033400-42.jar : NO to update snapshots, policy is HOURLY, local file exist, and has been updated within the last hour.: using already present local file.
 INFO|main|50269|AuditLog                       - internal guest 127.0.0.1 "org/apache/archiva/test/3.0-SNAPSHOT/test-3.0-20070822.033400-42.jar" "Modify File (proxied)"
 INFO|main|50376|Cache:url-failures-cache       - Disposing cache: [ name = url-failures-cache status = STATUS_ALIVE eternal = false overflowToDisk = false maxElementsInMemory = 1000 maxElementsOnDisk = 0 memoryStoreEvictionPolicy = LRU timeToLiveSeconds = 1800 timeToIdleSeconds = 2700 diskPersistent = false diskExpiryThreadIntervalSeconds = 600 cacheEventListeners:  hitCount = 0 memoryStoreHitCount = 0 diskStoreHitCount = 0 missCountNotFound = 0 missCountExpired = 0 ]
There was no such logger 'org.codehaus.plexus.redback.xwork.filter.authentication.HttpAuthenticator:basic' 16664142.
 WARN|main|50376|PlexusContainer                - Component manager not found for returned component. Ignored. component=org.apache.maven.archiva.web.repository.ProxiedDavServer@98a7eb
 INFO|main|50503|log                            - jetty-6.1.5
 INFO|main|50504|log                            - Started SocketConnector@0.0.0.0:42982
Remote HTTP Server started on http://localhost:42982/snapshots
 INFO|main|51497|AuditLog                       - internal guest 127.0.0.1 "org/apache/archiva/test/3.0-SNAPSHOT/test-3.0-20070822.033400-42.jar" "Modify File (proxied)"
 INFO|main|51606|Cache:url-failures-cache       - Disposing cache: [ name = url-failures-cache status = STATUS_ALIVE eternal = false overflowToDisk = false maxElementsInMemory = 1000 maxElementsOnDisk = 0 memoryStoreEvictionPolicy = LRU timeToLiveSeconds = 1800 timeToIdleSeconds = 2700 diskPersistent = false diskExpiryThreadIntervalSeconds = 600 cacheEventListeners:  hitCount = 0 memoryStoreHitCount = 0 diskStoreHitCount = 0 missCountNotFound = 0 missCountExpired = 0 ]
 WARN|main|51606|PlexusContainer                - Component manager not found for returned component. Ignored. component=org.apache.maven.archiva.web.repository.ProxiedDavServer@1b66659
There was no such logger 'org.codehaus.plexus.redback.xwork.filter.authentication.HttpAuthenticator:basic' 12115935.
 INFO|main|51739|log                            - jetty-6.1.5
 INFO|main|51739|log                            - Started SocketConnector@0.0.0.0:42985
Remote HTTP Server started on http://localhost:42985/snapshots
 INFO|main|53028|AuditLog                       - internal guest 127.0.0.1 "org/apache/archiva/test/3.0-SNAPSHOT/test-3.0-20070822.033400-42.jar" "Modify File (proxied)"
 INFO|main|53135|Cache:url-failures-cache       - Disposing cache: [ name = url-failures-cache status = STATUS_ALIVE eternal = false overflowToDisk = false maxElementsInMemory = 1000 maxElementsOnDisk = 0 memoryStoreEvictionPolicy = LRU timeToLiveSeconds = 1800 timeToIdleSeconds = 2700 diskPersistent = false diskExpiryThreadIntervalSeconds = 600 cacheEventListeners:  hitCount = 0 memoryStoreHitCount = 0 diskStoreHitCount = 0 missCountNotFound = 0 missCountExpired = 0 ]
 WARN|main|53136|PlexusContainer                - Component manager not found for returned component. Ignored. component=org.apache.maven.archiva.web.repository.ProxiedDavServer@59f5
There was no such logger 'org.codehaus.plexus.redback.xwork.filter.authentication.HttpAuthenticator:basic' 942815.
 INFO|main|53263|log                            - jetty-6.1.5
 INFO|main|53264|log                            - Started SocketConnector@0.0.0.0:42988
Remote HTTP Server started on http://localhost:42988/snapshots
 INFO|main|54245|RepositoryProxyConnectors:default - Transfer not attempted on http://localhost:42988/snapshots/org/apache/archiva/test/3.0-SNAPSHOT/test-3.0-20070822.033400-42.jar : NO to update snapshots, policy is ONCE, and local file exist.: using already present local file.
 INFO|main|54246|AuditLog                       - internal guest 127.0.0.1 "org/apache/archiva/test/3.0-SNAPSHOT/test-3.0-20070822.033400-42.jar" "Modify File (proxied)"
 INFO|main|54355|Cache:url-failures-cache       - Disposing cache: [ name = url-failures-cache status = STATUS_ALIVE eternal = false overflowToDisk = false maxElementsInMemory = 1000 maxElementsOnDisk = 0 memoryStoreEvictionPolicy = LRU timeToLiveSeconds = 1800 timeToIdleSeconds = 2700 diskPersistent = false diskExpiryThreadIntervalSeconds = 600 cacheEventListeners:  hitCount = 0 memoryStoreHitCount = 0 diskStoreHitCount = 0 missCountNotFound = 0 missCountExpired = 0 ]
There was no such logger 'org.codehaus.plexus.redback.xwork.filter.authentication.HttpAuthenticator:basic' 27249164.
 WARN|main|54356|PlexusContainer                - Component manager not found for returned component. Ignored. component=org.apache.maven.archiva.web.repository.ProxiedDavServer@1641f43
 INFO|main|54471|log                            - jetty-6.1.5
 INFO|main|54472|log                            - Started SocketConnector@0.0.0.0:42992
Remote HTTP Server started on http://localhost:42992/snapshots
 INFO|main|55407|AuditLog                       - internal guest 127.0.0.1 "org/apache/archiva/test/3.0-SNAPSHOT/test-3.0-20070822.033400-42.jar" "Modify File (proxied)"
 INFO|main|55515|Cache:url-failures-cache       - Disposing cache: [ name = url-failures-cache status = STATUS_ALIVE eternal = false overflowToDisk = false maxElementsInMemory = 1000 maxElementsOnDisk = 0 memoryStoreEvictionPolicy = LRU timeToLiveSeconds = 1800 timeToIdleSeconds = 2700 diskPersistent = false diskExpiryThreadIntervalSeconds = 600 cacheEventListeners:  hitCount = 0 memoryStoreHitCount = 0 diskStoreHitCount = 0 missCountNotFound = 0 missCountExpired = 0 ]
There was no such logger 'org.codehaus.plexus.redback.xwork.filter.authentication.HttpAuthenticator:basic' 17794055.
 WARN|main|55516|PlexusContainer                - Component manager not found for returned component. Ignored. component=org.apache.maven.archiva.web.repository.ProxiedDavServer@159c41f
 INFO|main|55639|log                            - jetty-6.1.5
 INFO|main|55640|log                            - Started SocketConnector@0.0.0.0:42995
Remote HTTP Server started on http://localhost:42995/snapshots
 INFO|main|56557|AuditLog                       - internal guest 127.0.0.1 "org/apache/archiva/test/3.0-SNAPSHOT/test-3.0-20070822.033400-42.jar" "Modify File (proxied)"
 INFO|main|56665|Cache:url-failures-cache       - Disposing cache: [ name = url-failures-cache status = STATUS_ALIVE eternal = false overflowToDisk = false maxElementsInMemory = 1000 maxElementsOnDisk = 0 memoryStoreEvictionPolicy = LRU timeToLiveSeconds = 1800 timeToIdleSeconds = 2700 diskPersistent = false diskExpiryThreadIntervalSeconds = 600 cacheEventListeners:  hitCount = 0 memoryStoreHitCount = 0 diskStoreHitCount = 0 missCountNotFound = 0 missCountExpired = 0 ]
There was no such logger 'org.codehaus.plexus.redback.xwork.filter.authentication.HttpAuthenticator:basic' 22336761.
 WARN|main|56665|PlexusContainer                - Component manager not found for returned component. Ignored. component=org.apache.maven.archiva.web.repository.ProxiedDavServer@196de7e
Tests run: 15, Failures: 0, Errors: 0, Skipped: 0, Time elapsed: 18.776 sec
Running org.apache.maven.archiva.web.repository.RepositoryServletProxiedSnapshotPolicyTest
 INFO|main|57006|log                            - jetty-6.1.5
 INFO|main|57007|log                            - Started SocketConnector@0.0.0.0:42998
Remote HTTP Server started on http://localhost:42998/snapshots
 INFO|main|58115|Cache:url-failures-cache       - Disposing cache: [ name = url-failures-cache status = STATUS_ALIVE eternal = false overflowToDisk = false maxElementsInMemory = 1000 maxElementsOnDisk = 0 memoryStoreEvictionPolicy = LRU timeToLiveSeconds = 1800 timeToIdleSeconds = 2700 diskPersistent = false diskExpiryThreadIntervalSeconds = 600 cacheEventListeners:  hitCount = 0 memoryStoreHitCount = 0 diskStoreHitCount = 0 missCountNotFound = 0 missCountExpired = 0 ]
There was no such logger 'org.codehaus.plexus.redback.xwork.filter.authentication.HttpAuthenticator:basic' 23791810.
 WARN|main|58115|PlexusContainer                - Component manager not found for returned component. Ignored. component=org.apache.maven.archiva.web.repository.ProxiedDavServer@b2311b
 INFO|main|58224|log                            - jetty-6.1.5
 INFO|main|58225|log                            - Started SocketConnector@0.0.0.0:43001
Remote HTTP Server started on http://localhost:43001/snapshots
 INFO|main|59176|AuditLog                       - internal guest 127.0.0.1 "org/apache/archiva/test/2.0-SNAPSHOT/test-2.0-SNAPSHOT.jar" "Modify File (proxied)"
 INFO|main|59285|Cache:url-failures-cache       - Disposing cache: [ name = url-failures-cache status = STATUS_ALIVE eternal = false overflowToDisk = false maxElementsInMemory = 1000 maxElementsOnDisk = 0 memoryStoreEvictionPolicy = LRU timeToLiveSeconds = 1800 timeToIdleSeconds = 2700 diskPersistent = false diskExpiryThreadIntervalSeconds = 600 cacheEventListeners:  hitCount = 0 memoryStoreHitCount = 0 diskStoreHitCount = 0 missCountNotFound = 0 missCountExpired = 0 ]
 WARN|main|59285|PlexusContainer                - Component manager not found for returned component. Ignored. component=org.apache.maven.archiva.web.repository.ProxiedDavServer@8487ba
There was no such logger 'org.codehaus.plexus.redback.xwork.filter.authentication.HttpAuthenticator:basic' 10455745.
 INFO|main|59418|log                            - jetty-6.1.5
 INFO|main|59419|log                            - Started SocketConnector@0.0.0.0:43014
Remote HTTP Server started on http://localhost:43014/snapshots
 INFO|main|60375|AuditLog                       - internal guest 127.0.0.1 "org/apache/archiva/test/2.0-SNAPSHOT/test-2.0-SNAPSHOT.jar" "Modify File (proxied)"
 INFO|main|60484|Cache:url-failures-cache       - Disposing cache: [ name = url-failures-cache status = STATUS_ALIVE eternal = false overflowToDisk = false maxElementsInMemory = 1000 maxElementsOnDisk = 0 memoryStoreEvictionPolicy = LRU timeToLiveSeconds = 1800 timeToIdleSeconds = 2700 diskPersistent = false diskExpiryThreadIntervalSeconds = 600 cacheEventListeners:  hitCount = 0 memoryStoreHitCount = 0 diskStoreHitCount = 0 missCountNotFound = 0 missCountExpired = 0 ]
There was no such logger 'org.codehaus.plexus.redback.xwork.filter.authentication.HttpAuthenticator:basic' 21324756.
 WARN|main|60485|PlexusContainer                - Component manager not found for returned component. Ignored. component=org.apache.maven.archiva.web.repository.ProxiedDavServer@6adf2f
 INFO|main|60860|log                            - jetty-6.1.5
 INFO|main|60861|log                            - Started SocketConnector@0.0.0.0:43023
Remote HTTP Server started on http://localhost:43023/snapshots
 INFO|main|61778|RepositoryProxyConnectors:default - Transfer not attempted on http://localhost:43023/snapshots/org/apache/archiva/test/2.0-SNAPSHOT/test-2.0-SNAPSHOT.jar : NO to update snapshots, policy is DAILY, local file exist, and has been updated within the last day.: using already present local file.
 INFO|main|61779|AuditLog                       - internal guest 127.0.0.1 "org/apache/archiva/test/2.0-SNAPSHOT/test-2.0-SNAPSHOT.jar" "Modify File (proxied)"
 INFO|main|61884|Cache:url-failures-cache       - Disposing cache: [ name = url-failures-cache status = STATUS_ALIVE eternal = false overflowToDisk = false maxElementsInMemory = 1000 maxElementsOnDisk = 0 memoryStoreEvictionPolicy = LRU timeToLiveSeconds = 1800 timeToIdleSeconds = 2700 diskPersistent = false diskExpiryThreadIntervalSeconds = 600 cacheEventListeners:  hitCount = 0 memoryStoreHitCount = 0 diskStoreHitCount = 0 missCountNotFound = 0 missCountExpired = 0 ]
There was no such logger 'org.codehaus.plexus.redback.xwork.filter.authentication.HttpAuthenticator:basic' 32299803.
 WARN|main|61885|PlexusContainer                - Component manager not found for returned component. Ignored. component=org.apache.maven.archiva.web.repository.ProxiedDavServer@d13a01
 INFO|main|62027|log                            - jetty-6.1.5
 INFO|main|62028|log                            - Started SocketConnector@0.0.0.0:43030
Remote HTTP Server started on http://localhost:43030/snapshots
 INFO|main|62965|AuditLog                       - internal guest 127.0.0.1 "org/apache/archiva/test/2.0-SNAPSHOT/test-2.0-SNAPSHOT.jar" "Modify File (proxied)"
 INFO|main|63074|Cache:url-failures-cache       - Disposing cache: [ name = url-failures-cache status = STATUS_ALIVE eternal = false overflowToDisk = false maxElementsInMemory = 1000 maxElementsOnDisk = 0 memoryStoreEvictionPolicy = LRU timeToLiveSeconds = 1800 timeToIdleSeconds = 2700 diskPersistent = false diskExpiryThreadIntervalSeconds = 600 cacheEventListeners:  hitCount = 0 memoryStoreHitCount = 0 diskStoreHitCount = 0 missCountNotFound = 0 missCountExpired = 0 ]
There was no such logger 'org.codehaus.plexus.redback.xwork.filter.authentication.HttpAuthenticator:basic' 24635598.
 WARN|main|63075|PlexusContainer                - Component manager not found for returned component. Ignored. component=org.apache.maven.archiva.web.repository.ProxiedDavServer@1124805
 INFO|main|63201|log                            - jetty-6.1.5
 INFO|main|63202|log                            - Started SocketConnector@0.0.0.0:43033
Remote HTTP Server started on http://localhost:43033/snapshots
 INFO|main|64196|AuditLog                       - internal guest 127.0.0.1 "org/apache/archiva/test/2.0-SNAPSHOT/test-2.0-SNAPSHOT.jar" "Modify File (proxied)"
 INFO|main|64304|Cache:url-failures-cache       - Disposing cache: [ name = url-failures-cache status = STATUS_ALIVE eternal = false overflowToDisk = false maxElementsInMemory = 1000 maxElementsOnDisk = 0 memoryStoreEvictionPolicy = LRU timeToLiveSeconds = 1800 timeToIdleSeconds = 2700 diskPersistent = false diskExpiryThreadIntervalSeconds = 600 cacheEventListeners:  hitCount = 0 memoryStoreHitCount = 0 diskStoreHitCount = 0 missCountNotFound = 0 missCountExpired = 0 ]
There was no such logger 'org.codehaus.plexus.redback.xwork.filter.authentication.HttpAuthenticator:basic' 11709783.
 WARN|main|64304|PlexusContainer                - Component manager not found for returned component. Ignored. component=org.apache.maven.archiva.web.repository.ProxiedDavServer@141aa25
 INFO|main|64420|log                            - jetty-6.1.5
 INFO|main|64421|log                            - Started SocketConnector@0.0.0.0:43036
Remote HTTP Server started on http://localhost:-1/snapshots
There was no such logger 'org.apache.maven.archiva.configuration.ArchivaConfiguration:default' 5956743.
 INFO|main|64534|Cache:url-failures-cache       - Disposing cache: [ name = url-failures-cache status = STATUS_ALIVE eternal = false overflowToDisk = false maxElementsInMemory = 1000 maxElementsOnDisk = 0 memoryStoreEvictionPolicy = LRU timeToLiveSeconds = 1800 timeToIdleSeconds = 2700 diskPersistent = false diskExpiryThreadIntervalSeconds = 600 cacheEventListeners:  hitCount = 0 memoryStoreHitCount = 0 diskStoreHitCount = 0 missCountNotFound = 0 missCountExpired = 0 ]
 INFO|main|64978|log                            - jetty-6.1.5
 INFO|main|64979|log                            - Started SocketConnector@0.0.0.0:43039
Remote HTTP Server started on http://localhost:43039/snapshots
 INFO|main|65933|RepositoryProxyConnectors:default - Transfer not attempted on http://localhost:43039/snapshots/org/apache/archiva/test/2.0-SNAPSHOT/test-2.0-SNAPSHOT.pom : NO to update, snapshots policy set to NEVER.
 INFO|main|65933|RepositoryProxyConnectors:default - Transfer not attempted on http://localhost:43039/snapshots/org/apache/archiva/test/2.0-SNAPSHOT/test-2.0-SNAPSHOT.jar : NO to update, snapshots policy set to NEVER.
 INFO|main|66066|Cache:url-failures-cache       - Disposing cache: [ name = url-failures-cache status = STATUS_ALIVE eternal = false overflowToDisk = false maxElementsInMemory = 1000 maxElementsOnDisk = 0 memoryStoreEvictionPolicy = LRU timeToLiveSeconds = 1800 timeToIdleSeconds = 2700 diskPersistent = false diskExpiryThreadIntervalSeconds = 600 cacheEventListeners:  hitCount = 0 memoryStoreHitCount = 0 diskStoreHitCount = 0 missCountNotFound = 0 missCountExpired = 0 ]
 WARN|main|66066|PlexusContainer                - Component manager not found for returned component. Ignored. component=org.apache.maven.archiva.web.repository.ProxiedDavServer@1a729c1
There was no such logger 'org.codehaus.plexus.redback.xwork.filter.authentication.HttpAuthenticator:basic' 3329407.
 INFO|main|66399|log                            - jetty-6.1.5
 INFO|main|66400|log                            - Started SocketConnector@0.0.0.0:43041
Remote HTTP Server started on http://localhost:43041/snapshots
 INFO|main|67323|RepositoryProxyConnectors:default - Transfer not attempted on http://localhost:43041/snapshots/org/apache/archiva/test/2.0-SNAPSHOT/test-2.0-SNAPSHOT.pom : NO to update, snapshots policy set to NEVER.
 INFO|main|67323|RepositoryProxyConnectors:default - Transfer not attempted on http://localhost:43041/snapshots/org/apache/archiva/test/2.0-SNAPSHOT/test-2.0-SNAPSHOT.jar : NO to update, snapshots policy set to NEVER.: using already present local file.
 INFO|main|67324|AuditLog                       - internal guest 127.0.0.1 "org/apache/archiva/test/2.0-SNAPSHOT/test-2.0-SNAPSHOT.jar" "Modify File (proxied)"
 INFO|main|67434|Cache:url-failures-cache       - Disposing cache: [ name = url-failures-cache status = STATUS_ALIVE eternal = false overflowToDisk = false maxElementsInMemory = 1000 maxElementsOnDisk = 0 memoryStoreEvictionPolicy = LRU timeToLiveSeconds = 1800 timeToIdleSeconds = 2700 diskPersistent = false diskExpiryThreadIntervalSeconds = 600 cacheEventListeners:  hitCount = 0 memoryStoreHitCount = 0 diskStoreHitCount = 0 missCountNotFound = 0 missCountExpired = 0 ]
There was no such logger 'org.codehaus.plexus.redback.xwork.filter.authentication.HttpAuthenticator:basic' 5413348.
 WARN|main|67434|PlexusContainer                - Component manager not found for returned component. Ignored. component=org.apache.maven.archiva.web.repository.ProxiedDavServer@1485026
 INFO|main|67558|log                            - jetty-6.1.5
 INFO|main|67559|log                            - Started SocketConnector@0.0.0.0:43043
Remote HTTP Server started on http://localhost:43043/snapshots
 INFO|main|68455|RepositoryProxyConnectors:default - Transfer not attempted on http://localhost:43043/snapshots/org/apache/archiva/test/2.0-SNAPSHOT/test-2.0-SNAPSHOT.jar : NO to update snapshots, policy is HOURLY, local file exist, and has been updated within the last hour.: using already present local file.
 INFO|main|68456|AuditLog                       - internal guest 127.0.0.1 "org/apache/archiva/test/2.0-SNAPSHOT/test-2.0-SNAPSHOT.jar" "Modify File (proxied)"
 INFO|main|68563|Cache:url-failures-cache       - Disposing cache: [ name = url-failures-cache status = STATUS_ALIVE eternal = false overflowToDisk = false maxElementsInMemory = 1000 maxElementsOnDisk = 0 memoryStoreEvictionPolicy = LRU timeToLiveSeconds = 1800 timeToIdleSeconds = 2700 diskPersistent = false diskExpiryThreadIntervalSeconds = 600 cacheEventListeners:  hitCount = 0 memoryStoreHitCount = 0 diskStoreHitCount = 0 missCountNotFound = 0 missCountExpired = 0 ]
There was no such logger 'org.codehaus.plexus.redback.xwork.filter.authentication.HttpAuthenticator:basic' 14473873.
 WARN|main|68564|PlexusContainer                - Component manager not found for returned component. Ignored. component=org.apache.maven.archiva.web.repository.ProxiedDavServer@1ffba4f
 INFO|main|68689|log                            - jetty-6.1.5
 INFO|main|68689|log                            - Started SocketConnector@0.0.0.0:43046
Remote HTTP Server started on http://localhost:43046/snapshots
 INFO|main|69865|AuditLog                       - internal guest 127.0.0.1 "org/apache/archiva/test/2.0-SNAPSHOT/test-2.0-SNAPSHOT.jar" "Modify File (proxied)"
 INFO|main|69973|Cache:url-failures-cache       - Disposing cache: [ name = url-failures-cache status = STATUS_ALIVE eternal = false overflowToDisk = false maxElementsInMemory = 1000 maxElementsOnDisk = 0 memoryStoreEvictionPolicy = LRU timeToLiveSeconds = 1800 timeToIdleSeconds = 2700 diskPersistent = false diskExpiryThreadIntervalSeconds = 600 cacheEventListeners:  hitCount = 0 memoryStoreHitCount = 0 diskStoreHitCount = 0 missCountNotFound = 0 missCountExpired = 0 ]
There was no such logger 'org.codehaus.plexus.redback.xwork.filter.authentication.HttpAuthenticator:basic' 22761372.
 WARN|main|69974|PlexusContainer                - Component manager not found for returned component. Ignored. component=org.apache.maven.archiva.web.repository.ProxiedDavServer@1d449fc
 INFO|main|70103|log                            - jetty-6.1.5
 INFO|main|70104|log                            - Started SocketConnector@0.0.0.0:43050
Remote HTTP Server started on http://localhost:43050/snapshots
 INFO|main|71074|AuditLog                       - internal guest 127.0.0.1 "org/apache/archiva/test/2.0-SNAPSHOT/test-2.0-SNAPSHOT.jar" "Modify File (proxied)"
 INFO|main|71183|Cache:url-failures-cache       - Disposing cache: [ name = url-failures-cache status = STATUS_ALIVE eternal = false overflowToDisk = false maxElementsInMemory = 1000 maxElementsOnDisk = 0 memoryStoreEvictionPolicy = LRU timeToLiveSeconds = 1800 timeToIdleSeconds = 2700 diskPersistent = false diskExpiryThreadIntervalSeconds = 600 cacheEventListeners:  hitCount = 0 memoryStoreHitCount = 0 diskStoreHitCount = 0 missCountNotFound = 0 missCountExpired = 0 ]
There was no such logger 'org.codehaus.plexus.redback.xwork.filter.authentication.HttpAuthenticator:basic' 15607581.
 WARN|main|71184|PlexusContainer                - Component manager not found for returned component. Ignored. component=org.apache.maven.archiva.web.repository.ProxiedDavServer@3e0c6
 INFO|main|71331|log                            - jetty-6.1.5
 INFO|main|71332|log                            - Started SocketConnector@0.0.0.0:43053
Remote HTTP Server started on http://localhost:43053/snapshots
 INFO|main|72238|RepositoryProxyConnectors:default - Transfer not attempted on http://localhost:43053/snapshots/org/apache/archiva/test/2.0-SNAPSHOT/test-2.0-SNAPSHOT.jar : NO to update snapshots, policy is ONCE, and local file exist.: using already present local file.
 INFO|main|72238|AuditLog                       - internal guest 127.0.0.1 "org/apache/archiva/test/2.0-SNAPSHOT/test-2.0-SNAPSHOT.jar" "Modify File (proxied)"
 INFO|main|72343|Cache:url-failures-cache       - Disposing cache: [ name = url-failures-cache status = STATUS_ALIVE eternal = false overflowToDisk = false maxElementsInMemory = 1000 maxElementsOnDisk = 0 memoryStoreEvictionPolicy = LRU timeToLiveSeconds = 1800 timeToIdleSeconds = 2700 diskPersistent = false diskExpiryThreadIntervalSeconds = 600 cacheEventListeners:  hitCount = 0 memoryStoreHitCount = 0 diskStoreHitCount = 0 missCountNotFound = 0 missCountExpired = 0 ]
 WARN|main|72343|PlexusContainer                - Component manager not found for returned component. Ignored. component=org.apache.maven.archiva.web.repository.ProxiedDavServer@14115e3
There was no such logger 'org.codehaus.plexus.redback.xwork.filter.authentication.HttpAuthenticator:basic' 16166946.
 INFO|main|72458|log                            - jetty-6.1.5
 INFO|main|72459|log                            - Started SocketConnector@0.0.0.0:43056
Remote HTTP Server started on http://localhost:43056/snapshots
 INFO|main|73364|AuditLog                       - internal guest 127.0.0.1 "org/apache/archiva/test/2.0-SNAPSHOT/test-2.0-SNAPSHOT.jar" "Modify File (proxied)"
 INFO|main|73473|Cache:url-failures-cache       - Disposing cache: [ name = url-failures-cache status = STATUS_ALIVE eternal = false overflowToDisk = false maxElementsInMemory = 1000 maxElementsOnDisk = 0 memoryStoreEvictionPolicy = LRU timeToLiveSeconds = 1800 timeToIdleSeconds = 2700 diskPersistent = false diskExpiryThreadIntervalSeconds = 600 cacheEventListeners:  hitCount = 0 memoryStoreHitCount = 0 diskStoreHitCount = 0 missCountNotFound = 0 missCountExpired = 0 ]
There was no such logger 'org.codehaus.plexus.redback.xwork.filter.authentication.HttpAuthenticator:basic' 2275292.
 WARN|main|73473|PlexusContainer                - Component manager not found for returned component. Ignored. component=org.apache.maven.archiva.web.repository.ProxiedDavServer@1548b94
 INFO|main|73873|log                            - jetty-6.1.5
 INFO|main|73874|log                            - Started SocketConnector@0.0.0.0:43059
Remote HTTP Server started on http://localhost:43059/snapshots
 INFO|main|74794|AuditLog                       - internal guest 127.0.0.1 "org/apache/archiva/test/2.0-SNAPSHOT/test-2.0-SNAPSHOT.jar" "Modify File (proxied)"
 INFO|main|74903|Cache:url-failures-cache       - Disposing cache: [ name = url-failures-cache status = STATUS_ALIVE eternal = false overflowToDisk = false maxElementsInMemory = 1000 maxElementsOnDisk = 0 memoryStoreEvictionPolicy = LRU timeToLiveSeconds = 1800 timeToIdleSeconds = 2700 diskPersistent = false diskExpiryThreadIntervalSeconds = 600 cacheEventListeners:  hitCount = 0 memoryStoreHitCount = 0 diskStoreHitCount = 0 missCountNotFound = 0 missCountExpired = 0 ]
There was no such logger 'org.codehaus.plexus.redback.xwork.filter.authentication.HttpAuthenticator:basic' 12279117.
 WARN|main|74903|PlexusContainer                - Component manager not found for returned component. Ignored. component=org.apache.maven.archiva.web.repository.ProxiedDavServer@475614
Tests run: 15, Failures: 1, Errors: 0, Skipped: 0, Time elapsed: 18.235 sec <<< FAILURE!
Running org.apache.maven.archiva.web.repository.RepositoryServletBrowseTest
 INFO|main|75056|Cache:url-failures-cache       - Disposing cache: [ name = url-failures-cache status = STATUS_ALIVE eternal = false overflowToDisk = false maxElementsInMemory = 1000 maxElementsOnDisk = 0 memoryStoreEvictionPolicy = LRU timeToLiveSeconds = 1800 timeToIdleSeconds = 2700 diskPersistent = false diskExpiryThreadIntervalSeconds = 600 cacheEventListeners:  hitCount = 0 memoryStoreHitCount = 0 diskStoreHitCount = 0 missCountNotFound = 0 missCountExpired = 0 ]
There was no such logger 'org.codehaus.plexus.redback.xwork.filter.authentication.HttpAuthenticator:basic' 18455598.
 WARN|main|75057|PlexusContainer                - Component manager not found for returned component. Ignored. component=org.apache.maven.archiva.web.repository.ProxiedDavServer@43387
Tests run: 1, Failures: 0, Errors: 0, Skipped: 0, Time elapsed: 0.15 sec
Running org.apache.maven.archiva.web.repository.RepositoryServletProxiedMetadataLocalOnlyTest
 INFO|main|75192|log                            - jetty-6.1.5
 INFO|main|75193|log                            - Started SocketConnector@0.0.0.0:43063
Remote HTTP Server started on http://localhost:43063/snapshots
 INFO|main|76027|log                            - jetty-6.1.5
 INFO|main|76028|log                            - Started SocketConnector@0.0.0.0:43065
Remote HTTP Server started on http://localhost:43065/private-snapshots
 INFO|main|76917|AuditLog                       - internal guest 127.0.0.1 "/org/apache/archiva/archivatest-maven-plugin/4.0-alpha-1-SNAPSHOT/maven-metadata.xml" "Modify File (proxied)"
 INFO|main|77033|Cache:url-failures-cache       - Disposing cache: [ name = url-failures-cache status = STATUS_ALIVE eternal = false overflowToDisk = false maxElementsInMemory = 1000 maxElementsOnDisk = 0 memoryStoreEvictionPolicy = LRU timeToLiveSeconds = 1800 timeToIdleSeconds = 2700 diskPersistent = false diskExpiryThreadIntervalSeconds = 600 cacheEventListeners:  hitCount = 0 memoryStoreHitCount = 0 diskStoreHitCount = 0 missCountNotFound = 0 missCountExpired = 0 ]
There was no such logger 'org.codehaus.plexus.redback.xwork.filter.authentication.HttpAuthenticator:basic' 9402810.
 WARN|main|77033|PlexusContainer                - Component manager not found for returned component. Ignored. component=org.apache.maven.archiva.web.repository.ProxiedDavServer@3c3a45
 INFO|main|77158|log                            - jetty-6.1.5
 INFO|main|77158|log                            - Started SocketConnector@0.0.0.0:43069
Remote HTTP Server started on http://localhost:43069/snapshots
 INFO|main|78037|log                            - jetty-6.1.5
 INFO|main|78038|log                            - Started SocketConnector@0.0.0.0:43071
Remote HTTP Server started on http://localhost:43071/private-snapshots
 INFO|main|78979|AuditLog                       - internal guest 127.0.0.1 "/org/apache/archiva/archivatest-maven-plugin/4.0-alpha-2/maven-metadata.xml" "Modify File (proxied)"
 INFO|main|79092|Cache:url-failures-cache       - Disposing cache: [ name = url-failures-cache status = STATUS_ALIVE eternal = false overflowToDisk = false maxElementsInMemory = 1000 maxElementsOnDisk = 0 memoryStoreEvictionPolicy = LRU timeToLiveSeconds = 1800 timeToIdleSeconds = 2700 diskPersistent = false diskExpiryThreadIntervalSeconds = 600 cacheEventListeners:  hitCount = 0 memoryStoreHitCount = 0 diskStoreHitCount = 0 missCountNotFound = 0 missCountExpired = 0 ]
There was no such logger 'org.codehaus.plexus.redback.xwork.filter.authentication.HttpAuthenticator:basic' 8538850.
 WARN|main|79093|PlexusContainer                - Component manager not found for returned component. Ignored. component=org.apache.maven.archiva.web.repository.ProxiedDavServer@51c45f
 INFO|main|79468|log                            - jetty-6.1.5
 INFO|main|79469|log                            - Started SocketConnector@0.0.0.0:43073
Remote HTTP Server started on http://localhost:43073/snapshots
 INFO|main|80347|log                            - jetty-6.1.5
 INFO|main|80348|log                            - Started SocketConnector@0.0.0.0:43075
Remote HTTP Server started on http://localhost:43075/private-snapshots
 INFO|main|81269|AuditLog                       - internal guest 127.0.0.1 "/org/apache/archiva/archivatest-maven-plugin/maven-metadata.xml" "Modify File (proxied)"
 INFO|main|81492|Cache:url-failures-cache       - Disposing cache: [ name = url-failures-cache status = STATUS_ALIVE eternal = false overflowToDisk = false maxElementsInMemory = 1000 maxElementsOnDisk = 0 memoryStoreEvictionPolicy = LRU timeToLiveSeconds = 1800 timeToIdleSeconds = 2700 diskPersistent = false diskExpiryThreadIntervalSeconds = 600 cacheEventListeners:  hitCount = 0 memoryStoreHitCount = 0 diskStoreHitCount = 0 missCountNotFound = 0 missCountExpired = 0 ]
There was no such logger 'org.codehaus.plexus.redback.xwork.filter.authentication.HttpAuthenticator:basic' 21165679.
 WARN|main|81492|PlexusContainer                - Component manager not found for returned component. Ignored. component=org.apache.maven.archiva.web.repository.ProxiedDavServer@1ab9655
Tests run: 3, Failures: 0, Errors: 0, Skipped: 0, Time elapsed: 6.433 sec
Running org.apache.maven.archiva.web.repository.RepositoryServletNoProxyTest
 INFO|main|81647|Cache:url-failures-cache       - Disposing cache: [ name = url-failures-cache status = STATUS_ALIVE eternal = false overflowToDisk = false maxElementsInMemory = 1000 maxElementsOnDisk = 0 memoryStoreEvictionPolicy = LRU timeToLiveSeconds = 1800 timeToIdleSeconds = 2700 diskPersistent = false diskExpiryThreadIntervalSeconds = 600 cacheEventListeners:  hitCount = 0 memoryStoreHitCount = 0 diskStoreHitCount = 0 missCountNotFound = 0 missCountExpired = 0 ]
 WARN|main|81647|PlexusContainer                - Component manager not found for returned component. Ignored. component=org.apache.maven.archiva.web.repository.ProxiedDavServer@62bba7
There was no such logger 'org.codehaus.plexus.redback.xwork.filter.authentication.HttpAuthenticator:basic' 33229819.
 INFO|main|81770|Cache:url-failures-cache       - Disposing cache: [ name = url-failures-cache status = STATUS_ALIVE eternal = false overflowToDisk = false maxElementsInMemory = 1000 maxElementsOnDisk = 0 memoryStoreEvictionPolicy = LRU timeToLiveSeconds = 1800 timeToIdleSeconds = 2700 diskPersistent = false diskExpiryThreadIntervalSeconds = 600 cacheEventListeners:  hitCount = 0 memoryStoreHitCount = 0 diskStoreHitCount = 0 missCountNotFound = 0 missCountExpired = 0 ]
There was no such logger 'org.codehaus.plexus.redback.xwork.filter.authentication.HttpAuthenticator:basic' 15724921.
 WARN|main|81771|PlexusContainer                - Component manager not found for returned component. Ignored. component=org.apache.maven.archiva.web.repository.ProxiedDavServer@223477
 INFO|main|81893|AuditLog                       - internal guest 127.0.0.1 "/commons-lang/commons-lang/2.1/maven-metadata.xml" "Modify File (proxied)"
 INFO|main|81895|Cache:url-failures-cache       - Disposing cache: [ name = url-failures-cache status = STATUS_ALIVE eternal = false overflowToDisk = false maxElementsInMemory = 1000 maxElementsOnDisk = 0 memoryStoreEvictionPolicy = LRU timeToLiveSeconds = 1800 timeToIdleSeconds = 2700 diskPersistent = false diskExpiryThreadIntervalSeconds = 600 cacheEventListeners:  hitCount = 0 memoryStoreHitCount = 0 diskStoreHitCount = 0 missCountNotFound = 0 missCountExpired = 0 ]
There was no such logger 'org.codehaus.plexus.redback.xwork.filter.authentication.HttpAuthenticator:basic' 14104662.
 WARN|main|81895|PlexusContainer                - Component manager not found for returned component. Ignored. component=org.apache.maven.archiva.web.repository.ProxiedDavServer@f8f0a7
 INFO|main|82051|AuditLog                       - internal guest 127.0.0.1 "/commons-lang/commons-lang/maven-metadata.xml" "Modify File (proxied)"
 INFO|main|82053|Cache:url-failures-cache       - Disposing cache: [ name = url-failures-cache status = STATUS_ALIVE eternal = false overflowToDisk = false maxElementsInMemory = 1000 maxElementsOnDisk = 0 memoryStoreEvictionPolicy = LRU timeToLiveSeconds = 1800 timeToIdleSeconds = 2700 diskPersistent = false diskExpiryThreadIntervalSeconds = 600 cacheEventListeners:  hitCount = 0 memoryStoreHitCount = 0 diskStoreHitCount = 0 missCountNotFound = 0 missCountExpired = 0 ]
 WARN|main|82053|PlexusContainer                - Component manager not found for returned component. Ignored. component=org.apache.maven.archiva.web.repository.ProxiedDavServer@eec5b4
There was no such logger 'org.codehaus.plexus.redback.xwork.filter.authentication.HttpAuthenticator:basic' 23828938.
 INFO|main|82179|Cache:url-failures-cache       - Disposing cache: [ name = url-failures-cache status = STATUS_ALIVE eternal = false overflowToDisk = false maxElementsInMemory = 1000 maxElementsOnDisk = 0 memoryStoreEvictionPolicy = LRU timeToLiveSeconds = 1800 timeToIdleSeconds = 2700 diskPersistent = false diskExpiryThreadIntervalSeconds = 600 cacheEventListeners:  hitCount = 0 memoryStoreHitCount = 0 diskStoreHitCount = 0 missCountNotFound = 0 missCountExpired = 0 ]
There was no such logger 'org.codehaus.plexus.redback.xwork.filter.authentication.HttpAuthenticator:basic' 8225998.
 WARN|main|82179|PlexusContainer                - Component manager not found for returned component. Ignored. component=org.apache.maven.archiva.web.repository.ProxiedDavServer@117cddf
 INFO|main|82298|Cache:url-failures-cache       - Disposing cache: [ name = url-failures-cache status = STATUS_ALIVE eternal = false overflowToDisk = false maxElementsInMemory = 1000 maxElementsOnDisk = 0 memoryStoreEvictionPolicy = LRU timeToLiveSeconds = 1800 timeToIdleSeconds = 2700 diskPersistent = false diskExpiryThreadIntervalSeconds = 600 cacheEventListeners:  hitCount = 0 memoryStoreHitCount = 0 diskStoreHitCount = 0 missCountNotFound = 0 missCountExpired = 0 ]
There was no such logger 'org.codehaus.plexus.redback.xwork.filter.authentication.HttpAuthenticator:basic' 16126352.
 WARN|main|82299|PlexusContainer                - Component manager not found for returned component. Ignored. component=org.apache.maven.archiva.web.repository.ProxiedDavServer@244f19
 INFO|main|82415|Cache:url-failures-cache       - Disposing cache: [ name = url-failures-cache status = STATUS_ALIVE eternal = false overflowToDisk = false maxElementsInMemory = 1000 maxElementsOnDisk = 0 memoryStoreEvictionPolicy = LRU timeToLiveSeconds = 1800 timeToIdleSeconds = 2700 diskPersistent = false diskExpiryThreadIntervalSeconds = 600 cacheEventListeners:  hitCount = 0 memoryStoreHitCount = 0 diskStoreHitCount = 0 missCountNotFound = 0 missCountExpired = 0 ]
 WARN|main|82416|PlexusContainer                - Component manager not found for returned component. Ignored. component=org.apache.maven.archiva.web.repository.ProxiedDavServer@ea5891
There was no such logger 'org.codehaus.plexus.redback.xwork.filter.authentication.HttpAuthenticator:basic' 12290792.
 INFO|main|82789|Cache:url-failures-cache       - Disposing cache: [ name = url-failures-cache status = STATUS_ALIVE eternal = false overflowToDisk = false maxElementsInMemory = 1000 maxElementsOnDisk = 0 memoryStoreEvictionPolicy = LRU timeToLiveSeconds = 1800 timeToIdleSeconds = 2700 diskPersistent = false diskExpiryThreadIntervalSeconds = 600 cacheEventListeners:  hitCount = 0 memoryStoreHitCount = 0 diskStoreHitCount = 0 missCountNotFound = 0 missCountExpired = 0 ]
There was no such logger 'org.codehaus.plexus.redback.xwork.filter.authentication.HttpAuthenticator:basic' 33088327.
 WARN|main|82789|PlexusContainer                - Component manager not found for returned component. Ignored. component=org.apache.maven.archiva.web.repository.ProxiedDavServer@886c40
 INFO|main|82932|Cache:url-failures-cache       - Disposing cache: [ name = url-failures-cache status = STATUS_ALIVE eternal = false overflowToDisk = false maxElementsInMemory = 1000 maxElementsOnDisk = 0 memoryStoreEvictionPolicy = LRU timeToLiveSeconds = 1800 timeToIdleSeconds = 2700 diskPersistent = false diskExpiryThreadIntervalSeconds = 600 cacheEventListeners:  hitCount = 0 memoryStoreHitCount = 0 diskStoreHitCount = 0 missCountNotFound = 0 missCountExpired = 0 ]
 WARN|main|82932|PlexusContainer                - Component manager not found for returned component. Ignored. component=org.apache.maven.archiva.web.repository.ProxiedDavServer@199723f
There was no such logger 'org.codehaus.plexus.redback.xwork.filter.authentication.HttpAuthenticator:basic' 14695382.
 INFO|main|83166|Cache:url-failures-cache       - Disposing cache: [ name = url-failures-cache status = STATUS_ALIVE eternal = false overflowToDisk = false maxElementsInMemory = 1000 maxElementsOnDisk = 0 memoryStoreEvictionPolicy = LRU timeToLiveSeconds = 1800 timeToIdleSeconds = 2700 diskPersistent = false diskExpiryThreadIntervalSeconds = 600 cacheEventListeners:  hitCount = 0 memoryStoreHitCount = 0 diskStoreHitCount = 0 missCountNotFound = 0 missCountExpired = 0 ]
 WARN|main|83167|PlexusContainer                - Component manager not found for returned component. Ignored. component=org.apache.maven.archiva.web.repository.ProxiedDavServer@822268
There was no such logger 'org.codehaus.plexus.redback.xwork.filter.authentication.HttpAuthenticator:basic' 32054336.
 INFO|main|83283|Cache:url-failures-cache       - Disposing cache: [ name = url-failures-cache status = STATUS_ALIVE eternal = false overflowToDisk = false maxElementsInMemory = 1000 maxElementsOnDisk = 0 memoryStoreEvictionPolicy = LRU timeToLiveSeconds = 1800 timeToIdleSeconds = 2700 diskPersistent = false diskExpiryThreadIntervalSeconds = 600 cacheEventListeners:  hitCount = 0 memoryStoreHitCount = 0 diskStoreHitCount = 0 missCountNotFound = 0 missCountExpired = 0 ]
 WARN|main|83284|PlexusContainer                - Component manager not found for returned component. Ignored. component=org.apache.maven.archiva.web.repository.ProxiedDavServer@179c26a
There was no such logger 'org.codehaus.plexus.redback.xwork.filter.authentication.HttpAuthenticator:basic' 12010195.
Tests run: 11, Failures: 0, Errors: 0, Skipped: 0, Time elapsed: 1.788 sec
Running org.apache.maven.archiva.web.repository.RepositoryServletProxiedRelocatedTest
 INFO|main|83404|log                            - jetty-6.1.5
 INFO|main|83405|log                            - Started SocketConnector@0.0.0.0:43078
Remote HTTP Server started on http://localhost:43078/central
 INFO|main|85133|AuditLog                       - internal guest 127.0.0.1 "org/apache/archiva/test/1.0/test-1.0.jar" "Modify File (proxied)"
 INFO|main|85242|Cache:url-failures-cache       - Disposing cache: [ name = url-failures-cache status = STATUS_ALIVE eternal = false overflowToDisk = false maxElementsInMemory = 1000 maxElementsOnDisk = 0 memoryStoreEvictionPolicy = LRU timeToLiveSeconds = 1800 timeToIdleSeconds = 2700 diskPersistent = false diskExpiryThreadIntervalSeconds = 600 cacheEventListeners:  hitCount = 0 memoryStoreHitCount = 0 diskStoreHitCount = 0 missCountNotFound = 0 missCountExpired = 0 ]
There was no such logger 'org.codehaus.plexus.redback.xwork.filter.authentication.HttpAuthenticator:basic' 31467616.
 WARN|main|85242|PlexusContainer                - Component manager not found for returned component. Ignored. component=org.apache.maven.archiva.web.repository.ProxiedDavServer@12a225b
Tests run: 1, Failures: 0, Errors: 0, Skipped: 0, Time elapsed: 1.955 sec
Running org.apache.maven.archiva.web.action.admin.connectors.proxy.ProxyConnectorsActionTest
[INFO] Disposing cache: [ name = url-failures-cache status = STATUS_ALIVE eternal = false overflowToDisk = false maxElementsInMemory = 1000 maxElementsOnDisk = 0 memoryStoreEvictionPolicy = LRU timeToLiveSeconds = 1800 timeToIdleSeconds = 2700 diskPersistent = true diskExpiryThreadIntervalSeconds = 600 cacheEventListeners:  hitCount = 0 memoryStoreHitCount = 0 diskStoreHitCount = 0 missCountNotFound = 0 missCountExpired = 0 ]
[INFO] Disposing cache: [ name = url-failures-cache status = STATUS_ALIVE eternal = false overflowToDisk = false maxElementsInMemory = 1000 maxElementsOnDisk = 0 memoryStoreEvictionPolicy = LRU timeToLiveSeconds = 1800 timeToIdleSeconds = 2700 diskPersistent = true diskExpiryThreadIntervalSeconds = 600 cacheEventListeners:  hitCount = 0 memoryStoreHitCount = 0 diskStoreHitCount = 0 missCountNotFound = 0 missCountExpired = 0 ]
Tests run: 2, Failures: 0, Errors: 0, Skipped: 0, Time elapsed: 0.143 sec
Running org.apache.maven.archiva.web.action.admin.repositories.EditRemoteRepositoryActionTest
[INFO] Disposing cache: [ name = url-failures-cache status = STATUS_ALIVE eternal = false overflowToDisk = false maxElementsInMemory = 1000 maxElementsOnDisk = 0 memoryStoreEvictionPolicy = LRU timeToLiveSeconds = 1800 timeToIdleSeconds = 2700 diskPersistent = true diskExpiryThreadIntervalSeconds = 600 cacheEventListeners:  hitCount = 0 memoryStoreHitCount = 0 diskStoreHitCount = 0 missCountNotFound = 0 missCountExpired = 0 ]
[INFO] Disposing cache: [ name = url-failures-cache status = STATUS_ALIVE eternal = false overflowToDisk = false maxElementsInMemory = 1000 maxElementsOnDisk = 0 memoryStoreEvictionPolicy = LRU timeToLiveSeconds = 1800 timeToIdleSeconds = 2700 diskPersistent = true diskExpiryThreadIntervalSeconds = 600 cacheEventListeners:  hitCount = 0 memoryStoreHitCount = 0 diskStoreHitCount = 0 missCountNotFound = 0 missCountExpired = 0 ]
[INFO] Disposing cache: [ name = url-failures-cache status = STATUS_ALIVE eternal = false overflowToDisk = false maxElementsInMemory = 1000 maxElementsOnDisk = 0 memoryStoreEvictionPolicy = LRU timeToLiveSeconds = 1800 timeToIdleSeconds = 2700 diskPersistent = true diskExpiryThreadIntervalSeconds = 600 cacheEventListeners:  hitCount = 0 memoryStoreHitCount = 0 diskStoreHitCount = 0 missCountNotFound = 0 missCountExpired = 0 ]
Tests run: 3, Failures: 0, Errors: 0, Skipped: 0, Time elapsed: 0.211 sec
Running org.apache.maven.archiva.web.action.admin.connectors.proxy.SortProxyConnectorsActionTest
[INFO] Disposing cache: [ name = url-failures-cache status = STATUS_ALIVE eternal = false overflowToDisk = false maxElementsInMemory = 1000 maxElementsOnDisk = 0 memoryStoreEvictionPolicy = LRU timeToLiveSeconds = 1800 timeToIdleSeconds = 2700 diskPersistent = true diskExpiryThreadIntervalSeconds = 600 cacheEventListeners:  hitCount = 0 memoryStoreHitCount = 0 diskStoreHitCount = 0 missCountNotFound = 0 missCountExpired = 0 ]
[INFO] Disposing cache: [ name = url-failures-cache status = STATUS_ALIVE eternal = false overflowToDisk = false maxElementsInMemory = 1000 maxElementsOnDisk = 0 memoryStoreEvictionPolicy = LRU timeToLiveSeconds = 1800 timeToIdleSeconds = 2700 diskPersistent = true diskExpiryThreadIntervalSeconds = 600 cacheEventListeners:  hitCount = 0 memoryStoreHitCount = 0 diskStoreHitCount = 0 missCountNotFound = 0 missCountExpired = 0 ]
[INFO] Disposing cache: [ name = url-failures-cache status = STATUS_ALIVE eternal = false overflowToDisk = false maxElementsInMemory = 1000 maxElementsOnDisk = 0 memoryStoreEvictionPolicy = LRU timeToLiveSeconds = 1800 timeToIdleSeconds = 2700 diskPersistent = true diskExpiryThreadIntervalSeconds = 600 cacheEventListeners:  hitCount = 0 memoryStoreHitCount = 0 diskStoreHitCount = 0 missCountNotFound = 0 missCountExpired = 0 ]
[INFO] Disposing cache: [ name = url-failures-cache status = STATUS_ALIVE eternal = false overflowToDisk = false maxElementsInMemory = 1000 maxElementsOnDisk = 0 memoryStoreEvictionPolicy = LRU timeToLiveSeconds = 1800 timeToIdleSeconds = 2700 diskPersistent = true diskExpiryThreadIntervalSeconds = 600 cacheEventListeners:  hitCount = 0 memoryStoreHitCount = 0 diskStoreHitCount = 0 missCountNotFound = 0 missCountExpired = 0 ]
[INFO] Disposing cache: [ name = url-failures-cache status = STATUS_ALIVE eternal = false overflowToDisk = false maxElementsInMemory = 1000 maxElementsOnDisk = 0 memoryStoreEvictionPolicy = LRU timeToLiveSeconds = 1800 timeToIdleSeconds = 2700 diskPersistent = true diskExpiryThreadIntervalSeconds = 600 cacheEventListeners:  hitCount = 0 memoryStoreHitCount = 0 diskStoreHitCount = 0 missCountNotFound = 0 missCountExpired = 0 ]
Tests run: 5, Failures: 0, Errors: 0, Skipped: 0, Time elapsed: 0.372 sec
Running org.apache.maven.archiva.web.repository.RepositoryServletTest
 INFO|main|86181|Cache:url-failures-cache       - Disposing cache: [ name = url-failures-cache status = STATUS_ALIVE eternal = false overflowToDisk = false maxElementsInMemory = 1000 maxElementsOnDisk = 0 memoryStoreEvictionPolicy = LRU timeToLiveSeconds = 1800 timeToIdleSeconds = 2700 diskPersistent = false diskExpiryThreadIntervalSeconds = 600 cacheEventListeners:  hitCount = 0 memoryStoreHitCount = 0 diskStoreHitCount = 0 missCountNotFound = 0 missCountExpired = 0 ]
There was no such logger 'org.codehaus.plexus.redback.xwork.filter.authentication.HttpAuthenticator:basic' 28114287.
 WARN|main|86181|PlexusContainer                - Component manager not found for returned component. Ignored. component=org.apache.maven.archiva.web.repository.ProxiedDavServer@1b613c0
 INFO|main|86314|Cache:url-failures-cache       - Disposing cache: [ name = url-failures-cache status = STATUS_ALIVE eternal = false overflowToDisk = false maxElementsInMemory = 1000 maxElementsOnDisk = 0 memoryStoreEvictionPolicy = LRU timeToLiveSeconds = 1800 timeToIdleSeconds = 2700 diskPersistent = false diskExpiryThreadIntervalSeconds = 600 cacheEventListeners:  hitCount = 0 memoryStoreHitCount = 0 diskStoreHitCount = 0 missCountNotFound = 0 missCountExpired = 0 ]
There was no such logger 'org.codehaus.plexus.redback.xwork.filter.authentication.HttpAuthenticator:basic' 6463901.
 INFO|main|86449|Cache:url-failures-cache       - Disposing cache: [ name = url-failures-cache status = STATUS_ALIVE eternal = false overflowToDisk = false maxElementsInMemory = 1000 maxElementsOnDisk = 0 memoryStoreEvictionPolicy = LRU timeToLiveSeconds = 1800 timeToIdleSeconds = 2700 diskPersistent = false diskExpiryThreadIntervalSeconds = 600 cacheEventListeners:  hitCount = 0 memoryStoreHitCount = 0 diskStoreHitCount = 0 missCountNotFound = 0 missCountExpired = 0 ]
There was no such logger 'org.codehaus.plexus.redback.xwork.filter.authentication.HttpAuthenticator:basic' 9831273.
 WARN|main|86450|PlexusContainer                - Component manager not found for returned component. Ignored. component=org.apache.maven.archiva.web.repository.ProxiedDavServer@63d572
 WARN|main|86450|PlexusContainer                - Component manager not found for returned component. Ignored. component=org.apache.maven.archiva.web.repository.ProxiedDavServer@17e2705
Tests run: 3, Failures: 0, Errors: 0, Skipped: 0, Time elapsed: 0.451 sec
Running org.apache.maven.archiva.web.repository.RepositoryServletProxiedReleasePolicyTest
 INFO|main|86606|log                            - jetty-6.1.5
 INFO|main|86607|log                            - Started SocketConnector@0.0.0.0:43084
Remote HTTP Server started on http://localhost:43084/central
 INFO|main|87621|Cache:url-failures-cache       - Disposing cache: [ name = url-failures-cache status = STATUS_ALIVE eternal = false overflowToDisk = false maxElementsInMemory = 1000 maxElementsOnDisk = 0 memoryStoreEvictionPolicy = LRU timeToLiveSeconds = 1800 timeToIdleSeconds = 2700 diskPersistent = false diskExpiryThreadIntervalSeconds = 600 cacheEventListeners:  hitCount = 0 memoryStoreHitCount = 0 diskStoreHitCount = 0 missCountNotFound = 0 missCountExpired = 0 ]
 WARN|main|87622|PlexusContainer                - Component manager not found for returned component. Ignored. component=org.apache.maven.archiva.web.repository.ProxiedDavServer@1cde3f3
There was no such logger 'org.codehaus.plexus.redback.xwork.filter.authentication.HttpAuthenticator:basic' 33322587.
 INFO|main|87759|log                            - jetty-6.1.5
 INFO|main|87760|log                            - Started SocketConnector@0.0.0.0:43088
Remote HTTP Server started on http://localhost:43088/central
 INFO|main|88802|AuditLog                       - internal guest 127.0.0.1 "org/apache/archiva/test/1.0/test-1.0.jar" "Modify File (proxied)"
 INFO|main|88911|Cache:url-failures-cache       - Disposing cache: [ name = url-failures-cache status = STATUS_ALIVE eternal = false overflowToDisk = false maxElementsInMemory = 1000 maxElementsOnDisk = 0 memoryStoreEvictionPolicy = LRU timeToLiveSeconds = 1800 timeToIdleSeconds = 2700 diskPersistent = false diskExpiryThreadIntervalSeconds = 600 cacheEventListeners:  hitCount = 0 memoryStoreHitCount = 0 diskStoreHitCount = 0 missCountNotFound = 0 missCountExpired = 0 ]
 WARN|main|88912|PlexusContainer                - Component manager not found for returned component. Ignored. component=org.apache.maven.archiva.web.repository.ProxiedDavServer@154dc9
There was no such logger 'org.codehaus.plexus.redback.xwork.filter.authentication.HttpAuthenticator:basic' 2743758.
 INFO|main|89026|log                            - jetty-6.1.5
 INFO|main|89027|log                            - Started SocketConnector@0.0.0.0:43092
Remote HTTP Server started on http://localhost:43092/central
There was no such logger 'org.apache.maven.archiva.configuration.ArchivaConfiguration:default' 13003070.
 INFO|main|89131|Cache:url-failures-cache       - Disposing cache: [ name = url-failures-cache status = STATUS_ALIVE eternal = false overflowToDisk = false maxElementsInMemory = 1000 maxElementsOnDisk = 0 memoryStoreEvictionPolicy = LRU timeToLiveSeconds = 1800 timeToIdleSeconds = 2700 diskPersistent = false diskExpiryThreadIntervalSeconds = 600 cacheEventListeners:  hitCount = 0 memoryStoreHitCount = 0 diskStoreHitCount = 0 missCountNotFound = 0 missCountExpired = 0 ]
 INFO|main|89243|log                            - jetty-6.1.5
 INFO|main|89244|log                            - Started SocketConnector@0.0.0.0:43094
Remote HTTP Server started on http://localhost:43094/central
 INFO|main|90222|RepositoryProxyConnectors:default - Transfer not attempted on http://localhost:43094/central/org/apache/archiva/test/1.0/test-1.0.jar : NO to update releases, policy is DAILY, local file exist, and has been updated within the last day.: using already present local file.
 INFO|main|90222|AuditLog                       - internal guest 127.0.0.1 "org/apache/archiva/test/1.0/test-1.0.jar" "Modify File (proxied)"
 INFO|main|90331|Cache:url-failures-cache       - Disposing cache: [ name = url-failures-cache status = STATUS_ALIVE eternal = false overflowToDisk = false maxElementsInMemory = 1000 maxElementsOnDisk = 0 memoryStoreEvictionPolicy = LRU timeToLiveSeconds = 1800 timeToIdleSeconds = 2700 diskPersistent = false diskExpiryThreadIntervalSeconds = 600 cacheEventListeners:  hitCount = 0 memoryStoreHitCount = 0 diskStoreHitCount = 0 missCountNotFound = 0 missCountExpired = 0 ]
There was no such logger 'org.codehaus.plexus.redback.xwork.filter.authentication.HttpAuthenticator:basic' 21589954.
 WARN|main|90331|PlexusContainer                - Component manager not found for returned component. Ignored. component=org.apache.maven.archiva.web.repository.ProxiedDavServer@ced1f5
 INFO|main|90468|log                            - jetty-6.1.5
 INFO|main|90469|log                            - Started SocketConnector@0.0.0.0:43097
Remote HTTP Server started on http://localhost:43097/central
 INFO|main|91402|AuditLog                       - internal guest 127.0.0.1 "org/apache/archiva/test/1.0/test-1.0.jar" "Modify File (proxied)"
There was no such logger 'org.codehaus.plexus.redback.xwork.filter.authentication.HttpAuthenticator:basic' 15627394.
 INFO|main|91511|Cache:url-failures-cache       - Disposing cache: [ name = url-failures-cache status = STATUS_ALIVE eternal = false overflowToDisk = false maxElementsInMemory = 1000 maxElementsOnDisk = 0 memoryStoreEvictionPolicy = LRU timeToLiveSeconds = 1800 timeToIdleSeconds = 2700 diskPersistent = false diskExpiryThreadIntervalSeconds = 600 cacheEventListeners:  hitCount = 0 memoryStoreHitCount = 0 diskStoreHitCount = 0 missCountNotFound = 0 missCountExpired = 0 ]
 WARN|main|91511|PlexusContainer                - Component manager not found for returned component. Ignored. component=org.apache.maven.archiva.web.repository.ProxiedDavServer@f2106b
 INFO|main|91644|log                            - jetty-6.1.5
 INFO|main|91645|log                            - Started SocketConnector@0.0.0.0:43101
Remote HTTP Server started on http://localhost:43101/central
 INFO|main|92612|AuditLog                       - internal guest 127.0.0.1 "org/apache/archiva/test/1.0/test-1.0.jar" "Modify File (proxied)"
 INFO|main|92721|Cache:url-failures-cache       - Disposing cache: [ name = url-failures-cache status = STATUS_ALIVE eternal = false overflowToDisk = false maxElementsInMemory = 1000 maxElementsOnDisk = 0 memoryStoreEvictionPolicy = LRU timeToLiveSeconds = 1800 timeToIdleSeconds = 2700 diskPersistent = false diskExpiryThreadIntervalSeconds = 600 cacheEventListeners:  hitCount = 0 memoryStoreHitCount = 0 diskStoreHitCount = 0 missCountNotFound = 0 missCountExpired = 0 ]
There was no such logger 'org.codehaus.plexus.redback.xwork.filter.authentication.HttpAuthenticator:basic' 29825469.
 WARN|main|92721|PlexusContainer                - Component manager not found for returned component. Ignored. component=org.apache.maven.archiva.web.repository.ProxiedDavServer@11d2dc5
 INFO|main|92836|log                            - jetty-6.1.5
 INFO|main|92837|log                            - Started SocketConnector@0.0.0.0:43105
Remote HTTP Server started on http://localhost:43105/central
 INFO|main|93778|RepositoryProxyConnectors:default - Transfer not attempted on http://localhost:43105/central/org/apache/archiva/test/1.0/test-1.0.pom : NO to update, releases policy set to NEVER.
 INFO|main|93779|RepositoryProxyConnectors:default - Transfer not attempted on http://localhost:43105/central/org/apache/archiva/test/1.0/test-1.0.jar : NO to update, releases policy set to NEVER.: using already present local file.
 INFO|main|93779|AuditLog                       - internal guest 127.0.0.1 "org/apache/archiva/test/1.0/test-1.0.jar" "Modify File (proxied)"
 INFO|main|93891|Cache:url-failures-cache       - Disposing cache: [ name = url-failures-cache status = STATUS_ALIVE eternal = false overflowToDisk = false maxElementsInMemory = 1000 maxElementsOnDisk = 0 memoryStoreEvictionPolicy = LRU timeToLiveSeconds = 1800 timeToIdleSeconds = 2700 diskPersistent = false diskExpiryThreadIntervalSeconds = 600 cacheEventListeners:  hitCount = 0 memoryStoreHitCount = 0 diskStoreHitCount = 0 missCountNotFound = 0 missCountExpired = 0 ]
 WARN|main|93891|PlexusContainer                - Component manager not found for returned component. Ignored. component=org.apache.maven.archiva.web.repository.ProxiedDavServer@1114484
There was no such logger 'org.codehaus.plexus.redback.xwork.filter.authentication.HttpAuthenticator:basic' 17461423.
 INFO|main|94004|log                            - jetty-6.1.5
 INFO|main|94005|log                            - Started SocketConnector@0.0.0.0:43108
Remote HTTP Server started on http://localhost:43108/central
 INFO|main|94966|RepositoryProxyConnectors:default - Transfer not attempted on http://localhost:43108/central/org/apache/archiva/test/1.0/test-1.0.pom : NO to update, releases policy set to NEVER.
 INFO|main|94966|RepositoryProxyConnectors:default - Transfer not attempted on http://localhost:43108/central/org/apache/archiva/test/1.0/test-1.0.jar : NO to update, releases policy set to NEVER.
 INFO|main|95071|Cache:url-failures-cache       - Disposing cache: [ name = url-failures-cache status = STATUS_ALIVE eternal = false overflowToDisk = false maxElementsInMemory = 1000 maxElementsOnDisk = 0 memoryStoreEvictionPolicy = LRU timeToLiveSeconds = 1800 timeToIdleSeconds = 2700 diskPersistent = false diskExpiryThreadIntervalSeconds = 600 cacheEventListeners:  hitCount = 0 memoryStoreHitCount = 0 diskStoreHitCount = 0 missCountNotFound = 0 missCountExpired = 0 ]
There was no such logger 'org.codehaus.plexus.redback.xwork.filter.authentication.HttpAuthenticator:basic' 20509193.
 WARN|main|95071|PlexusContainer                - Component manager not found for returned component. Ignored. component=org.apache.maven.archiva.web.repository.ProxiedDavServer@13a4a2f
 INFO|main|95236|log                            - jetty-6.1.5
 INFO|main|95237|log                            - Started SocketConnector@0.0.0.0:43111
Remote HTTP Server started on http://localhost:43111/central
 INFO|main|96133|RepositoryProxyConnectors:default - Transfer not attempted on http://localhost:43111/central/org/apache/archiva/test/1.0/test-1.0.pom : NO to update, releases policy set to NEVER.
 INFO|main|96133|RepositoryProxyConnectors:default - Transfer not attempted on http://localhost:43111/central/org/apache/archiva/test/1.0/test-1.0.jar : NO to update, releases policy set to NEVER.: using already present local file.
 INFO|main|96134|AuditLog                       - internal guest 127.0.0.1 "org/apache/archiva/test/1.0/test-1.0.jar" "Modify File (proxied)"
 INFO|main|96241|Cache:url-failures-cache       - Disposing cache: [ name = url-failures-cache status = STATUS_ALIVE eternal = false overflowToDisk = false maxElementsInMemory = 1000 maxElementsOnDisk = 0 memoryStoreEvictionPolicy = LRU timeToLiveSeconds = 1800 timeToIdleSeconds = 2700 diskPersistent = false diskExpiryThreadIntervalSeconds = 600 cacheEventListeners:  hitCount = 0 memoryStoreHitCount = 0 diskStoreHitCount = 0 missCountNotFound = 0 missCountExpired = 0 ]
There was no such logger 'org.codehaus.plexus.redback.xwork.filter.authentication.HttpAuthenticator:basic' 17268342.
 WARN|main|96241|PlexusContainer                - Component manager not found for returned component. Ignored. component=org.apache.maven.archiva.web.repository.ProxiedDavServer@198088a
 INFO|main|96361|log                            - jetty-6.1.5
 INFO|main|96362|log                            - Started SocketConnector@0.0.0.0:43114
Remote HTTP Server started on http://localhost:43114/central
 INFO|main|97262|RepositoryProxyConnectors:default - Transfer not attempted on http://localhost:43114/central/org/apache/archiva/test/1.0/test-1.0.jar : NO to update releases, policy is HOURLY, local file exist, and has been updated within the last hour.: using already present local file.
 INFO|main|97263|AuditLog                       - internal guest 127.0.0.1 "org/apache/archiva/test/1.0/test-1.0.jar" "Modify File (proxied)"
 INFO|main|97371|Cache:url-failures-cache       - Disposing cache: [ name = url-failures-cache status = STATUS_ALIVE eternal = false overflowToDisk = false maxElementsInMemory = 1000 maxElementsOnDisk = 0 memoryStoreEvictionPolicy = LRU timeToLiveSeconds = 1800 timeToIdleSeconds = 2700 diskPersistent = false diskExpiryThreadIntervalSeconds = 600 cacheEventListeners:  hitCount = 0 memoryStoreHitCount = 0 diskStoreHitCount = 0 missCountNotFound = 0 missCountExpired = 0 ]
 WARN|main|97371|PlexusContainer                - Component manager not found for returned component. Ignored. component=org.apache.maven.archiva.web.repository.ProxiedDavServer@1a8209b
There was no such logger 'org.codehaus.plexus.redback.xwork.filter.authentication.HttpAuthenticator:basic' 18135432.
 INFO|main|97495|log                            - jetty-6.1.5
 INFO|main|97496|log                            - Started SocketConnector@0.0.0.0:43118
Remote HTTP Server started on http://localhost:43118/central
 INFO|main|98481|AuditLog                       - internal guest 127.0.0.1 "org/apache/archiva/test/1.0/test-1.0.jar" "Modify File (proxied)"
 INFO|main|98590|Cache:url-failures-cache       - Disposing cache: [ name = url-failures-cache status = STATUS_ALIVE eternal = false overflowToDisk = false maxElementsInMemory = 1000 maxElementsOnDisk = 0 memoryStoreEvictionPolicy = LRU timeToLiveSeconds = 1800 timeToIdleSeconds = 2700 diskPersistent = false diskExpiryThreadIntervalSeconds = 600 cacheEventListeners:  hitCount = 0 memoryStoreHitCount = 0 diskStoreHitCount = 0 missCountNotFound = 0 missCountExpired = 0 ]
There was no such logger 'org.codehaus.plexus.redback.xwork.filter.authentication.HttpAuthenticator:basic' 29860445.
 WARN|main|98591|PlexusContainer                - Component manager not found for returned component. Ignored. component=org.apache.maven.archiva.web.repository.ProxiedDavServer@491a97
 INFO|main|98773|log                            - jetty-6.1.5
 INFO|main|98774|log                            - Started SocketConnector@0.0.0.0:43122
Remote HTTP Server started on http://localhost:43122/central
 INFO|main|99712|AuditLog                       - internal guest 127.0.0.1 "org/apache/archiva/test/1.0/test-1.0.jar" "Modify File (proxied)"
 INFO|main|99820|Cache:url-failures-cache       - Disposing cache: [ name = url-failures-cache status = STATUS_ALIVE eternal = false overflowToDisk = false maxElementsInMemory = 1000 maxElementsOnDisk = 0 memoryStoreEvictionPolicy = LRU timeToLiveSeconds = 1800 timeToIdleSeconds = 2700 diskPersistent = false diskExpiryThreadIntervalSeconds = 600 cacheEventListeners:  hitCount = 0 memoryStoreHitCount = 0 diskStoreHitCount = 0 missCountNotFound = 0 missCountExpired = 0 ]
 WARN|main|99821|PlexusContainer                - Component manager not found for returned component. Ignored. component=org.apache.maven.archiva.web.repository.ProxiedDavServer@1939d13
There was no such logger 'org.codehaus.plexus.redback.xwork.filter.authentication.HttpAuthenticator:basic' 10393146.
 INFO|main|99933|log                            - jetty-6.1.5
 INFO|main|99934|log                            - Started SocketConnector@0.0.0.0:43126
Remote HTTP Server started on http://localhost:43126/central
 INFO|main|100853|RepositoryProxyConnectors:default - Transfer not attempted on http://localhost:43126/central/org/apache/archiva/test/1.0/test-1.0.jar : NO to update releases, policy is ONCE, and local file exist.: using already present local file.
 INFO|main|100853|AuditLog                       - internal guest 127.0.0.1 "org/apache/archiva/test/1.0/test-1.0.jar" "Modify File (proxied)"
 INFO|main|100960|Cache:url-failures-cache       - Disposing cache: [ name = url-failures-cache status = STATUS_ALIVE eternal = false overflowToDisk = false maxElementsInMemory = 1000 maxElementsOnDisk = 0 memoryStoreEvictionPolicy = LRU timeToLiveSeconds = 1800 timeToIdleSeconds = 2700 diskPersistent = false diskExpiryThreadIntervalSeconds = 600 cacheEventListeners:  hitCount = 0 memoryStoreHitCount = 0 diskStoreHitCount = 0 missCountNotFound = 0 missCountExpired = 0 ]
 WARN|main|100961|PlexusContainer                - Component manager not found for returned component. Ignored. component=org.apache.maven.archiva.web.repository.ProxiedDavServer@5b68ea
There was no such logger 'org.codehaus.plexus.redback.xwork.filter.authentication.HttpAuthenticator:basic' 4401116.
 INFO|main|101066|log                            - jetty-6.1.5
 INFO|main|101067|log                            - Started SocketConnector@0.0.0.0:43130
Remote HTTP Server started on http://localhost:43130/central
 INFO|main|102031|AuditLog                       - internal guest 127.0.0.1 "org/apache/archiva/test/1.0/test-1.0.jar" "Modify File (proxied)"
 INFO|main|102140|Cache:url-failures-cache       - Disposing cache: [ name = url-failures-cache status = STATUS_ALIVE eternal = false overflowToDisk = false maxElementsInMemory = 1000 maxElementsOnDisk = 0 memoryStoreEvictionPolicy = LRU timeToLiveSeconds = 1800 timeToIdleSeconds = 2700 diskPersistent = false diskExpiryThreadIntervalSeconds = 600 cacheEventListeners:  hitCount = 0 memoryStoreHitCount = 0 diskStoreHitCount = 0 missCountNotFound = 0 missCountExpired = 0 ]
There was no such logger 'org.codehaus.plexus.redback.xwork.filter.authentication.HttpAuthenticator:basic' 25779276.
 WARN|main|102141|PlexusContainer                - Component manager not found for returned component. Ignored. component=org.apache.maven.archiva.web.repository.ProxiedDavServer@37668f
 INFO|main|102259|log                            - jetty-6.1.5
 INFO|main|102260|log                            - Started SocketConnector@0.0.0.0:43135
Remote HTTP Server started on http://localhost:43135/central
 INFO|main|103252|AuditLog                       - internal guest 127.0.0.1 "org/apache/archiva/test/1.0/test-1.0.jar" "Modify File (proxied)"
 INFO|main|103360|Cache:url-failures-cache       - Disposing cache: [ name = url-failures-cache status = STATUS_ALIVE eternal = false overflowToDisk = false maxElementsInMemory = 1000 maxElementsOnDisk = 0 memoryStoreEvictionPolicy = LRU timeToLiveSeconds = 1800 timeToIdleSeconds = 2700 diskPersistent = false diskExpiryThreadIntervalSeconds = 600 cacheEventListeners:  hitCount = 0 memoryStoreHitCount = 0 diskStoreHitCount = 0 missCountNotFound = 0 missCountExpired = 0 ]
 WARN|main|103360|PlexusContainer                - Component manager not found for returned component. Ignored. component=org.apache.maven.archiva.web.repository.ProxiedDavServer@2f4f8b
There was no such logger 'org.codehaus.plexus.redback.xwork.filter.authentication.HttpAuthenticator:basic' 851107.
Tests run: 15, Failures: 0, Errors: 1, Skipped: 0, Time elapsed: 16.907 sec <<< FAILURE!
Running org.apache.maven.archiva.web.repository.RepositoryServletDeployTest
 INFO|main|103546|AuditLog                       - internal guest 127.0.0.1 "path/to" "Created Directory"
 INFO|main|103570|AuditLog                       - internal guest 127.0.0.1 "/path/to/artifact.jar" "Created File"
 INFO|main|103571|Cache:url-failures-cache       - Disposing cache: [ name = url-failures-cache status = STATUS_ALIVE eternal = false overflowToDisk = false maxElementsInMemory = 1000 maxElementsOnDisk = 0 memoryStoreEvictionPolicy = LRU timeToLiveSeconds = 1800 timeToIdleSeconds = 2700 diskPersistent = false diskExpiryThreadIntervalSeconds = 600 cacheEventListeners:  hitCount = 0 memoryStoreHitCount = 0 diskStoreHitCount = 0 missCountNotFound = 0 missCountExpired = 0 ]
There was no such logger 'org.codehaus.plexus.redback.xwork.filter.authentication.HttpAuthenticator:basic' 13485723.
 WARN|main|103572|PlexusContainer                - Component manager not found for returned component. Ignored. component=org.apache.maven.archiva.web.repository.ProxiedDavServer@9d16c2
Tests run: 1, Failures: 0, Errors: 0, Skipped: 0, Time elapsed: 0.207 sec

Results :
Tests run: 146, Failures: 1, Errors: 1, Skipped: 0

[INFO] ------------------------------------------------------------------------
[ERROR] BUILD FAILURE
[INFO] ------------------------------------------------------------------------
[INFO] There are test failures.
[INFO] ------------------------------------------------------------------------
[INFO] For more information, run Maven with the -e switch
[INFO] ------------------------------------------------------------------------
[INFO] Total time: 2 minutes 31 seconds
[INFO] Finished at: Mon Feb 04 09:20:55 GMT+00:00 2008
[INFO] Final Memory: 27M/310M
[INFO] ------------------------------------------------------------------------

****************************************************************************



Mime
View raw message