maven-notifications mailing list archives

Site index · List index
Message view « Date » · « Thread »
Top « Date » · « Thread »
From "Continuum@maven.zones.apache.org" <contin...@maven.zones.apache.org>
Subject [continuum] BUILD FAILURE: Integration Test Executor
Date Sun, 02 Mar 2008 02:04:56 GMT
Online report : http://maven.zones.apache.org/continuum/buildResult.action?buildId=43276&projectId=517

Build statistics:
  State: Failed
  Previous State: Ok
  Started at: Sun 2 Mar 2008 01:52:16 +0000
  Finished at: Sun 2 Mar 2008 02:04:54 +0000
  Total time: 12m 37s
  Build Trigger: Schedule
  Build Number: 42
  Exit code: 1
  Building machine hostname: maven.zones.apache.org
  Operating system : SunOS(unknown)
  Java Home version : 
          java version "1.4.2_09"
          Java(TM) 2 Runtime Environment, Standard Edition (build 1.4.2_09-b05)
          Java HotSpot(TM) Client VM (build 1.4.2_09-b05, mixed mode)
        
  Builder version :
          Maven version: 2.0.7
          Java version: 1.4.2_09
          OS name: "sunos" version: "5.10" arch: "x86"
    
****************************************************************************
SCM Changes:
****************************************************************************
No files changed

****************************************************************************
Dependencies Changes:
****************************************************************************
org.apache.maven.its:core-integration-tests:2.1-SNAPSHOT

org.apache.maven:maven:2.0.9-SNAPSHOT


****************************************************************************
Build Defintion:
****************************************************************************
POM filename: pom.xml
Goals: clean install   
Arguments: --batch-mode --non-recursive
Build Fresh: false
Always Build: false
Default Build Definition: true
Schedule: DEFAULT_SCHEDULE
Profile Name: JDK 1.4.2
Description: 


****************************************************************************
Test Summary:
****************************************************************************
Tests: 121
Failures: 1
Total time: 723675

****************************************************************************
Output:
****************************************************************************
[INFO] Scanning for projects...
[INFO] ----------------------------------------------------------------------------
[INFO] Building Integration Test Executor
[INFO]    task-segment: [clean, install]
[INFO] ----------------------------------------------------------------------------
[INFO] [clean:clean]
[INFO] Deleting directory /export/home/build/data/continuum/checkouts/517/target
[INFO] Deleting directory /export/home/build/data/continuum/checkouts/517/target/classes
[INFO] Deleting directory /export/home/build/data/continuum/checkouts/517/target/test-classes
[INFO] Deleting directory /export/home/build/data/continuum/checkouts/517/target/site
[INFO] [dependency:unpack {execution: default}]
[INFO] Configured Artifact: org.apache.maven:maven-core:bin:2.0.9-SNAPSHOT:tar.gz
[INFO] snapshot org.apache.maven:maven-core:2.0.9-SNAPSHOT: checking for updates from apache.snapshots
[INFO] Unpacking /export/home/build/.m2/repository/org/apache/maven/maven-core/2.0.9-SNAPSHOT/maven-core-2.0.9-SNAPSHOT-bin.tar.gzto
 /export/home/build/data/continuum/checkouts/517/target/maven-installation
with Includes null and excludes:null
[INFO] Expanding /export/home/build/.m2/repository/org/apache/maven/maven-core/2.0.9-SNAPSHOT/maven-core-2.0.9-SNAPSHOT-bin.tar.gz
to /var/tmp/tmp17760.tar
[INFO] Expanding: /var/tmp/tmp17760.tar into /export/home/build/data/continuum/checkouts/517/target/maven-installation
[INFO] snapshot org.apache.maven:maven-plugin-parameter-documenter:2.0.9-SNAPSHOT: checking
for updates from apache.snapshots
[INFO] snapshot org.apache.maven.reporting:maven-reporting-api:2.0.9-SNAPSHOT: checking for
updates from apache.snapshots
Downloading: http://people.apache.org/repo/m2-snapshot-repository/org/apache/maven/reporting/maven-reporting-api/2.0.9-SNAPSHOT/maven-reporting-api-2.0.9-20080302.014714-5.pom
1K downloaded
[INFO] snapshot org.apache.maven.reporting:maven-reporting:2.0.9-SNAPSHOT: checking for updates
from apache.snapshots
Downloading: http://people.apache.org/repo/m2-snapshot-repository/org/apache/maven/reporting/maven-reporting/2.0.9-SNAPSHOT/maven-reporting-2.0.9-20080302.014714-5.pom
1K downloaded
[INFO] snapshot org.apache.maven:maven-error-diagnostics:2.0.9-SNAPSHOT: checking for updates
from apache.snapshots
Downloading: http://people.apache.org/repo/m2-snapshot-repository/org/apache/maven/maven-error-diagnostics/2.0.9-SNAPSHOT/maven-error-diagnostics-2.0.9-20080302.014714-5.pom
1K downloaded
[INFO] snapshot org.apache.maven:maven-project:2.0.9-SNAPSHOT: checking for updates from apache.snapshots
Downloading: http://people.apache.org/repo/m2-snapshot-repository/org/apache/maven/maven-project/2.0.9-SNAPSHOT/maven-project-2.0.9-20080302.014714-5.pom
2K downloaded
[INFO] snapshot org.apache.maven:maven-plugin-descriptor:2.0.9-SNAPSHOT: checking for updates
from apache.snapshots
Downloading: http://people.apache.org/repo/m2-snapshot-repository/org/apache/maven/maven-plugin-descriptor/2.0.9-SNAPSHOT/maven-plugin-descriptor-2.0.9-20080302.014714-5.pom
2K downloaded
[INFO] snapshot org.apache.maven:maven-monitor:2.0.9-SNAPSHOT: checking for updates from apache.snapshots
[INFO] snapshot org.apache.maven.its:core-integration-tests:2.1-SNAPSHOT: checking for updates
from apache.snapshots
[INFO] snapshot org.apache.maven.its:core-integration-testing:2.1-SNAPSHOT: checking for updates
from apache.snapshots
Downloading: http://people.apache.org/repo/m2-snapshot-repository/org/apache/maven/maven-error-diagnostics/2.0.9-SNAPSHOT/maven-error-diagnostics-2.0.9-20080302.014714-5.jar
13K downloaded
Downloading: http://people.apache.org/repo/m2-snapshot-repository/org/apache/maven/reporting/maven-reporting-api/2.0.9-SNAPSHOT/maven-reporting-api-2.0.9-20080302.014714-5.jar
9K downloaded
Downloading: http://people.apache.org/repo/m2-snapshot-repository/org/apache/maven/maven-plugin-descriptor/2.0.9-SNAPSHOT/maven-plugin-descriptor-2.0.9-20080302.014714-5.jar
36K downloaded
Downloading: http://people.apache.org/repo/m2-snapshot-repository/org/apache/maven/maven-project/2.0.9-SNAPSHOT/maven-project-2.0.9-20080302.014714-5.jar
117K downloaded
[INFO] [antrun:run {execution: default}]
[INFO] Executing tasks
[INFO] Executed tasks
[INFO] Setting property: classpath.resource.loader.class => 'org.codehaus.plexus.velocity.ContextClassLoaderResourceLoader'.
[INFO] Setting property: velocimacro.messages.on => 'false'.
[INFO] Setting property: resource.loader => 'classpath'.
[INFO] Setting property: resource.manager.logwhenfound => 'false'.
[INFO] [remote-resources:process {execution: default}]
[INFO] [resources:resources]
[INFO] Using default encoding to copy filtered resources.
[INFO] [compiler:compile]
[INFO] No sources to compile
[INFO] [resources:testResources]
[INFO] Using default encoding to copy filtered resources.
[INFO] [compiler:testCompile]
[INFO] Compiling 1 source file to /export/home/build/data/continuum/checkouts/517/target/test-classes
[INFO] [surefire:test]
[INFO] Surefire report directory: /export/home/build/data/continuum/checkouts/517/target/surefire-reports
Running integration tests for Maven 2.0.7

-------------------------------------------------------
 T E S T S
-------------------------------------------------------
Running org.apache.maven.its.Suite
Running integration tests for Maven 2.0.7
0000(testit0000).. Ok
0001(testit0001).. Ok
0002(testit0002).. Ok
0003(testit0003).. Ok
0004(testit0004).. Ok
0005(testit0005).. Ok
0006(testit0006).. Ok
0007(testit0007).. Ok
0008(testit0008).. Ok
0009(testit0009).. Ok
0010(testit0010).. Ok
0011(testit0011).. Ok
0012(testit0012).. Ok
0013(testit0013).. Ok
0014(testit0014).. Ok
0016(testit0016).. Ok
0017(testit0017).. Ok
0018(testit0018).. Ok
0019(testit0019).. Ok
0020(testit0020).. Ok
0021(testit0021).. Ok
0022(testit0022).. Ok
0023(testit0023).. Ok
0024(testit0024).. Ok
0025(testit0025).. Ok
0026(testit0026).. Ok
0027(testit0027).. Ok
0028(testit0028).. Ok
0029(testit0029).. Ok
0030(testit0030).. Ok
0031(testit0031).. Ok
0032(testit0032).. Ok
0033(testit0033).. Ok
0034(testit0034).. Ok
0035(testit0035).. Ok
0036(testit0036).. Ok
0037(testit0037).. Ok
0038(testit0038).. Ok
0039(testit0039).. Ok
0040(testit0040).. Ok
0041(testit0041).. Ok
0042(testit0042).. Ok
0043(testit0043).. Ok
0044(testit0044).. Ok
0045(testit0045).. Ok
0046(testit0046).. Ok
0047(testit0047).. Ok
0048(testit0048).. Ok
0049(testit0049).. Ok
0050(testit0050).. Ok
0051(testit0051).. Ok
0052(testit0052).. Ok
0053(testit0053).. Ok
0054(testit0054).. Ok
0055(testit0055).. Ok
0056(testit0056).. Ok
0057(testit0057).. Ok
0058(testit0058).. Ok
0059(testit0059).. Ok
0060(testit0060).. Ok
0061(testit0061).. Ok
0062(testit0062).. Ok
0063(testit0063).. Ok
0064(testit0064).. Ok
0065(testit0065).. Ok
0066(testit0066).. Ok
0067(testit0067).. Ok
0068(testit0068).. Ok
0069(testit0069).. Ok
0070(testit0070).. Ok
0071(testit0071).. Ok
0072(testit0072).. Ok
0073(testit0073).. Ok
0074(testit0074).. Ok
0075(testit0075).. Ok
0076(testit0076).. Ok
0077(testit0077).. Ok
0078(testit0078).. Ok
0079(testit0079).. Ok
0080(testit0080).. Ok
0081(testit0081).. Ok
0082(testit0082).. Ok
0083(testit0083).. Ok
0084(testit0084).. Ok
0085(testit0085).. Ok
0086(testit0086).. Ok
0087(testit0087).. Ok
0088(testit0088).. Ok
0089(testit0089).. Ok
0090(testit0090)..
Command: /export/home/build/data/continuum/checkouts/517/target/maven-installation/apache-maven-2.0.9-SNAPSHOT/bin/mvn
-e --no-plugin-registry --batch-mode -Dmaven.repo.local=/export/home/build/.m2/repository
clean:clean test
 Ok
0092(testit0092).. Ok
0094(testit0094).. Ok
0095(testit0095).. Ok
0096(testit0096).. Ok
0097(testit0097).. Ok
0099(testit0099).. Ok
0100(testit0100).. Ok
0101(testit0101).. Ok
0102(testit0102).. Ok
0103(testit0103).. Ok
0104(testit0104).. Ok
0105(testit0105).. Ok
0110PluginDependenciesComeFromPluginRepos(testit0110).. Ok
0112ExtensionsThatDragDependencies(testit0112).. Ok
0113ServerAuthzAvailableToWagonMgrInPlugin(testit0113).. Ok
0114ExtensionThatProvidesResources(testit0114).. Ok
0118AttachedArtifactsInReactor(testit0118).. Ok
mng2254PomEncoding(testitMNG2254).. Skipping (version 2.0.7 not in range (2.0.7,))
0129ResourceProvidedToAPluginAsAPluginDependency(testit0129).. Ok
mng2045testJarDependenciesBrokenInReactor(testitMNG2045).. Skipping (version 2.0.7 not in
range (2.0.7,))
mng2277AggregatorAndResolutionPlugins(testitMNG2277).. Skipping (version 2.0.7 not in range
(2.0.7,))
mng3396DependencyManagementForOverConstrainedRanges(testDependencyManagementForOverConstrainedRanges)..
Failure
0115CustomArtifactHandlerAndCustomLifecycle(testit0115).. Ok
0119PluginPrefixOrder(testit0119).. Ok
mng3099SettingsProfilesWithNoPOM(testitMNG3099).. Skipping (version 2.0.7 not in range (2.0.8,))
mng3331ModulePathNormalization(testMNG3331ModuleWithSpaces).. Ok
mng3331ModulePathNormalization(testMNG3331ModuleWithRelativeParentDirRef).. Ok
mng1493NonStandardModulePomNames(testitMNG1493).. Skipping (version 2.0.7 not in range [2.1-SNAPSHOT,))
mng1491ReactorArtifactIdCollision(testitMNG1491).. Ok
Tests run: 121, Failures: 0, Errors: 1, Skipped: 0, Time elapsed: 723.704 sec <<<
FAILURE!

Results :

Tests in error: 
  testDependencyManagementForOverConstrainedRanges(org.apache.maven.integrationtests.MavenITmng3396DependencyManagementForOverConstrainedRanges)

Tests run: 121, Failures: 0, Errors: 1, Skipped: 0

[INFO] ------------------------------------------------------------------------
[ERROR] BUILD FAILURE
[INFO] ------------------------------------------------------------------------
[INFO] There are test failures.
[INFO] ------------------------------------------------------------------------
[INFO] For more information, run Maven with the -e switch
[INFO] ------------------------------------------------------------------------
[INFO] Total time: 12 minutes 35 seconds
[INFO] Finished at: Sun Mar 02 02:04:53 GMT+00:00 2008
[INFO] Final Memory: 19M/36M
[INFO] ------------------------------------------------------------------------

****************************************************************************



Mime
View raw message