maven-notifications mailing list archives

Site index · List index
Message view « Date » · « Thread »
Top « Date » · « Thread »
From Hudson <Hud...@sonatype.org>
Subject Build failed in Hudson: Maven-2.0.x #114
Date Mon, 14 Apr 2008 11:32:08 GMT
See http://ci.sonatype.org/job/Maven-2.0.x/114/changes

Changes:

[vsiveton] MNG-3520: Korean message resource

o added header
o cleaning bundle

[vsiveton] MNG-3520: Korean message resource
Submitted by: Keesun Baik

------------------------------------------
[...truncated 1381 lines...]
Running org.apache.maven.project.inheritance.t10.ProjectInheritanceTest
Project maven:p1:pom:1.0 MavenProject: maven:p1:1.0 @ http://ci.sonatype.org/job/Maven-2.0.x/ws/maven-2.0.x-free/maven-project/src/test/resources/inheritance-repo/t10/p0/p1/pom.xml

Tests run: 1, Failures: 0, Errors: 0, Skipped: 0, Time elapsed: 0.079 sec
Running org.apache.maven.project.ModelUtilsTest
Tests run: 14, Failures: 0, Errors: 0, Skipped: 0, Time elapsed: 0.01 sec
Running org.apache.maven.project.TestProjectBuilder
Tests run: 0, Failures: 0, Errors: 0, Skipped: 0, Time elapsed: 0.003 sec
Running org.apache.maven.project.ProjectSorterTest
Tests run: 5, Failures: 0, Errors: 0, Skipped: 0, Time elapsed: 0.006 sec
Running org.apache.maven.project.inheritance.t09.ProjectInheritanceTest
Project maven:p1:pom:1.0 MavenProject: maven:p1:1.0 @ http://ci.sonatype.org/job/Maven-2.0.x/ws/maven-2.0.x-free/maven-project/src/test/resources/inheritance-repo/t09/p0/p1/pom.xml

Project maven:p2:pom:1.0 MavenProject: maven:p2:1.0 @ http://ci.sonatype.org/job/Maven-2.0.x/ws/maven-2.0.x-free/maven-project/src/test/resources/inheritance-repo/t09/p0/p2/pom.xml

Tests run: 2, Failures: 0, Errors: 0, Skipped: 0, Time elapsed: 0.158 sec

Results :

Tests run: 139, Failures: 0, Errors: 0, Skipped: 0

[INFO] [jar:jar]
[INFO] Building jar: http://ci.sonatype.org/job/Maven-2.0.x/ws/maven-2.0.x-free/maven-project/target/maven-project-2.0.10-SNAPSHOT.jar

[INFO] [install:install]
[INFO] Installing http://ci.sonatype.org/job/Maven-2.0.x/ws/maven-2.0.x-free/maven-project/target/maven-project-2.0.10-SNAPSHOT.jar
 to /home/j2ee-hudson/repos/Maven-2.0.x/org/apache/maven/maven-project/2.0.10-SNAPSHOT/maven-project-2.0.10-SNAPSHOT.jar
[INFO] [deploy:deploy]
altDeploymentRepository = null
[INFO] Retrieving previous build number from apache.snapshots
Uploading: http://localhost:8081/nexus/content/repositories/maven.snapshots/org/apache/maven/maven-project/2.0.10-SNAPSHOT/maven-project-2.0.10-20080414.113129-15.jar
118K uploaded
[INFO] Retrieving previous metadata from apache.snapshots
[INFO] Uploading repository metadata for: 'snapshot org.apache.maven:maven-project:2.0.10-SNAPSHOT'
[INFO] Retrieving previous metadata from apache.snapshots
[INFO] Uploading repository metadata for: 'artifact org.apache.maven:maven-project'
[INFO] Retrieving previous metadata from apache.snapshots
[INFO] Uploading project information for maven-project 2.0.10-20080414.113129-15
[INFO] ------------------------------------------------------------------------
[INFO] Building Maven Plugin Descriptor Model
[INFO]    task-segment: [clean, deploy]
[INFO] ------------------------------------------------------------------------
[INFO] [clean:clean]
[INFO] Deleting directory http://ci.sonatype.org/job/Maven-2.0.x/ws/maven-2.0.x-free/maven-plugin-descriptor/target

[INFO] Deleting directory http://ci.sonatype.org/job/Maven-2.0.x/ws/maven-2.0.x-free/maven-plugin-descriptor/target/classes

[INFO] Deleting directory http://ci.sonatype.org/job/Maven-2.0.x/ws/maven-2.0.x-free/maven-plugin-descriptor/target/test-classes

[INFO] Deleting directory http://ci.sonatype.org/job/Maven-2.0.x/ws/maven-2.0.x-free/maven-plugin-descriptor/target/site

[INFO] [modello:java {execution: standard}]
[INFO] outputDirectory: http://ci.sonatype.org/job/Maven-2.0.x/ws/maven-2.0.x-free/maven-plugin-descriptor/target/generated-sources/modello

[INFO] Generating current version: 1.0.0
[INFO] [modello:xpp3-reader {execution: standard}]
[INFO] outputDirectory: http://ci.sonatype.org/job/Maven-2.0.x/ws/maven-2.0.x-free/maven-plugin-descriptor/target/generated-sources/modello

[INFO] Generating current version: 1.0.0
[INFO] [modello:xpp3-writer {execution: standard}]
[INFO] outputDirectory: http://ci.sonatype.org/job/Maven-2.0.x/ws/maven-2.0.x-free/maven-plugin-descriptor/target/generated-sources/modello

[INFO] Generating current version: 1.0.0
[INFO] [remote-resources:process {execution: default}]
[INFO] [resources:resources]
[INFO] Using default encoding to copy filtered resources.
[INFO] [compiler:compile]
[INFO] Compiling 15 source files to http://ci.sonatype.org/job/Maven-2.0.x/ws/maven-2.0.x-free/maven-plugin-descriptor/target/classes

[INFO] [resources:testResources]
[INFO] Using default encoding to copy filtered resources.
[INFO] [compiler:testCompile]
[INFO] Compiling 1 source file to http://ci.sonatype.org/job/Maven-2.0.x/ws/maven-2.0.x-free/maven-plugin-descriptor/target/test-classes

[INFO] [surefire:test]
[INFO] Surefire report directory: http://ci.sonatype.org/job/Maven-2.0.x/ws/maven-2.0.x-free/maven-plugin-descriptor/target/surefire-reports


-------------------------------------------------------
 T E S T S
-------------------------------------------------------
Running org.apache.maven.plugin.lifecycle.LifecycleXpp3ReaderTest
Tests run: 1, Failures: 0, Errors: 0, Skipped: 0, Time elapsed: 0.079 sec

Results :

Tests run: 1, Failures: 0, Errors: 0, Skipped: 0

[INFO] [jar:jar]
[INFO] Building jar: http://ci.sonatype.org/job/Maven-2.0.x/ws/maven-2.0.x-free/maven-plugin-descriptor/target/maven-plugin-descriptor-2.0.10-SNAPSHOT.jar

[INFO] [install:install]
[INFO] Installing http://ci.sonatype.org/job/Maven-2.0.x/ws/maven-2.0.x-free/maven-plugin-descriptor/target/maven-plugin-descriptor-2.0.10-SNAPSHOT.jar
 to /home/j2ee-hudson/repos/Maven-2.0.x/org/apache/maven/maven-plugin-descriptor/2.0.10-SNAPSHOT/maven-plugin-descriptor-2.0.10-SNAPSHOT.jar
[INFO] [deploy:deploy]
altDeploymentRepository = null
[INFO] Retrieving previous build number from apache.snapshots
Uploading: http://localhost:8081/nexus/content/repositories/maven.snapshots/org/apache/maven/maven-plugin-descriptor/2.0.10-SNAPSHOT/maven-plugin-descriptor-2.0.10-20080414.113129-15.jar
38K uploaded
[INFO] Retrieving previous metadata from apache.snapshots
[INFO] Uploading repository metadata for: 'artifact org.apache.maven:maven-plugin-descriptor'
[INFO] Retrieving previous metadata from apache.snapshots
[INFO] Uploading repository metadata for: 'snapshot org.apache.maven:maven-plugin-descriptor:2.0.10-SNAPSHOT'
[INFO] Retrieving previous metadata from apache.snapshots
[INFO] Uploading project information for maven-plugin-descriptor 2.0.10-20080414.113129-15
[INFO] ------------------------------------------------------------------------
[INFO] Building Maven Monitor
[INFO]    task-segment: [clean, deploy]
[INFO] ------------------------------------------------------------------------
[INFO] [clean:clean]
[INFO] Deleting directory http://ci.sonatype.org/job/Maven-2.0.x/ws/maven-2.0.x-free/maven-monitor/target

[INFO] Deleting directory http://ci.sonatype.org/job/Maven-2.0.x/ws/maven-2.0.x-free/maven-monitor/target/classes

[INFO] Deleting directory http://ci.sonatype.org/job/Maven-2.0.x/ws/maven-2.0.x-free/maven-monitor/target/test-classes

[INFO] Deleting directory http://ci.sonatype.org/job/Maven-2.0.x/ws/maven-2.0.x-free/maven-monitor/target/site

[INFO] [remote-resources:process {execution: default}]
[INFO] [resources:resources]
[INFO] Using default encoding to copy filtered resources.
[INFO] [compiler:compile]
[INFO] Compiling 5 source files to http://ci.sonatype.org/job/Maven-2.0.x/ws/maven-2.0.x-free/maven-monitor/target/classes

[INFO] [resources:testResources]
[INFO] Using default encoding to copy filtered resources.
[INFO] [compiler:testCompile]
[INFO] No sources to compile
[INFO] [surefire:test]
[INFO] Surefire report directory: http://ci.sonatype.org/job/Maven-2.0.x/ws/maven-2.0.x-free/maven-monitor/target/surefire-reports


-------------------------------------------------------
 T E S T S
-------------------------------------------------------
There are no tests to run.

Results :

Tests run: 0, Failures: 0, Errors: 0, Skipped: 0

[INFO] [jar:jar]
[INFO] Building jar: http://ci.sonatype.org/job/Maven-2.0.x/ws/maven-2.0.x-free/maven-monitor/target/maven-monitor-2.0.10-SNAPSHOT.jar

[INFO] [install:install]
[INFO] Installing http://ci.sonatype.org/job/Maven-2.0.x/ws/maven-2.0.x-free/maven-monitor/target/maven-monitor-2.0.10-SNAPSHOT.jar
 to /home/j2ee-hudson/repos/Maven-2.0.x/org/apache/maven/maven-monitor/2.0.10-SNAPSHOT/maven-monitor-2.0.10-SNAPSHOT.jar
[INFO] [deploy:deploy]
altDeploymentRepository = null
[INFO] Retrieving previous build number from apache.snapshots
Uploading: http://localhost:8081/nexus/content/repositories/maven.snapshots/org/apache/maven/maven-monitor/2.0.10-SNAPSHOT/maven-monitor-2.0.10-20080414.113129-15.jar
10K uploaded
[INFO] Retrieving previous metadata from apache.snapshots
[INFO] Uploading repository metadata for: 'artifact org.apache.maven:maven-monitor'
[INFO] Retrieving previous metadata from apache.snapshots
[INFO] Uploading project information for maven-monitor 2.0.10-20080414.113129-15
[INFO] Retrieving previous metadata from apache.snapshots
[INFO] Uploading repository metadata for: 'snapshot org.apache.maven:maven-monitor:2.0.10-SNAPSHOT'
[INFO] ------------------------------------------------------------------------
[INFO] Building Maven Core
[INFO]    task-segment: [clean, deploy]
[INFO] ------------------------------------------------------------------------
[INFO] [clean:clean]
[INFO] Deleting directory http://ci.sonatype.org/job/Maven-2.0.x/ws/maven-2.0.x-free/maven-core/target

[INFO] Deleting directory http://ci.sonatype.org/job/Maven-2.0.x/ws/maven-2.0.x-free/maven-core/target/classes

[INFO] Deleting directory http://ci.sonatype.org/job/Maven-2.0.x/ws/maven-2.0.x-free/maven-core/target/test-classes

[INFO] Deleting directory http://ci.sonatype.org/job/Maven-2.0.x/ws/maven-2.0.x-free/maven-core/target/site

Downloading: http://localhost:8081/nexus/content/groups/public/org/apache/maven/wagon/wagon-webdav/1.0-beta-2/wagon-webdav-1.0-beta-2.pom
1K downloaded
Downloading: http://localhost:8081/nexus/content/groups/public/slide/slide-webdavlib/2.1/slide-webdavlib-2.1.pom
648b downloaded
Downloading: http://localhost:8081/nexus/content/groups/public/commons-httpclient/commons-httpclient/2.0.2/commons-httpclient-2.0.2.pom
6K downloaded
Downloading: http://localhost:8081/nexus/content/groups/public/commons-logging/commons-logging/1.0.3/commons-logging-1.0.3.pom
866b downloaded
Downloading: http://localhost:8081/nexus/content/groups/public/jdom/jdom/1.0/jdom-1.0.pom
1K downloaded
Downloading: http://localhost:8081/nexus/content/groups/public/de/zeigermann/xml/xml-im-exporter/1.1/xml-im-exporter-1.1.pom
248b downloaded
Downloading: http://localhost:8081/nexus/content/groups/public/commons-logging/commons-logging/1.0.4/commons-logging-1.0.4.pom
5K downloaded
Downloading: http://localhost:8081/nexus/content/groups/public/org/apache/maven/wagon/wagon-webdav/1.0-beta-2/wagon-webdav-1.0-beta-2.jar
16K downloaded
Downloading: http://localhost:8081/nexus/content/groups/public/slide/slide-webdavlib/2.1/slide-webdavlib-2.1.jar
168K downloaded
Downloading: http://localhost:8081/nexus/content/groups/public/commons-httpclient/commons-httpclient/2.0.2/commons-httpclient-2.0.2.jar
220K downloaded
Downloading: http://localhost:8081/nexus/content/groups/public/commons-logging/commons-logging/1.0.4/commons-logging-1.0.4.jar
37K downloaded
Downloading: http://localhost:8081/nexus/content/groups/public/jdom/jdom/1.0/jdom-1.0.jar
149K downloaded
Downloading: http://localhost:8081/nexus/content/groups/public/de/zeigermann/xml/xml-im-exporter/1.1/xml-im-exporter-1.1.jar
23K downloaded
Downloading: http://localhost:8081/nexus/content/groups/public/org/apache/maven/wagon/wagon-ssh-external/1.0-beta-2/wagon-ssh-external-1.0-beta-2.jar
12K downloaded
Downloading: http://localhost:8081/nexus/content/groups/public/org/apache/maven/wagon/wagon-ssh-common/1.0-beta-2/wagon-ssh-common-1.0-beta-2.jar
24K downloaded
Downloading: http://localhost:8081/nexus/content/groups/public/org/codehaus/plexus/plexus-interactivity-api/1.0-alpha-4/plexus-interactivity-api-1.0-alpha-4.jar
13K downloaded
Downloading: http://localhost:8081/nexus/content/groups/public/org/apache/maven/wagon/wagon-ssh/1.0-beta-2/wagon-ssh-1.0-beta-2.jar
23K downloaded
Downloading: http://localhost:8081/nexus/content/groups/public/com/jcraft/jsch/0.1.27/jsch-0.1.27.jar
119K downloaded
Downloading: http://localhost:8081/nexus/content/groups/public/org/apache/maven/wagon/wagon-http-lightweight/1.0-beta-2/wagon-http-lightweight-1.0-beta-2.jar
12K downloaded
Downloading: http://localhost:8081/nexus/content/groups/public/org/apache/maven/wagon/wagon-http-shared/1.0-beta-2/wagon-http-shared-1.0-beta-2.jar
9K downloaded
Downloading: http://localhost:8081/nexus/content/groups/public/jtidy/jtidy/4aug2000r7-dev/jtidy-4aug2000r7-dev.jar
134K downloaded
Downloading: http://localhost:8081/nexus/content/groups/public/xml-apis/xml-apis/1.0.b2/xml-apis-1.0.b2.jar
106K downloaded
Downloading: http://localhost:8081/nexus/content/groups/public/commons-cli/commons-cli/1.0/commons-cli-1.0.jar
29K downloaded
[INFO] [remote-resources:process {execution: default}]
[INFO] [resources:resources]
[INFO] Using default encoding to copy filtered resources.
[INFO] [compiler:compile]
[INFO] Compiling 59 source files to http://ci.sonatype.org/job/Maven-2.0.x/ws/maven-2.0.x-free/maven-core/target/classes

[INFO] ------------------------------------------------------------------------
[ERROR] BUILD FAILURE
[INFO] ------------------------------------------------------------------------
[INFO] Compilation failure
http://ci.sonatype.org/job/Maven-2.0.x/ws/maven-2.0.x-free/maven-core/src/main/java/org/apache/maven/cli/MavenCli.java
:[563,53] cannot resolve symbol
symbol  : variable Locale 
location: class org.apache.maven.cli.MavenCli



http://ci.sonatype.org/job/Maven-2.0.x/ws/maven-2.0.x-free/maven-core/src/main/java/org/apache/maven/cli/MavenCli.java
:[563,53] cannot resolve symbol
symbol  : variable Locale 
location: class org.apache.maven.cli.MavenCli


[INFO] ------------------------------------------------------------------------
[INFO] Trace
org.apache.maven.BuildFailureException: Compilation failure
http://ci.sonatype.org/job/Maven-2.0.x/ws/maven-2.0.x-free/maven-core/src/main/java/org/apache/maven/cli/MavenCli.java
:[563,53] cannot resolve symbol
symbol  : variable Locale 
location: class org.apache.maven.cli.MavenCli


	at org.apache.maven.lifecycle.DefaultLifecycleExecutor.executeGoals(DefaultLifecycleExecutor.java:560)
	at org.apache.maven.lifecycle.DefaultLifecycleExecutor.executeGoalWithLifecycle(DefaultLifecycleExecutor.java:480)
	at org.apache.maven.lifecycle.DefaultLifecycleExecutor.executeGoal(DefaultLifecycleExecutor.java:459)
	at org.apache.maven.lifecycle.DefaultLifecycleExecutor.executeGoalAndHandleFailures(DefaultLifecycleExecutor.java:311)
	at org.apache.maven.lifecycle.DefaultLifecycleExecutor.executeTaskSegments(DefaultLifecycleExecutor.java:278)
	at org.apache.maven.lifecycle.DefaultLifecycleExecutor.execute(DefaultLifecycleExecutor.java:143)
	at org.apache.maven.DefaultMaven.doExecute(DefaultMaven.java:333)
	at org.apache.maven.DefaultMaven.execute(DefaultMaven.java:126)
	at org.apache.maven.cli.MavenCli.main(MavenCli.java:282)
	at sun.reflect.NativeMethodAccessorImpl.invoke0(Native Method)
	at sun.reflect.NativeMethodAccessorImpl.invoke(NativeMethodAccessorImpl.java:39)
	at sun.reflect.DelegatingMethodAccessorImpl.invoke(DelegatingMethodAccessorImpl.java:25)
	at java.lang.reflect.Method.invoke(Method.java:324)
	at org.codehaus.classworlds.Launcher.launchEnhanced(Launcher.java:315)
	at org.codehaus.classworlds.Launcher.launch(Launcher.java:255)
	at org.codehaus.classworlds.Launcher.mainWithExitCode(Launcher.java:430)
	at org.codehaus.classworlds.Launcher.main(Launcher.java:375)
Caused by: org.apache.maven.plugin.CompilationFailureException: Compilation failure
http://ci.sonatype.org/job/Maven-2.0.x/ws/maven-2.0.x-free/maven-core/src/main/java/org/apache/maven/cli/MavenCli.java
:[563,53] cannot resolve symbol
symbol  : variable Locale 
location: class org.apache.maven.cli.MavenCli


	at org.apache.maven.plugin.AbstractCompilerMojo.execute(AbstractCompilerMojo.java:516)
	at org.apache.maven.plugin.CompilerMojo.execute(CompilerMojo.java:114)
	at org.apache.maven.plugin.DefaultPluginManager.executeMojo(DefaultPluginManager.java:447)
	at org.apache.maven.lifecycle.DefaultLifecycleExecutor.executeGoals(DefaultLifecycleExecutor.java:539)
	... 16 more
[INFO] ------------------------------------------------------------------------
[INFO] Total time: 44 seconds
[INFO] Finished at: Mon Apr 14 06:32:08 CDT 2008
[INFO] Final Memory: 27M/52M
[INFO] ------------------------------------------------------------------------


Mime
View raw message