maven-notifications mailing list archives

Site index · List index
Message view « Date » · « Thread »
Top « Date » · « Thread »
From Continuum VMBuild Server <contin...@apache.org>
Subject [continuum] BUILD FAILURE: Archiva Web :: Application
Date Mon, 14 Apr 2008 05:10:15 GMT
Online report : http://vmbuild.apache.org/continuum/buildResult.action?buildId=76696&projectId=683

Build statistics:
  State: Failed
  Previous State: Ok
  Started at: Sun 13 Apr 2008 22:04:33 -0700
  Finished at: Sun 13 Apr 2008 22:09:51 -0700
  Total time: 5m 18s
  Build Trigger: Schedule
  Build Number: 27
  Exit code: 1
  Building machine hostname: vmbuild.apache.org
  Operating system : Linux(unknown)
  Java Home version : 
          java version "1.5.0_12"
          Java(TM) 2 Runtime Environment, Standard Edition (build 1.5.0_12-b04)
          Java HotSpot(TM) Client VM (build 1.5.0_12-b04, mixed mode, sharing)
        
  Builder version :
          Maven version: 2.0.8
          Java version: 1.5.0_12
          OS name: "linux" version: "2.6.20-16-server" arch: "i386" Family: "unix"
    
****************************************************************************
SCM Changes:
****************************************************************************
Changed: brett @ Sun 13 Apr 2008 21:58:17 -0700
Comment: remove all traces of the Plexus container
Files changed:
  /archiva/trunk/archiva-modules/archiva-base/archiva-artifact-converter/pom.xml ( 647663
)
  /archiva/trunk/archiva-modules/archiva-base/archiva-artifact-converter/src/test/java/org/apache/maven/archiva/converter/artifact/LegacyToDefaultConverterTest.java
( 647663 )
  /archiva/trunk/archiva-modules/archiva-base/archiva-common/pom.xml ( 647663 )
  /archiva/trunk/archiva-modules/archiva-base/archiva-common/src/test/java/org/apache/maven/archiva/common/utils/ChecksumsTest.java
( 647663 )
  /archiva/trunk/archiva-modules/archiva-base/archiva-configuration/pom.xml ( 647663 )
  /archiva/trunk/archiva-modules/archiva-base/archiva-consumers/archiva-core-consumers/pom.xml
( 647663 )
  /archiva/trunk/archiva-modules/archiva-base/archiva-consumers/archiva-dependency-tree-consumer/pom.xml
( 647663 )
  /archiva/trunk/archiva-modules/archiva-base/archiva-converter/pom.xml ( 647663 )
  /archiva/trunk/archiva-modules/archiva-base/archiva-dependency-graph/pom.xml ( 647663 )
  /archiva/trunk/archiva-modules/archiva-base/archiva-dependency-graph/src/test/java/org/apache/maven/archiva/dependency/graph/AbstractDependencyGraphFactoryTestCase.java
( 647663 )
  /archiva/trunk/archiva-modules/archiva-base/archiva-dependency-graph/src/test/java/org/apache/maven/archiva/dependency/graph/GraphvizDotTool.java
( 647663 )
  /archiva/trunk/archiva-modules/archiva-base/archiva-model/src/test/java/org/apache/maven/archiva/model/ArchivaArtifactTest.java
( 647663 )
  /archiva/trunk/archiva-modules/archiva-base/archiva-model/src/test/java/org/apache/maven/archiva/model/ArchivaModelClonerTest.java
( 647663 )
  /archiva/trunk/archiva-modules/archiva-base/archiva-policies/pom.xml ( 647663 )
  /archiva/trunk/archiva-modules/archiva-base/archiva-proxy/pom.xml ( 647663 )
  /archiva/trunk/archiva-modules/archiva-base/archiva-proxy/src/test/resources/org/apache/maven/archiva/proxy/CacheFailuresTransferTest.xml
( 647663 )
  /archiva/trunk/archiva-modules/archiva-base/archiva-proxy/src/test/resources/org/apache/maven/archiva/proxy/ChecksumTransferTest.xml
( 647663 )
  /archiva/trunk/archiva-modules/archiva-base/archiva-proxy/src/test/resources/org/apache/maven/archiva/proxy/ErrorHandlingTest.xml
( 647663 )
  /archiva/trunk/archiva-modules/archiva-base/archiva-proxy/src/test/resources/org/apache/maven/archiva/proxy/ManagedDefaultTransferTest.xml
( 647663 )
  /archiva/trunk/archiva-modules/archiva-base/archiva-proxy/src/test/resources/org/apache/maven/archiva/proxy/ManagedLegacyTransferTest.xml
( 647663 )
  /archiva/trunk/archiva-modules/archiva-base/archiva-proxy/src/test/resources/org/apache/maven/archiva/proxy/MetadataTransferTest.xml
( 647663 )
  /archiva/trunk/archiva-modules/archiva-base/archiva-proxy/src/test/resources/org/apache/maven/archiva/proxy/RelocateTransferTest.xml
( 647663 )
  /archiva/trunk/archiva-modules/archiva-base/archiva-proxy/src/test/resources/org/apache/maven/archiva/proxy/SnapshotTransferTest.xml
( 647663 )
  /archiva/trunk/archiva-modules/archiva-base/archiva-repository-layer/src/test/java/org/apache/maven/archiva/repository/metadata/RepositoryMetadataReaderTest.java
( 647663 )
  /archiva/trunk/archiva-modules/archiva-base/archiva-repository-layer/src/test/java/org/apache/maven/archiva/repository/metadata/RepositoryMetadataWriterTest.java
( 647663 )
  /archiva/trunk/archiva-modules/archiva-base/archiva-repository-layer/src/test/java/org/apache/maven/archiva/repository/project/filters/ProjectModelExpressionExpanderTest.java
( 647663 )
  /archiva/trunk/archiva-modules/archiva-base/archiva-repository-layer/src/test/java/org/apache/maven/archiva/repository/project/readers/ProjectModel300ReaderTest.java
( 647663 )
  /archiva/trunk/archiva-modules/archiva-base/archiva-repository-layer/src/test/java/org/apache/maven/archiva/repository/project/readers/ProjectModel400ReaderTest.java
( 647663 )
  /archiva/trunk/archiva-modules/archiva-base/archiva-repository-layer/src/test/java/org/apache/maven/archiva/repository/project/writers/ProjectModel400WriterTest.java
( 647663 )
  /archiva/trunk/archiva-modules/archiva-base/archiva-repository-layer/src/test/resources/org/apache/maven/archiva/repository/metadata/MetadataToolsTest.xml
( 647663 )
  /archiva/trunk/archiva-modules/archiva-base/archiva-repository-layer/src/test/resources/org/apache/maven/archiva/repository/project/filters/EffectiveProjectModelFilterTest.xml
( 647663 )
  /archiva/trunk/archiva-modules/archiva-database/pom.xml ( 647663 )
  /archiva/trunk/archiva-modules/archiva-database/src/test/resources/META-INF/plexus/components.xml
( 647663 )
  /archiva/trunk/archiva-modules/archiva-reporting/archiva-artifact-reports/pom.xml ( 647663
)
  /archiva/trunk/archiva-modules/archiva-reporting/archiva-artifact-reports/src/test/resources/META-INF/plexus/components.xml
( 647663 )
  /archiva/trunk/archiva-modules/archiva-scheduled/pom.xml ( 647663 )
  /archiva/trunk/archiva-modules/archiva-web/archiva-rss/pom.xml ( 647663 )
  /archiva/trunk/archiva-modules/archiva-web/archiva-rss/src/test/java/org/apache/archiva/rss/RssFeedGeneratorTest.java
( 647663 )
  /archiva/trunk/archiva-modules/archiva-web/archiva-rss/src/test/java/org/apache/archiva/rss/processor/NewArtifactsRssFeedProcessorTest.java
( 647663 )
  /archiva/trunk/archiva-modules/archiva-web/archiva-security/pom.xml ( 647663 )
  /archiva/trunk/archiva-modules/archiva-web/archiva-security/src/test/java/org/apache/maven/archiva/security/DefaultUserRepositoriesTest.java
( 647663 )
  /archiva/trunk/archiva-modules/archiva-web/archiva-security/src/test/java/org/apache/maven/archiva/security/RoleManagerTest.java
( 647663 )
  /archiva/trunk/archiva-modules/archiva-web/archiva-webapp/pom.xml ( 647663 )
  /archiva/trunk/archiva-modules/archiva-web/archiva-webdav/src/test/java/org/apache/maven/archiva/webdav/simple/SimpleWebdavServer.java
( 647663 )
  /archiva/trunk/archiva-modules/archiva-web/archiva-webdav/src/test/java/org/apache/maven/archiva/webdav/test/AbstractWebdavServer.java
( 647663 )
  /archiva/trunk/archiva-modules/archiva-web/archiva-webdav/src/test/java/org/apache/maven/archiva/webdav/util/MimeTypesTest.java
( 647663 )
  /archiva/trunk/archiva-modules/archiva-web/archiva-webdav/src/test/java/org/apache/maven/archiva/webdav/util/WrappedRepositoryRequestTest.java
( 647663 )
  /archiva/trunk/pom.xml ( 647663 )

****************************************************************************
Dependencies Changes:
****************************************************************************
org.apache.archiva:archiva-report-manager:1.1-SNAPSHOT

org.apache.archiva:archiva-scheduled:1.1-SNAPSHOT

org.apache.archiva:archiva-indexer:1.1-SNAPSHOT

org.apache.archiva:archiva-proxy:1.1-SNAPSHOT

org.apache.archiva:archiva-database:1.1-SNAPSHOT

org.apache.archiva:archiva-repository-layer:1.1-SNAPSHOT

org.apache.archiva:archiva-security:1.1-SNAPSHOT

org.apache.archiva:archiva-core-consumers:1.1-SNAPSHOT

org.apache.archiva:archiva-database-consumers:1.1-SNAPSHOT

org.apache.archiva:archiva-lucene-consumers:1.1-SNAPSHOT

org.apache.archiva:archiva-signature-consumers:1.1-SNAPSHOT

org.apache.archiva:archiva-applet:1.1-SNAPSHOT

org.apache.archiva:archiva-webdav:1.1-SNAPSHOT

org.apache.archiva:archiva-web:1.1-SNAPSHOT


****************************************************************************
Build Defintion:
****************************************************************************
POM filename: pom.xml
Goals: clean install   
Arguments: --batch-mode --non-recursive
Build Fresh: false
Always Build: false
Default Build Definition: true
Schedule: DEFAULT_SCHEDULE
Profile Name: Maven 2.0.8, Java 5
Description: 


****************************************************************************
Test Summary:
****************************************************************************
Tests: 150
Failures: 147
Total time: 254004

****************************************************************************
Output:
****************************************************************************
[INFO] Scanning for projects...
[INFO] ------------------------------------------------------------------------
[INFO] Building Archiva Web :: Application
[INFO]    task-segment: [clean, install]
[INFO] ------------------------------------------------------------------------
[INFO] [clean:clean]
[INFO] Deleting directory /home/continuum/data/working-directory/683/target
[INFO] Deleting file-set: /home/continuum/data/working-directory/683/src/main/webapp (included:
[META-INF, archiva-applet.jar, images/redback, template/redback, WEB-INF/classes, WEB-INF/lib,
WEB-INF/database, WEB-INF/logs, redback, css/redback, WEB-INF/jsp/redback, WEB-INF/template/redback,
WEB-INF/logs, WEB-INF/temp, WEB-INF/jasperreports], excluded: [])
[INFO] [plexus:descriptor {execution: generate}]
[WARNING] POM for 'jpox:jpox:pom:1.1.9:compile' is invalid. It will be ignored for artifact
resolution. Reason: Not a v4.0.0 POM. for project jpox:jpox at /home/continuum/.m2/repository/jpox/jpox/1.1.9/jpox-1.1.9.pom
[WARNING] POM for 'jpox:jpox:pom:1.1.9:compile' is invalid. It will be ignored for artifact
resolution. Reason: Not a v4.0.0 POM. for project jpox:jpox at /home/continuum/.m2/repository/jpox/jpox/1.1.9/jpox-1.1.9.pom
[WARNING] POM for 'jpox:jpox:pom:1.1.9:compile' is invalid. It will be ignored for artifact
resolution. Reason: Not a v4.0.0 POM. for project jpox:jpox at /home/continuum/.m2/repository/jpox/jpox/1.1.9/jpox-1.1.9.pom
[WARNING] POM for 'jpox:jpox:pom:1.1.9:compile' is invalid. It will be ignored for artifact
resolution. Reason: Not a v4.0.0 POM. for project jpox:jpox at /home/continuum/.m2/repository/jpox/jpox/1.1.9/jpox-1.1.9.pom
[INFO] Setting property: classpath.resource.loader.class => 'org.codehaus.plexus.velocity.ContextClassLoaderResourceLoader'.
[INFO] Setting property: velocimacro.messages.on => 'false'.
[INFO] Setting property: resource.loader => 'classpath'.
[INFO] Setting property: resource.manager.logwhenfound => 'false'.
[INFO] [remote-resources:process {execution: default}]
[WARNING] Attempting to build MavenProject instance for Artifact (jpox:jpox:1.1.9) of type:
jar; constructing POM artifact instead.
[WARNING] Invalid project model for artifact [jpox:jpox:1.1.9]. It will be ignored by the
remote resources Mojo.
[WARNING] POM for 'jpox:jpox:pom:1.1.9:compile' is invalid. It will be ignored for artifact
resolution. Reason: Not a v4.0.0 POM. for project jpox:jpox at /home/continuum/.m2/repository/jpox/jpox/1.1.9/jpox-1.1.9.pom
[WARNING] POM for 'jpox:jpox:pom:1.1.9:compile' is invalid. It will be ignored for artifact
resolution. Reason: Not a v4.0.0 POM. for project jpox:jpox at /home/continuum/.m2/repository/jpox/jpox/1.1.9/jpox-1.1.9.pom
[WARNING] POM for 'jpox:jpox:pom:1.1.9:compile' is invalid. It will be ignored for artifact
resolution. Reason: Not a v4.0.0 POM. for project jpox:jpox at /home/continuum/.m2/repository/jpox/jpox/1.1.9/jpox-1.1.9.pom
[WARNING] POM for 'jpox:jpox:pom:1.1.9:compile' is invalid. It will be ignored for artifact
resolution. Reason: Not a v4.0.0 POM. for project jpox:jpox at /home/continuum/.m2/repository/jpox/jpox/1.1.9/jpox-1.1.9.pom
[INFO] [antrun:run {execution: default}]
[INFO] Executing tasks
     [copy] Copying 2 files to /home/continuum/data/working-directory/683/target/appserver-base
[INFO] Executed tasks
[INFO] [resources:resources]
[INFO] Using default encoding to copy filtered resources.
[INFO] [dependency:copy {execution: copy}]
[INFO] Configured Artifact: org.apache.archiva:archiva-applet:1.1-SNAPSHOT:jar
[INFO] Copying archiva-applet-1.1-SNAPSHOT.jar to /home/continuum/data/working-directory/683/src/main/webapp/archiva-applet.jar
[WARNING] POM for 'jpox:jpox:pom:1.1.9:compile' is invalid. It will be ignored for artifact
resolution. Reason: Not a v4.0.0 POM. for project jpox:jpox at /home/continuum/.m2/repository/jpox/jpox/1.1.9/jpox-1.1.9.pom
[WARNING] POM for 'jpox:jpox:pom:1.1.9:compile' is invalid. It will be ignored for artifact
resolution. Reason: Not a v4.0.0 POM. for project jpox:jpox at /home/continuum/.m2/repository/jpox/jpox/1.1.9/jpox-1.1.9.pom
[WARNING] POM for 'jpox:jpox:pom:1.1.9:compile' is invalid. It will be ignored for artifact
resolution. Reason: Not a v4.0.0 POM. for project jpox:jpox at /home/continuum/.m2/repository/jpox/jpox/1.1.9/jpox-1.1.9.pom
[WARNING] POM for 'jpox:jpox:pom:1.1.9:compile' is invalid. It will be ignored for artifact
resolution. Reason: Not a v4.0.0 POM. for project jpox:jpox at /home/continuum/.m2/repository/jpox/jpox/1.1.9/jpox-1.1.9.pom
[INFO] [compiler:compile]
[INFO] Compiling 66 source files to /home/continuum/data/working-directory/683/target/classes
[WARNING] POM for 'jpox:jpox:pom:1.1.9:compile' is invalid. It will be ignored for artifact
resolution. Reason: Not a v4.0.0 POM. for project jpox:jpox at /home/continuum/.m2/repository/jpox/jpox/1.1.9/jpox-1.1.9.pom
[WARNING] POM for 'jpox:jpox:pom:1.1.9:compile' is invalid. It will be ignored for artifact
resolution. Reason: Not a v4.0.0 POM. for project jpox:jpox at /home/continuum/.m2/repository/jpox/jpox/1.1.9/jpox-1.1.9.pom
[WARNING] POM for 'jpox:jpox:pom:1.1.9:compile' is invalid. It will be ignored for artifact
resolution. Reason: Not a v4.0.0 POM. for project jpox:jpox at /home/continuum/.m2/repository/jpox/jpox/1.1.9/jpox-1.1.9.pom
[WARNING] POM for 'jpox:jpox:pom:1.1.9:compile' is invalid. It will be ignored for artifact
resolution. Reason: Not a v4.0.0 POM. for project jpox:jpox at /home/continuum/.m2/repository/jpox/jpox/1.1.9/jpox-1.1.9.pom
[INFO] [war:inplace {execution: default}]
[INFO] Generating webapp in source directory... /home/continuum/data/working-directory/683/src/main/webapp
[INFO] Exploding webapp...
[INFO] Assembling webapp archiva-webapp in /home/continuum/data/working-directory/683/src/main/webapp
[INFO] Expanding: /home/continuum/.m2/repository/org/codehaus/plexus/redback/redback-xwork-content/1.1-SNAPSHOT/redback-xwork-content-1.1-SNAPSHOT.war
into /home/continuum/data/working-directory/683/target/war/work/redback-xwork-content-1.1-SNAPSHOT
[INFO] Overlaying 1 war(s).
[INFO] [resources:testResources]
[INFO] Using default encoding to copy filtered resources.
[WARNING] POM for 'jpox:jpox:pom:1.1.9:compile' is invalid. It will be ignored for artifact
resolution. Reason: Not a v4.0.0 POM. for project jpox:jpox at /home/continuum/.m2/repository/jpox/jpox/1.1.9/jpox-1.1.9.pom
[WARNING] POM for 'jpox:jpox:pom:1.1.9:compile' is invalid. It will be ignored for artifact
resolution. Reason: Not a v4.0.0 POM. for project jpox:jpox at /home/continuum/.m2/repository/jpox/jpox/1.1.9/jpox-1.1.9.pom
[WARNING] POM for 'jpox:jpox:pom:1.1.9:compile' is invalid. It will be ignored for artifact
resolution. Reason: Not a v4.0.0 POM. for project jpox:jpox at /home/continuum/.m2/repository/jpox/jpox/1.1.9/jpox-1.1.9.pom
[WARNING] POM for 'jpox:jpox:pom:1.1.9:compile' is invalid. It will be ignored for artifact
resolution. Reason: Not a v4.0.0 POM. for project jpox:jpox at /home/continuum/.m2/repository/jpox/jpox/1.1.9/jpox-1.1.9.pom
[INFO] [compiler:testCompile]
[INFO] Compiling 39 source files to /home/continuum/data/working-directory/683/target/test-classes
[WARNING] POM for 'jpox:jpox:pom:1.1.9:compile' is invalid. It will be ignored for artifact
resolution. Reason: Not a v4.0.0 POM. for project jpox:jpox at /home/continuum/.m2/repository/jpox/jpox/1.1.9/jpox-1.1.9.pom
[WARNING] POM for 'jpox:jpox:pom:1.1.9:compile' is invalid. It will be ignored for artifact
resolution. Reason: Not a v4.0.0 POM. for project jpox:jpox at /home/continuum/.m2/repository/jpox/jpox/1.1.9/jpox-1.1.9.pom
[WARNING] POM for 'jpox:jpox:pom:1.1.9:compile' is invalid. It will be ignored for artifact
resolution. Reason: Not a v4.0.0 POM. for project jpox:jpox at /home/continuum/.m2/repository/jpox/jpox/1.1.9/jpox-1.1.9.pom
[WARNING] POM for 'jpox:jpox:pom:1.1.9:compile' is invalid. It will be ignored for artifact
resolution. Reason: Not a v4.0.0 POM. for project jpox:jpox at /home/continuum/.m2/repository/jpox/jpox/1.1.9/jpox-1.1.9.pom
[INFO] [surefire:test]
[INFO] Surefire report directory: /home/continuum/data/working-directory/683/target/surefire-reports

-------------------------------------------------------
 T E S T S
-------------------------------------------------------
Running org.apache.maven.archiva.web.repository.RepositoryServletNoProxyMetadataTest
Tests run: 4, Failures: 0, Errors: 4, Skipped: 0, Time elapsed: 14.208 sec <<< FAILURE!
Running org.apache.maven.archiva.web.repository.ArchivaMimeTypeLoaderTest
Tests run: 1, Failures: 0, Errors: 1, Skipped: 0, Time elapsed: 2.177 sec <<< FAILURE!
Running org.apache.maven.archiva.web.repository.RepositoryServletProxiedPluginSnapshotPolicyTest
Tests run: 15, Failures: 0, Errors: 15, Skipped: 0, Time elapsed: 30.067 sec <<<
FAILURE!
Running org.apache.maven.archiva.web.action.admin.repositories.EditManagedRepositoryActionTest
Tests run: 3, Failures: 0, Errors: 3, Skipped: 0, Time elapsed: 5.031 sec <<< FAILURE!
Running org.apache.maven.archiva.web.action.admin.connectors.proxy.AddProxyConnectorActionTest
Tests run: 9, Failures: 0, Errors: 9, Skipped: 0, Time elapsed: 15.306 sec <<< FAILURE!
Running org.apache.maven.archiva.web.action.admin.repositories.DeleteManagedRepositoryActionTest
Tests run: 6, Failures: 0, Errors: 6, Skipped: 0, Time elapsed: 10.093 sec <<< FAILURE!
Running org.apache.maven.archiva.web.startup.BannerTest
Tests run: 3, Failures: 0, Errors: 0, Skipped: 0, Time elapsed: 0.022 sec
Running org.apache.maven.archiva.web.action.admin.connectors.proxy.DeleteProxyConnectorActionTest
Tests run: 5, Failures: 0, Errors: 5, Skipped: 0, Time elapsed: 8.258 sec <<< FAILURE!
Running org.apache.maven.archiva.web.action.admin.repositories.DeleteRemoteRepositoryActionTest
Tests run: 3, Failures: 0, Errors: 3, Skipped: 0, Time elapsed: 4.318 sec <<< FAILURE!
Running org.apache.maven.archiva.web.action.admin.connectors.proxy.EditProxyConnectorActionTest
Tests run: 9, Failures: 0, Errors: 9, Skipped: 0, Time elapsed: 14.423 sec <<< FAILURE!
Running org.apache.maven.archiva.web.action.admin.repositories.AddRemoteRepositoryActionTest
Tests run: 3, Failures: 0, Errors: 3, Skipped: 0, Time elapsed: 5.189 sec <<< FAILURE!
Running org.apache.maven.archiva.web.action.admin.repositories.AddManagedRepositoryActionTest
Tests run: 3, Failures: 0, Errors: 3, Skipped: 0, Time elapsed: 5.035 sec <<< FAILURE!
Running org.apache.maven.archiva.web.repository.RepositoryServletSecurityTest
Tests run: 2, Failures: 0, Errors: 2, Skipped: 0, Time elapsed: 2.652 sec <<< FAILURE!
Running org.apache.maven.archiva.web.repository.RepositoryServletProxiedMetadataRemoteOnlyTest
Tests run: 5, Failures: 0, Errors: 5, Skipped: 0, Time elapsed: 8.531 sec <<< FAILURE!
Running org.apache.maven.archiva.web.repository.RepositoryServletProxiedTimestampedSnapshotPolicyTest
Tests run: 15, Failures: 0, Errors: 15, Skipped: 0, Time elapsed: 24.238 sec <<<
FAILURE!
Running org.apache.maven.archiva.web.action.admin.repositories.RepositoriesActionTest
Tests run: 2, Failures: 0, Errors: 2, Skipped: 0, Time elapsed: 3.474 sec <<< FAILURE!
Running org.apache.maven.archiva.web.repository.RepositoryServletProxiedSnapshotPolicyTest
Tests run: 15, Failures: 0, Errors: 15, Skipped: 0, Time elapsed: 25.637 sec <<<
FAILURE!
Running org.apache.maven.archiva.web.repository.RepositoryServletBrowseTest
Tests run: 1, Failures: 0, Errors: 1, Skipped: 0, Time elapsed: 1.894 sec <<< FAILURE!
Running org.apache.maven.archiva.web.repository.RepositoryServletProxiedMetadataLocalOnlyTest
Tests run: 4, Failures: 0, Errors: 4, Skipped: 0, Time elapsed: 6.97 sec <<< FAILURE!
Running org.apache.maven.archiva.web.repository.RepositoryServletNoProxyTest
Tests run: 12, Failures: 0, Errors: 12, Skipped: 0, Time elapsed: 21.033 sec <<<
FAILURE!
Running org.apache.maven.archiva.web.repository.RepositoryServletProxiedRelocatedTest
Tests run: 1, Failures: 0, Errors: 1, Skipped: 0, Time elapsed: 1.956 sec <<< FAILURE!
Running org.apache.maven.archiva.web.action.admin.connectors.proxy.ProxyConnectorsActionTest
Tests run: 2, Failures: 0, Errors: 2, Skipped: 0, Time elapsed: 3.447 sec <<< FAILURE!
Running org.apache.maven.archiva.web.action.admin.repositories.EditRemoteRepositoryActionTest
Tests run: 3, Failures: 0, Errors: 3, Skipped: 0, Time elapsed: 5.003 sec <<< FAILURE!
Running org.apache.maven.archiva.web.action.admin.connectors.proxy.SortProxyConnectorsActionTest
Tests run: 5, Failures: 0, Errors: 5, Skipped: 0, Time elapsed: 6.224 sec <<< FAILURE!
Running org.apache.maven.archiva.web.repository.RepositoryServletTest
Tests run: 3, Failures: 0, Errors: 3, Skipped: 0, Time elapsed: 5.158 sec <<< FAILURE!
Running org.apache.maven.archiva.web.repository.RepositoryServletProxiedReleasePolicyTest
Tests run: 15, Failures: 0, Errors: 15, Skipped: 0, Time elapsed: 23.066 sec <<<
FAILURE!
Running org.apache.maven.archiva.web.repository.RepositoryServletDeployTest
Tests run: 1, Failures: 0, Errors: 1, Skipped: 0, Time elapsed: 1.412 sec <<< FAILURE!

Results :

Tests in error: 
  testGetVersionMetadataDefaultLayout(org.apache.maven.archiva.web.repository.RepositoryServletNoProxyMetadataTest)
  testGetProjectMetadataDefaultLayout(org.apache.maven.archiva.web.repository.RepositoryServletNoProxyMetadataTest)
  testGetGroupMetadataDefaultLayout(org.apache.maven.archiva.web.repository.RepositoryServletNoProxyMetadataTest)
  testGetSnapshotVersionMetadataDefaultLayout(org.apache.maven.archiva.web.repository.RepositoryServletNoProxyMetadataTest)
  testArchivaTypes(org.apache.maven.archiva.web.repository.ArchivaMimeTypeLoaderTest)
  testGetProxiedSnapshotsArtifactPolicyAlwaysManagedNewer(org.apache.maven.archiva.web.repository.RepositoryServletProxiedPluginSnapshotPolicyTest)
  testGetProxiedSnapshotsArtifactPolicyAlwaysManagedOlder(org.apache.maven.archiva.web.repository.RepositoryServletProxiedPluginSnapshotPolicyTest)
  testGetProxiedSnapshotsArtifactPolicyAlwaysNoManagedContent(org.apache.maven.archiva.web.repository.RepositoryServletProxiedPluginSnapshotPolicyTest)
  testGetProxiedSnapshotsArtifactPolicyDailyFail(org.apache.maven.archiva.web.repository.RepositoryServletProxiedPluginSnapshotPolicyTest)
  testGetProxiedSnapshotsArtifactPolicyDailyNoManagedContent(org.apache.maven.archiva.web.repository.RepositoryServletProxiedPluginSnapshotPolicyTest)
  testGetProxiedSnapshotsArtifactPolicyDailyPass(org.apache.maven.archiva.web.repository.RepositoryServletProxiedPluginSnapshotPolicyTest)
  testGetProxiedSnapshotsArtifactPolicyRejectFail(org.apache.maven.archiva.web.repository.RepositoryServletProxiedPluginSnapshotPolicyTest)
  testGetProxiedSnapshotsArtifactPolicyRejectNoManagedContentFail(org.apache.maven.archiva.web.repository.RepositoryServletProxiedPluginSnapshotPolicyTest)
  testGetProxiedSnapshotsArtifactPolicyRejectPass(org.apache.maven.archiva.web.repository.RepositoryServletProxiedPluginSnapshotPolicyTest)
  testGetProxiedSnapshotsArtifactPolicyHourlyFail(org.apache.maven.archiva.web.repository.RepositoryServletProxiedPluginSnapshotPolicyTest)
  testGetProxiedSnapshotsArtifactPolicyHourlyNoManagedContent(org.apache.maven.archiva.web.repository.RepositoryServletProxiedPluginSnapshotPolicyTest)
  testGetProxiedSnapshotsArtifactPolicyHourlyPass(org.apache.maven.archiva.web.repository.RepositoryServletProxiedPluginSnapshotPolicyTest)
  testGetProxiedSnapshotsArtifactPolicyOnceFail(org.apache.maven.archiva.web.repository.RepositoryServletProxiedPluginSnapshotPolicyTest)
  testGetProxiedSnapshotsArtifactPolicyOnceNoManagedContent(org.apache.maven.archiva.web.repository.RepositoryServletProxiedPluginSnapshotPolicyTest)
  testGetProxiedSnapshotsArtifactPolicyOncePass(org.apache.maven.archiva.web.repository.RepositoryServletProxiedPluginSnapshotPolicyTest)
  testSecureActionBundle(org.apache.maven.archiva.web.action.admin.repositories.EditManagedRepositoryActionTest)
  testEditRepositoryInitialPage(org.apache.maven.archiva.web.action.admin.repositories.EditManagedRepositoryActionTest)
  testEditRepository(org.apache.maven.archiva.web.action.admin.repositories.EditManagedRepositoryActionTest)
  testSecureActionBundle(org.apache.maven.archiva.web.action.admin.connectors.proxy.AddProxyConnectorActionTest)
  testAddBlackListPattern(org.apache.maven.archiva.web.action.admin.connectors.proxy.AddProxyConnectorActionTest)
  testAddProperty(org.apache.maven.archiva.web.action.admin.connectors.proxy.AddProxyConnectorActionTest)
  testAddProxyConnectorCommit(org.apache.maven.archiva.web.action.admin.connectors.proxy.AddProxyConnectorActionTest)
  testAddProxyConnectorInitialPage(org.apache.maven.archiva.web.action.admin.connectors.proxy.AddProxyConnectorActionTest)
  testAddWhiteListPattern(org.apache.maven.archiva.web.action.admin.connectors.proxy.AddProxyConnectorActionTest)
  testRemoveBlackListPattern(org.apache.maven.archiva.web.action.admin.connectors.proxy.AddProxyConnectorActionTest)
  testRemoveProperty(org.apache.maven.archiva.web.action.admin.connectors.proxy.AddProxyConnectorActionTest)
  testRemoveWhiteListPattern(org.apache.maven.archiva.web.action.admin.connectors.proxy.AddProxyConnectorActionTest)
  testSecureActionBundle(org.apache.maven.archiva.web.action.admin.repositories.DeleteManagedRepositoryActionTest)
  testDeleteRepositoryConfirmation(org.apache.maven.archiva.web.action.admin.repositories.DeleteManagedRepositoryActionTest)
  testDeleteRepositoryKeepContent(org.apache.maven.archiva.web.action.admin.repositories.DeleteManagedRepositoryActionTest)
  testDeleteRepositoryDeleteContent(org.apache.maven.archiva.web.action.admin.repositories.DeleteManagedRepositoryActionTest)
  testDeleteRepositoryAndAssociatedProxyConnectors(org.apache.maven.archiva.web.action.admin.repositories.DeleteManagedRepositoryActionTest)
  testDeleteRepositoryCancelled(org.apache.maven.archiva.web.action.admin.repositories.DeleteManagedRepositoryActionTest)
  testSecureActionBundle(org.apache.maven.archiva.web.action.admin.connectors.proxy.DeleteProxyConnectorActionTest)
  testConfirmDelete(org.apache.maven.archiva.web.action.admin.connectors.proxy.DeleteProxyConnectorActionTest)
  testConfirmDeleteBadSourceOrTarget(org.apache.maven.archiva.web.action.admin.connectors.proxy.DeleteProxyConnectorActionTest)
  testConfirmDeleteNoSourceOrTarget(org.apache.maven.archiva.web.action.admin.connectors.proxy.DeleteProxyConnectorActionTest)
  testDelete(org.apache.maven.archiva.web.action.admin.connectors.proxy.DeleteProxyConnectorActionTest)
  testDeleteRemoteRepositoryConfirmation(org.apache.maven.archiva.web.action.admin.repositories.DeleteRemoteRepositoryActionTest)
  testDeleteRemoteRepository(org.apache.maven.archiva.web.action.admin.repositories.DeleteRemoteRepositoryActionTest)
  testDeleteRemoteRepositoryCancelled(org.apache.maven.archiva.web.action.admin.repositories.DeleteRemoteRepositoryActionTest)
  testSecureActionBundle(org.apache.maven.archiva.web.action.admin.connectors.proxy.EditProxyConnectorActionTest)
  testAddBlackListPattern(org.apache.maven.archiva.web.action.admin.connectors.proxy.EditProxyConnectorActionTest)
  testAddProperty(org.apache.maven.archiva.web.action.admin.connectors.proxy.EditProxyConnectorActionTest)
  testAddWhiteListPattern(org.apache.maven.archiva.web.action.admin.connectors.proxy.EditProxyConnectorActionTest)
  testRemoveBlackListPattern(org.apache.maven.archiva.web.action.admin.connectors.proxy.EditProxyConnectorActionTest)
  testRemoveProperty(org.apache.maven.archiva.web.action.admin.connectors.proxy.EditProxyConnectorActionTest)
  testRemoveWhiteListPattern(org.apache.maven.archiva.web.action.admin.connectors.proxy.EditProxyConnectorActionTest)
  testEditProxyConnectorCommit(org.apache.maven.archiva.web.action.admin.connectors.proxy.EditProxyConnectorActionTest)
  testEditProxyConnectorInitialPage(org.apache.maven.archiva.web.action.admin.connectors.proxy.EditProxyConnectorActionTest)
  testSecureActionBundle(org.apache.maven.archiva.web.action.admin.repositories.AddRemoteRepositoryActionTest)
  testAddRemoteRepositoryInitialPage(org.apache.maven.archiva.web.action.admin.repositories.AddRemoteRepositoryActionTest)
  testAddRemoteRepository(org.apache.maven.archiva.web.action.admin.repositories.AddRemoteRepositoryActionTest)
  testSecureActionBundle(org.apache.maven.archiva.web.action.admin.repositories.AddManagedRepositoryActionTest)
  testAddRepositoryInitialPage(org.apache.maven.archiva.web.action.admin.repositories.AddManagedRepositoryActionTest)
  testAddRepository(org.apache.maven.archiva.web.action.admin.repositories.AddManagedRepositoryActionTest)
  testSecuredGet(org.apache.maven.archiva.web.repository.RepositoryServletSecurityTest)
  testSecuredBrowse(org.apache.maven.archiva.web.repository.RepositoryServletSecurityTest)
  testGetProxiedSnapshotVersionMetadataRemoteOnly(org.apache.maven.archiva.web.repository.RepositoryServletProxiedMetadataRemoteOnlyTest)
  testGetProxiedPluginSnapshotVersionMetadataRemoteOnly(org.apache.maven.archiva.web.repository.RepositoryServletProxiedMetadataRemoteOnlyTest)
  testGetProxiedVersionMetadataRemoteOnly(org.apache.maven.archiva.web.repository.RepositoryServletProxiedMetadataRemoteOnlyTest)
  testGetProxiedProjectMetadataRemoteOnly(org.apache.maven.archiva.web.repository.RepositoryServletProxiedMetadataRemoteOnlyTest)
  testGetProxiedGroupMetadataRemoteOnly(org.apache.maven.archiva.web.repository.RepositoryServletProxiedMetadataRemoteOnlyTest)
  testGetProxiedSnapshotsArtifactPolicyAlwaysManagedNewer(org.apache.maven.archiva.web.repository.RepositoryServletProxiedTimestampedSnapshotPolicyTest)
  testGetProxiedSnapshotsArtifactPolicyAlwaysManagedOlder(org.apache.maven.archiva.web.repository.RepositoryServletProxiedTimestampedSnapshotPolicyTest)
  testGetProxiedSnapshotsArtifactPolicyAlwaysNoManagedContent(org.apache.maven.archiva.web.repository.RepositoryServletProxiedTimestampedSnapshotPolicyTest)
  testGetProxiedSnapshotsArtifactPolicyDailyFail(org.apache.maven.archiva.web.repository.RepositoryServletProxiedTimestampedSnapshotPolicyTest)
  testGetProxiedSnapshotsArtifactPolicyDailyNoManagedContent(org.apache.maven.archiva.web.repository.RepositoryServletProxiedTimestampedSnapshotPolicyTest)
  testGetProxiedSnapshotsArtifactPolicyDailyPass(org.apache.maven.archiva.web.repository.RepositoryServletProxiedTimestampedSnapshotPolicyTest)
  testGetProxiedSnapshotsArtifactPolicyRejectFail(org.apache.maven.archiva.web.repository.RepositoryServletProxiedTimestampedSnapshotPolicyTest)
  testGetProxiedSnapshotsArtifactPolicyRejectNoManagedContentFail(org.apache.maven.archiva.web.repository.RepositoryServletProxiedTimestampedSnapshotPolicyTest)
  testGetProxiedSnapshotsArtifactPolicyRejectPass(org.apache.maven.archiva.web.repository.RepositoryServletProxiedTimestampedSnapshotPolicyTest)
  testGetProxiedSnapshotsArtifactPolicyHourlyFail(org.apache.maven.archiva.web.repository.RepositoryServletProxiedTimestampedSnapshotPolicyTest)
  testGetProxiedSnapshotsArtifactPolicyHourlyNoManagedContent(org.apache.maven.archiva.web.repository.RepositoryServletProxiedTimestampedSnapshotPolicyTest)
  testGetProxiedSnapshotsArtifactPolicyHourlyPass(org.apache.maven.archiva.web.repository.RepositoryServletProxiedTimestampedSnapshotPolicyTest)
  testGetProxiedSnapshotsArtifactPolicyOnceFail(org.apache.maven.archiva.web.repository.RepositoryServletProxiedTimestampedSnapshotPolicyTest)
  testGetProxiedSnapshotsArtifactPolicyOnceNoManagedContent(org.apache.maven.archiva.web.repository.RepositoryServletProxiedTimestampedSnapshotPolicyTest)
  testGetProxiedSnapshotsArtifactPolicyOncePass(org.apache.maven.archiva.web.repository.RepositoryServletProxiedTimestampedSnapshotPolicyTest)
  testSecureActionBundle(org.apache.maven.archiva.web.action.admin.repositories.RepositoriesActionTest)
  testGetRepositories(org.apache.maven.archiva.web.action.admin.repositories.RepositoriesActionTest)
  testGetProxiedSnapshotsArtifactPolicyAlwaysManagedNewer(org.apache.maven.archiva.web.repository.RepositoryServletProxiedSnapshotPolicyTest)
  testGetProxiedSnapshotsArtifactPolicyAlwaysManagedOlder(org.apache.maven.archiva.web.repository.RepositoryServletProxiedSnapshotPolicyTest)
  testGetProxiedSnapshotsArtifactPolicyAlwaysNoManagedContent(org.apache.maven.archiva.web.repository.RepositoryServletProxiedSnapshotPolicyTest)
  testGetProxiedSnapshotsArtifactPolicyDailyFail(org.apache.maven.archiva.web.repository.RepositoryServletProxiedSnapshotPolicyTest)
  testGetProxiedSnapshotsArtifactPolicyDailyNoManagedContent(org.apache.maven.archiva.web.repository.RepositoryServletProxiedSnapshotPolicyTest)
  testGetProxiedSnapshotsArtifactPolicyDailyPass(org.apache.maven.archiva.web.repository.RepositoryServletProxiedSnapshotPolicyTest)
  testGetProxiedSnapshotsArtifactPolicyRejectFail(org.apache.maven.archiva.web.repository.RepositoryServletProxiedSnapshotPolicyTest)
  testGetProxiedSnapshotsArtifactPolicyRejectNoManagedContentFail(org.apache.maven.archiva.web.repository.RepositoryServletProxiedSnapshotPolicyTest)
  testGetProxiedSnapshotsArtifactPolicyRejectPass(org.apache.maven.archiva.web.repository.RepositoryServletProxiedSnapshotPolicyTest)
  testGetProxiedSnapshotsArtifactPolicyHourlyFail(org.apache.maven.archiva.web.repository.RepositoryServletProxiedSnapshotPolicyTest)
  testGetProxiedSnapshotsArtifactPolicyHourlyNoManagedContent(org.apache.maven.archiva.web.repository.RepositoryServletProxiedSnapshotPolicyTest)
  testGetProxiedSnapshotsArtifactPolicyHourlyPass(org.apache.maven.archiva.web.repository.RepositoryServletProxiedSnapshotPolicyTest)
  testGetProxiedSnapshotsArtifactPolicyOnceFail(org.apache.maven.archiva.web.repository.RepositoryServletProxiedSnapshotPolicyTest)
  testGetProxiedSnapshotsArtifactPolicyOnceNoManagedContent(org.apache.maven.archiva.web.repository.RepositoryServletProxiedSnapshotPolicyTest)
  testGetProxiedSnapshotsArtifactPolicyOncePass(org.apache.maven.archiva.web.repository.RepositoryServletProxiedSnapshotPolicyTest)
  testBrowse(org.apache.maven.archiva.web.repository.RepositoryServletBrowseTest)
  testGetProxiedSnapshotVersionMetadataLocalOnly(org.apache.maven.archiva.web.repository.RepositoryServletProxiedMetadataLocalOnlyTest)
  testGetProxiedVersionMetadataLocalOnly(org.apache.maven.archiva.web.repository.RepositoryServletProxiedMetadataLocalOnlyTest)
  testGetProxiedProjectMetadataLocalOnly(org.apache.maven.archiva.web.repository.RepositoryServletProxiedMetadataLocalOnlyTest)
  testGetProxiedGroupMetadataLocalOnly(org.apache.maven.archiva.web.repository.RepositoryServletProxiedMetadataLocalOnlyTest)
  testGetNoProxyChecksumDefaultLayout(org.apache.maven.archiva.web.repository.RepositoryServletNoProxyTest)
  testGetNoProxyChecksumLegacyLayout(org.apache.maven.archiva.web.repository.RepositoryServletNoProxyTest)
  testGetNoProxyVersionedMetadataDefaultLayout(org.apache.maven.archiva.web.repository.RepositoryServletNoProxyTest)
  testGetNoProxyProjectMetadataDefaultLayout(org.apache.maven.archiva.web.repository.RepositoryServletNoProxyTest)
  testGetNoProxyGroupMetadataDefaultLayout(org.apache.maven.archiva.web.repository.RepositoryServletNoProxyTest)
  testGetNoProxyArtifactDefaultLayout(org.apache.maven.archiva.web.repository.RepositoryServletNoProxyTest)
  testGetNoProxyArtifactLegacyLayout(org.apache.maven.archiva.web.repository.RepositoryServletNoProxyTest)
  testGetNoProxySnapshotArtifactDefaultLayout(org.apache.maven.archiva.web.repository.RepositoryServletNoProxyTest)
  testGetNoProxySnapshotArtifactLegacyLayout(org.apache.maven.archiva.web.repository.RepositoryServletNoProxyTest)
  testGetNoProxyTimestampedSnapshotArtifactDefaultLayout(org.apache.maven.archiva.web.repository.RepositoryServletNoProxyTest)
  testGetNoProxyTimestampedSnapshotArtifactLegacyLayout(org.apache.maven.archiva.web.repository.RepositoryServletNoProxyTest)
  testGetNoProxyDualExtensionDefaultLayout(org.apache.maven.archiva.web.repository.RepositoryServletNoProxyTest)
  testGetProxiedReleaseArtifactPolicyOncePass(org.apache.maven.archiva.web.repository.RepositoryServletProxiedRelocatedTest)
  testSecureActionBundle(org.apache.maven.archiva.web.action.admin.connectors.proxy.ProxyConnectorsActionTest)
  testExecute(org.apache.maven.archiva.web.action.admin.connectors.proxy.ProxyConnectorsActionTest)
  testSecureActionBundle(org.apache.maven.archiva.web.action.admin.repositories.EditRemoteRepositoryActionTest)
  testEditRemoteRepository(org.apache.maven.archiva.web.action.admin.repositories.EditRemoteRepositoryActionTest)
  testEditRemoteRepositoryInitialPage(org.apache.maven.archiva.web.action.admin.repositories.EditRemoteRepositoryActionTest)
  testSecureActionBundle(org.apache.maven.archiva.web.action.admin.connectors.proxy.SortProxyConnectorsActionTest)
  testSortDown(org.apache.maven.archiva.web.action.admin.connectors.proxy.SortProxyConnectorsActionTest)
  testSortDownPastEnd(org.apache.maven.archiva.web.action.admin.connectors.proxy.SortProxyConnectorsActionTest)
  testSortUp(org.apache.maven.archiva.web.action.admin.connectors.proxy.SortProxyConnectorsActionTest)
  testSortUpPastBeginning(org.apache.maven.archiva.web.action.admin.connectors.proxy.SortProxyConnectorsActionTest)
  testGetRepository(org.apache.maven.archiva.web.repository.RepositoryServletTest)
  testGetRepositoryAfterDelete(org.apache.maven.archiva.web.repository.RepositoryServletTest)
  testGetRepositoryAfterAdd(org.apache.maven.archiva.web.repository.RepositoryServletTest)
  testGetProxiedReleaseArtifactPolicyOncePass(org.apache.maven.archiva.web.repository.RepositoryServletProxiedReleasePolicyTest)
  testGetProxiedReleaseArtifactPolicyAlwaysManagedNewer(org.apache.maven.archiva.web.repository.RepositoryServletProxiedReleasePolicyTest)
  testGetProxiedReleaseArtifactPolicyAlwaysManagedOlder(org.apache.maven.archiva.web.repository.RepositoryServletProxiedReleasePolicyTest)
  testGetProxiedReleaseArtifactPolicyAlwaysNoManagedContent(org.apache.maven.archiva.web.repository.RepositoryServletProxiedReleasePolicyTest)
  testGetProxiedReleaseArtifactPolicyDailyFail(org.apache.maven.archiva.web.repository.RepositoryServletProxiedReleasePolicyTest)
  testGetProxiedReleaseArtifactPolicyDailyNoManagedContent(org.apache.maven.archiva.web.repository.RepositoryServletProxiedReleasePolicyTest)
  testGetProxiedReleaseArtifactPolicyDailyPass(org.apache.maven.archiva.web.repository.RepositoryServletProxiedReleasePolicyTest)
  testGetProxiedReleaseArtifactPolicyRejectFail(org.apache.maven.archiva.web.repository.RepositoryServletProxiedReleasePolicyTest)
  testGetProxiedReleaseArtifactPolicyRejectNoManagedContentFail(org.apache.maven.archiva.web.repository.RepositoryServletProxiedReleasePolicyTest)
  testGetProxiedReleaseArtifactPolicyRejectPass(org.apache.maven.archiva.web.repository.RepositoryServletProxiedReleasePolicyTest)
  testGetProxiedReleaseArtifactPolicyHourlyFail(org.apache.maven.archiva.web.repository.RepositoryServletProxiedReleasePolicyTest)
  testGetProxiedReleaseArtifactPolicyHourlyNoManagedContent(org.apache.maven.archiva.web.repository.RepositoryServletProxiedReleasePolicyTest)
  testGetProxiedReleaseArtifactPolicyHourlyPass(org.apache.maven.archiva.web.repository.RepositoryServletProxiedReleasePolicyTest)
  testGetProxiedReleaseArtifactPolicyOnceFail(org.apache.maven.archiva.web.repository.RepositoryServletProxiedReleasePolicyTest)
  testGetProxiedReleaseArtifactPolicyOnceNoManagedContent(org.apache.maven.archiva.web.repository.RepositoryServletProxiedReleasePolicyTest)
  testPutWithMissingParentCollection(org.apache.maven.archiva.web.repository.RepositoryServletDeployTest)

Tests run: 150, Failures: 0, Errors: 147, Skipped: 0

[INFO] ------------------------------------------------------------------------
[ERROR] BUILD FAILURE
[INFO] ------------------------------------------------------------------------
[INFO] There are test failures.

Please refer to /home/continuum/data/working-directory/683/target/surefire-reports for the
individual test results.
[INFO] ------------------------------------------------------------------------
[INFO] For more information, run Maven with the -e switch
[INFO] ------------------------------------------------------------------------
[INFO] Total time: 5 minutes 7 seconds
[INFO] Finished at: Sun Apr 13 22:09:51 PDT 2008
[INFO] Final Memory: 29M/63M
[INFO] ------------------------------------------------------------------------

****************************************************************************



Mime
View raw message