maven-notifications mailing list archives

Site index · List index
Message view « Date » · « Thread »
Top « Date » · « Thread »
From Continuum VMBuild Server <contin...@apache.org>
Subject [continuum] BUILD FAILURE: Archiva Base :: Proxy
Date Thu, 03 Apr 2008 18:39:46 GMT
Online report : http://vmbuild.apache.org/continuum/buildResult.action?buildId=72893&projectId=669

Build statistics:
  State: Failed
  Previous State: Ok
  Started at: Thu 3 Apr 2008 11:38:59 -0700
  Finished at: Thu 3 Apr 2008 11:39:23 -0700
  Total time: 23s
  Build Trigger: Schedule
  Build Number: 11
  Exit code: 1
  Building machine hostname: vmbuild.apache.org
  Operating system : Linux(unknown)
  Java Home version : 
          java version "1.5.0_12"
          Java(TM) 2 Runtime Environment, Standard Edition (build 1.5.0_12-b04)
          Java HotSpot(TM) Client VM (build 1.5.0_12-b04, mixed mode, sharing)
        
  Builder version :
          Maven version: 2.0.8
          Java version: 1.5.0_12
          OS name: "linux" version: "2.6.20-16-server" arch: "i386" Family: "unix"
    
****************************************************************************
SCM Changes:
****************************************************************************
No files changed

****************************************************************************
Dependencies Changes:
****************************************************************************
org.apache.archiva:archiva-repository-layer:1.1-SNAPSHOT


****************************************************************************
Build Defintion:
****************************************************************************
POM filename: pom.xml
Goals: clean install   
Arguments: --batch-mode --non-recursive
Build Fresh: false
Always Build: false
Default Build Definition: true
Schedule: DEFAULT_SCHEDULE
Profile Name: Maven 2.0.8, Java 5
Description: 


****************************************************************************
Test Summary:
****************************************************************************
Tests: 0
Failures: 0
Total time: 0

****************************************************************************
Output:
****************************************************************************
[INFO] Scanning for projects...
[INFO] ------------------------------------------------------------------------
[INFO] Building Archiva Base :: Proxy
[INFO]    task-segment: [clean, install]
[INFO] ------------------------------------------------------------------------
[INFO] [clean:clean]
[INFO] Deleting directory /home/continuum/data/working-directory/669/target
[INFO] [plexus:descriptor {execution: generate}]
[INFO] Setting property: classpath.resource.loader.class => 'org.codehaus.plexus.velocity.ContextClassLoaderResourceLoader'.
[INFO] Setting property: velocimacro.messages.on => 'false'.
[INFO] Setting property: resource.loader => 'classpath'.
[INFO] Setting property: resource.manager.logwhenfound => 'false'.
[INFO] [remote-resources:process {execution: default}]
[INFO] [resources:resources]
[INFO] Using default encoding to copy filtered resources.
[INFO] [compiler:compile]
[INFO] Compiling 7 source files to /home/continuum/data/working-directory/669/target/classes
[INFO] ------------------------------------------------------------------------
[ERROR] BUILD FAILURE
[INFO] ------------------------------------------------------------------------
[INFO] Compilation failure

/home/continuum/data/working-directory/669/src/main/java/org/apache/maven/archiva/proxy/RepositoryProxyConnectors.java:[25,41]
cannot find symbol
symbol  : class ProxyDownloadException
location: package org.apache.maven.archiva.policies

/home/continuum/data/working-directory/669/src/main/java/org/apache/maven/archiva/proxy/RepositoryProxyConnectors.java:[52,15]
cannot find symbol
symbol  : class ProxyDownloadException
location: interface org.apache.maven.archiva.proxy.RepositoryProxyConnectors

/home/continuum/data/working-directory/669/src/main/java/org/apache/maven/archiva/proxy/DefaultRepositoryProxyConnectors.java:[34,41]
cannot find symbol
symbol  : class DownloadErrorPolicy
location: package org.apache.maven.archiva.policies

/home/continuum/data/working-directory/669/src/main/java/org/apache/maven/archiva/proxy/DefaultRepositoryProxyConnectors.java:[40,41]
cannot find symbol
symbol  : class ProxyDownloadException
location: package org.apache.maven.archiva.policies

/home/continuum/data/working-directory/669/src/main/java/org/apache/maven/archiva/proxy/DefaultRepositoryProxyConnectors.java:[125,24]
cannot find symbol
symbol  : class DownloadErrorPolicy
location: class org.apache.maven.archiva.proxy.DefaultRepositoryProxyConnectors

/home/continuum/data/working-directory/669/src/main/java/org/apache/maven/archiva/proxy/DefaultRepositoryProxyConnectors.java:[151,15]
cannot find symbol
symbol  : class ProxyDownloadException
location: class org.apache.maven.archiva.proxy.DefaultRepositoryProxyConnectors

/home/continuum/data/working-directory/669/src/main/java/org/apache/maven/archiva/proxy/DefaultRepositoryProxyConnectors.java:[783,47]
cannot find symbol
symbol  : class DownloadErrorPolicy
location: class org.apache.maven.archiva.proxy.DefaultRepositoryProxyConnectors

/home/continuum/data/working-directory/669/src/main/java/org/apache/maven/archiva/proxy/DefaultRepositoryProxyConnectors.java:[786,15]
cannot find symbol
symbol  : class ProxyDownloadException
location: class org.apache.maven.archiva.proxy.DefaultRepositoryProxyConnectors

/home/continuum/data/working-directory/669/src/main/java/org/apache/maven/archiva/proxy/DefaultRepositoryProxyConnectors.java:[199,22]
cannot find symbol
symbol  : class ProxyDownloadException
location: class org.apache.maven.archiva.proxy.DefaultRepositoryProxyConnectors

/home/continuum/data/working-directory/669/src/main/java/org/apache/maven/archiva/proxy/DefaultRepositoryProxyConnectors.java:[789,38]
cannot find symbol
symbol  : class DownloadErrorPolicy
location: class org.apache.maven.archiva.proxy.DefaultRepositoryProxyConnectors

/home/continuum/data/working-directory/669/src/main/java/org/apache/maven/archiva/proxy/DefaultRepositoryProxyConnectors.java:[792,12]
cannot find symbol
symbol  : class DownloadErrorPolicy
location: class org.apache.maven.archiva.proxy.DefaultRepositoryProxyConnectors

/home/continuum/data/working-directory/669/src/main/java/org/apache/maven/archiva/proxy/DefaultRepositoryProxyConnectors.java:[817,26]
cannot find symbol
symbol  : class ProxyDownloadException
location: class org.apache.maven.archiva.proxy.DefaultRepositoryProxyConnectors


[INFO] ------------------------------------------------------------------------
[INFO] For more information, run Maven with the -e switch
[INFO] ------------------------------------------------------------------------
[INFO] Total time: 16 seconds
[INFO] Finished at: Thu Apr 03 11:39:23 PDT 2008
[INFO] Final Memory: 15M/27M
[INFO] ------------------------------------------------------------------------

****************************************************************************



Mime
View raw message