maven-notifications mailing list archives

Site index · List index
Message view « Date » · « Thread »
Top « Date » · « Thread »
From Continuum VMBuild Server <contin...@apache.org>
Subject [continuum] BUILD FAILURE: Archiva Repository Interface Layer
Date Mon, 07 Apr 2008 14:30:06 GMT
Online report : http://vmbuild.apache.org/continuum/buildResult.action?buildId=74174&projectId=667

Build statistics:
  State: Failed
  Previous State: Ok
  Started at: Mon 7 Apr 2008 07:29:33 -0700
  Finished at: Mon 7 Apr 2008 07:29:52 -0700
  Total time: 18s
  Build Trigger: Schedule
  Build Number: 18
  Exit code: 1
  Building machine hostname: vmbuild.apache.org
  Operating system : Linux(unknown)
  Java Home version : 
          java version "1.5.0_12"
          Java(TM) 2 Runtime Environment, Standard Edition (build 1.5.0_12-b04)
          Java HotSpot(TM) Client VM (build 1.5.0_12-b04, mixed mode, sharing)
        
  Builder version :
          Maven version: 2.0.8
          Java version: 1.5.0_12
          OS name: "linux" version: "2.6.20-16-server" arch: "i386" Family: "unix"
    
****************************************************************************
SCM Changes:
****************************************************************************
No files changed

****************************************************************************
Dependencies Changes:
****************************************************************************
org.apache.archiva:archiva-model:1.1-SNAPSHOT

org.apache.archiva:archiva-consumer-api:1.1-SNAPSHOT

org.apache.archiva:archiva-dependency-graph:1.1-SNAPSHOT

org.apache.archiva:archiva-configuration:1.1-SNAPSHOT

org.apache.archiva:archiva-base:1.1-SNAPSHOT


****************************************************************************
Build Defintion:
****************************************************************************
POM filename: pom.xml
Goals: clean install   
Arguments: --batch-mode --non-recursive
Build Fresh: false
Always Build: false
Default Build Definition: true
Schedule: DEFAULT_SCHEDULE
Profile Name: Maven 2.0.8, Java 5
Description: 


****************************************************************************
Test Summary:
****************************************************************************
Tests: 0
Failures: 0
Total time: 0

****************************************************************************
Output:
****************************************************************************
[INFO] Scanning for projects...
[INFO] ------------------------------------------------------------------------
[INFO] Building Archiva Repository Interface Layer
[INFO]    task-segment: [clean, install]
[INFO] ------------------------------------------------------------------------
[INFO] [clean:clean]
[INFO] Deleting directory /home/continuum/data/working-directory/667/target
[INFO] [plexus:descriptor {execution: generate}]
[INFO] [plexus:descriptor {execution: descriptor}]
[INFO] Setting property: classpath.resource.loader.class => 'org.codehaus.plexus.velocity.ContextClassLoaderResourceLoader'.
[INFO] Setting property: velocimacro.messages.on => 'false'.
[INFO] Setting property: resource.loader => 'classpath'.
[INFO] Setting property: resource.manager.logwhenfound => 'false'.
[INFO] [remote-resources:process {execution: default}]
[INFO] [resources:resources]
[INFO] Using default encoding to copy filtered resources.
[INFO] [plexus:merge-descriptors {execution: merge}]
[INFO] [compiler:compile]
[INFO] Compiling 58 source files to /home/continuum/data/working-directory/667/target/classes
[INFO] ------------------------------------------------------------------------
[ERROR] BUILD FAILURE
[INFO] ------------------------------------------------------------------------
[INFO] Compilation failure

/home/continuum/data/working-directory/667/src/main/java/org/apache/maven/archiva/repository/scanner/RepositoryScanStatistics.java:[35,7]
cannot access javax.jdo.spi.PersistenceCapable
file javax/jdo/spi/PersistenceCapable.class not found
public class RepositoryScanStatistics

/home/continuum/data/working-directory/667/src/main/java/org/apache/maven/archiva/repository/project/readers/ProjectModel400Reader.java:[39,36]
package org.apache.maven.archiva.xml does not exist

/home/continuum/data/working-directory/667/src/main/java/org/apache/maven/archiva/repository/project/readers/ProjectModel400Reader.java:[40,36]
package org.apache.maven.archiva.xml does not exist

/home/continuum/data/working-directory/667/src/main/java/org/apache/maven/archiva/repository/project/readers/ProjectModel400Reader.java:[136,62]
cannot find symbol
symbol  : class XMLReader
location: class org.apache.maven.archiva.repository.project.readers.ProjectModel400Reader

/home/continuum/data/working-directory/667/src/main/java/org/apache/maven/archiva/repository/project/readers/ProjectModel400Reader.java:[137,15]
cannot find symbol
symbol  : class XMLException
location: class org.apache.maven.archiva.repository.project.readers.ProjectModel400Reader

/home/continuum/data/working-directory/667/src/main/java/org/apache/maven/archiva/repository/project/readers/ProjectModel400Reader.java:[152,56]
cannot find symbol
symbol  : class XMLReader
location: class org.apache.maven.archiva.repository.project.readers.ProjectModel400Reader

/home/continuum/data/working-directory/667/src/main/java/org/apache/maven/archiva/repository/project/readers/ProjectModel400Reader.java:[153,15]
cannot find symbol
symbol  : class XMLException
location: class org.apache.maven.archiva.repository.project.readers.ProjectModel400Reader

/home/continuum/data/working-directory/667/src/main/java/org/apache/maven/archiva/repository/project/readers/ProjectModel400Reader.java:[158,42]
cannot find symbol
symbol  : class XMLReader
location: class org.apache.maven.archiva.repository.project.readers.ProjectModel400Reader

/home/continuum/data/working-directory/667/src/main/java/org/apache/maven/archiva/repository/project/readers/ProjectModel400Reader.java:[159,15]
cannot find symbol
symbol  : class XMLException
location: class org.apache.maven.archiva.repository.project.readers.ProjectModel400Reader

/home/continuum/data/working-directory/667/src/main/java/org/apache/maven/archiva/repository/project/readers/ProjectModel400Reader.java:[173,46]
cannot find symbol
symbol  : class XMLReader
location: class org.apache.maven.archiva.repository.project.readers.ProjectModel400Reader

/home/continuum/data/working-directory/667/src/main/java/org/apache/maven/archiva/repository/project/readers/ProjectModel400Reader.java:[174,15]
cannot find symbol
symbol  : class XMLException
location: class org.apache.maven.archiva.repository.project.readers.ProjectModel400Reader

/home/continuum/data/working-directory/667/src/main/java/org/apache/maven/archiva/repository/project/readers/ProjectModel400Reader.java:[179,48]
cannot find symbol
symbol  : class XMLReader
location: class org.apache.maven.archiva.repository.project.readers.ProjectModel400Reader

/home/continuum/data/working-directory/667/src/main/java/org/apache/maven/archiva/repository/project/readers/ProjectModel400Reader.java:[180,15]
cannot find symbol
symbol  : class XMLException
location: class org.apache.maven.archiva.repository.project.readers.ProjectModel400Reader

/home/continuum/data/working-directory/667/src/main/java/org/apache/maven/archiva/repository/project/readers/ProjectModel400Reader.java:[230,54]
cannot find symbol
symbol  : class XMLReader
location: class org.apache.maven.archiva.repository.project.readers.ProjectModel400Reader

/home/continuum/data/working-directory/667/src/main/java/org/apache/maven/archiva/repository/project/readers/ProjectModel400Reader.java:[231,15]
cannot find symbol
symbol  : class XMLException
location: class org.apache.maven.archiva.repository.project.readers.ProjectModel400Reader

/home/continuum/data/working-directory/667/src/main/java/org/apache/maven/archiva/repository/project/readers/ProjectModel400Reader.java:[260,45]
cannot find symbol
symbol  : class XMLReader
location: class org.apache.maven.archiva.repository.project.readers.ProjectModel400Reader

/home/continuum/data/working-directory/667/src/main/java/org/apache/maven/archiva/repository/project/readers/ProjectModel400Reader.java:[261,15]
cannot find symbol
symbol  : class XMLException
location: class org.apache.maven.archiva.repository.project.readers.ProjectModel400Reader

/home/continuum/data/working-directory/667/src/main/java/org/apache/maven/archiva/repository/project/readers/ProjectModel400Reader.java:[271,45]
cannot find symbol
symbol  : class XMLReader
location: class org.apache.maven.archiva.repository.project.readers.ProjectModel400Reader

/home/continuum/data/working-directory/667/src/main/java/org/apache/maven/archiva/repository/project/readers/ProjectModel400Reader.java:[272,15]
cannot find symbol
symbol  : class XMLException
location: class org.apache.maven.archiva.repository.project.readers.ProjectModel400Reader

/home/continuum/data/working-directory/667/src/main/java/org/apache/maven/archiva/repository/project/readers/ProjectModel400Reader.java:[319,48]
cannot find symbol
symbol  : class XMLReader
location: class org.apache.maven.archiva.repository.project.readers.ProjectModel400Reader

/home/continuum/data/working-directory/667/src/main/java/org/apache/maven/archiva/repository/project/readers/ProjectModel400Reader.java:[320,15]
cannot find symbol
symbol  : class XMLException
location: class org.apache.maven.archiva.repository.project.readers.ProjectModel400Reader

/home/continuum/data/working-directory/667/src/main/java/org/apache/maven/archiva/repository/project/readers/ProjectModel400Reader.java:[336,39]
cannot find symbol
symbol  : class XMLReader
location: class org.apache.maven.archiva.repository.project.readers.ProjectModel400Reader

/home/continuum/data/working-directory/667/src/main/java/org/apache/maven/archiva/repository/project/readers/ProjectModel400Reader.java:[337,15]
cannot find symbol
symbol  : class XMLException
location: class org.apache.maven.archiva.repository.project.readers.ProjectModel400Reader

/home/continuum/data/working-directory/667/src/main/java/org/apache/maven/archiva/repository/project/readers/ProjectModel400Reader.java:[363,47]
cannot find symbol
symbol  : class XMLReader
location: class org.apache.maven.archiva.repository.project.readers.ProjectModel400Reader

/home/continuum/data/working-directory/667/src/main/java/org/apache/maven/archiva/repository/project/readers/ProjectModel400Reader.java:[364,15]
cannot find symbol
symbol  : class XMLException
location: class org.apache.maven.archiva.repository.project.readers.ProjectModel400Reader

/home/continuum/data/working-directory/667/src/main/java/org/apache/maven/archiva/repository/project/readers/ProjectModel400Reader.java:[399,42]
cannot find symbol
symbol  : class XMLReader
location: class org.apache.maven.archiva.repository.project.readers.ProjectModel400Reader

/home/continuum/data/working-directory/667/src/main/java/org/apache/maven/archiva/repository/project/readers/ProjectModel400Reader.java:[400,15]
cannot find symbol
symbol  : class XMLException
location: class org.apache.maven.archiva.repository.project.readers.ProjectModel400Reader

/home/continuum/data/working-directory/667/src/main/java/org/apache/maven/archiva/repository/project/readers/ProjectModel400Reader.java:[416,49]
cannot find symbol
symbol  : class XMLReader
location: class org.apache.maven.archiva.repository.project.readers.ProjectModel400Reader

/home/continuum/data/working-directory/667/src/main/java/org/apache/maven/archiva/repository/project/readers/ProjectModel400Reader.java:[417,15]
cannot find symbol
symbol  : class XMLException
location: class org.apache.maven.archiva.repository.project.readers.ProjectModel400Reader

/home/continuum/data/working-directory/667/src/main/java/org/apache/maven/archiva/repository/project/readers/ProjectModel400Reader.java:[429,48]
cannot find symbol
symbol  : class XMLReader
location: class org.apache.maven.archiva.repository.project.readers.ProjectModel400Reader

/home/continuum/data/working-directory/667/src/main/java/org/apache/maven/archiva/repository/project/readers/ProjectModel400Reader.java:[430,15]
cannot find symbol
symbol  : class XMLException
location: class org.apache.maven.archiva.repository.project.readers.ProjectModel400Reader

/home/continuum/data/working-directory/667/src/main/java/org/apache/maven/archiva/repository/project/readers/ProjectModel400Reader.java:[454,46]
cannot find symbol
symbol  : class XMLReader
location: class org.apache.maven.archiva.repository.project.readers.ProjectModel400Reader

/home/continuum/data/working-directory/667/src/main/java/org/apache/maven/archiva/repository/project/readers/ProjectModel400Reader.java:[455,15]
cannot find symbol
symbol  : class XMLException
location: class org.apache.maven.archiva.repository.project.readers.ProjectModel400Reader

/home/continuum/data/working-directory/667/src/main/java/org/apache/maven/archiva/repository/project/readers/ProjectModel400Reader.java:[467,48]
cannot find symbol
symbol  : class XMLReader
location: class org.apache.maven.archiva.repository.project.readers.ProjectModel400Reader

/home/continuum/data/working-directory/667/src/main/java/org/apache/maven/archiva/repository/project/readers/ProjectModel400Reader.java:[468,15]
cannot find symbol
symbol  : class XMLException
location: class org.apache.maven.archiva.repository.project.readers.ProjectModel400Reader

/home/continuum/data/working-directory/667/src/main/java/org/apache/maven/archiva/repository/project/readers/ProjectModel400Reader.java:[473,53]
cannot find symbol
symbol  : class XMLReader
location: class org.apache.maven.archiva.repository.project.readers.ProjectModel400Reader

/home/continuum/data/working-directory/667/src/main/java/org/apache/maven/archiva/repository/project/readers/ProjectModel400Reader.java:[474,15]
cannot find symbol
symbol  : class XMLException
location: class org.apache.maven.archiva.repository.project.readers.ProjectModel400Reader

/home/continuum/data/working-directory/667/src/main/java/org/apache/maven/archiva/repository/project/readers/ProjectModel400Reader.java:[484,53]
cannot find symbol
symbol  : class XMLReader
location: class org.apache.maven.archiva.repository.project.readers.ProjectModel400Reader

/home/continuum/data/working-directory/667/src/main/java/org/apache/maven/archiva/repository/project/readers/ProjectModel400Reader.java:[485,15]
cannot find symbol
symbol  : class XMLException
location: class org.apache.maven.archiva.repository.project.readers.ProjectModel400Reader

/home/continuum/data/working-directory/667/src/main/java/org/apache/maven/archiva/repository/project/readers/ProjectModel400Reader.java:[510,24]
cannot find symbol
symbol  : class XMLReader
location: class org.apache.maven.archiva.repository.project.readers.ProjectModel400Reader

/home/continuum/data/working-directory/667/src/main/java/org/apache/maven/archiva/repository/project/readers/ProjectModel400Reader.java:[511,15]
cannot find symbol
symbol  : class XMLException
location: class org.apache.maven.archiva.repository.project.readers.ProjectModel400Reader

/home/continuum/data/working-directory/667/src/main/java/org/apache/maven/archiva/repository/project/readers/ProjectModel300Reader.java:[35,36]
package org.apache.maven.archiva.xml does not exist

/home/continuum/data/working-directory/667/src/main/java/org/apache/maven/archiva/repository/project/readers/ProjectModel300Reader.java:[36,36]
package org.apache.maven.archiva.xml does not exist

/home/continuum/data/working-directory/667/src/main/java/org/apache/maven/archiva/repository/project/readers/ProjectModel300Reader.java:[136,62]
cannot find symbol
symbol  : class XMLReader
location: class org.apache.maven.archiva.repository.project.readers.ProjectModel300Reader

/home/continuum/data/working-directory/667/src/main/java/org/apache/maven/archiva/repository/project/readers/ProjectModel300Reader.java:[137,15]
cannot find symbol
symbol  : class XMLException
location: class org.apache.maven.archiva.repository.project.readers.ProjectModel300Reader

/home/continuum/data/working-directory/667/src/main/java/org/apache/maven/archiva/repository/project/readers/ProjectModel300Reader.java:[152,46]
cannot find symbol
symbol  : class XMLReader
location: class org.apache.maven.archiva.repository.project.readers.ProjectModel300Reader

/home/continuum/data/working-directory/667/src/main/java/org/apache/maven/archiva/repository/project/readers/ProjectModel300Reader.java:[153,15]
cannot find symbol
symbol  : class XMLException
location: class org.apache.maven.archiva.repository.project.readers.ProjectModel300Reader

/home/continuum/data/working-directory/667/src/main/java/org/apache/maven/archiva/repository/project/readers/ProjectModel300Reader.java:[158,48]
cannot find symbol
symbol  : class XMLReader
location: class org.apache.maven.archiva.repository.project.readers.ProjectModel300Reader

/home/continuum/data/working-directory/667/src/main/java/org/apache/maven/archiva/repository/project/readers/ProjectModel300Reader.java:[159,15]
cannot find symbol
symbol  : class XMLException
location: class org.apache.maven.archiva.repository.project.readers.ProjectModel300Reader

/home/continuum/data/working-directory/667/src/main/java/org/apache/maven/archiva/repository/project/readers/ProjectModel300Reader.java:[208,45]
cannot find symbol
symbol  : class XMLReader
location: class org.apache.maven.archiva.repository.project.readers.ProjectModel300Reader

/home/continuum/data/working-directory/667/src/main/java/org/apache/maven/archiva/repository/project/readers/ProjectModel300Reader.java:[209,15]
cannot find symbol
symbol  : class XMLException
location: class org.apache.maven.archiva.repository.project.readers.ProjectModel300Reader

/home/continuum/data/working-directory/667/src/main/java/org/apache/maven/archiva/repository/project/readers/ProjectModel300Reader.java:[219,45]
cannot find symbol
symbol  : class XMLReader
location: class org.apache.maven.archiva.repository.project.readers.ProjectModel300Reader

/home/continuum/data/working-directory/667/src/main/java/org/apache/maven/archiva/repository/project/readers/ProjectModel300Reader.java:[220,15]
cannot find symbol
symbol  : class XMLException
location: class org.apache.maven.archiva.repository.project.readers.ProjectModel300Reader

/home/continuum/data/working-directory/667/src/main/java/org/apache/maven/archiva/repository/project/readers/ProjectModel300Reader.java:[267,48]
cannot find symbol
symbol  : class XMLReader
location: class org.apache.maven.archiva.repository.project.readers.ProjectModel300Reader

/home/continuum/data/working-directory/667/src/main/java/org/apache/maven/archiva/repository/project/readers/ProjectModel300Reader.java:[268,15]
cannot find symbol
symbol  : class XMLException
location: class org.apache.maven.archiva.repository.project.readers.ProjectModel300Reader

/home/continuum/data/working-directory/667/src/main/java/org/apache/maven/archiva/repository/project/readers/ProjectModel300Reader.java:[289,39]
cannot find symbol
symbol  : class XMLReader
location: class org.apache.maven.archiva.repository.project.readers.ProjectModel300Reader

/home/continuum/data/working-directory/667/src/main/java/org/apache/maven/archiva/repository/project/readers/ProjectModel300Reader.java:[290,15]
cannot find symbol
symbol  : class XMLException
location: class org.apache.maven.archiva.repository.project.readers.ProjectModel300Reader

/home/continuum/data/working-directory/667/src/main/java/org/apache/maven/archiva/repository/project/readers/ProjectModel300Reader.java:[316,47]
cannot find symbol
symbol  : class XMLReader
location: class org.apache.maven.archiva.repository.project.readers.ProjectModel300Reader

/home/continuum/data/working-directory/667/src/main/java/org/apache/maven/archiva/repository/project/readers/ProjectModel300Reader.java:[317,15]
cannot find symbol
symbol  : class XMLException
location: class org.apache.maven.archiva.repository.project.readers.ProjectModel300Reader

/home/continuum/data/working-directory/667/src/main/java/org/apache/maven/archiva/repository/project/readers/ProjectModel300Reader.java:[352,42]
cannot find symbol
symbol  : class XMLReader
location: class org.apache.maven.archiva.repository.project.readers.ProjectModel300Reader

/home/continuum/data/working-directory/667/src/main/java/org/apache/maven/archiva/repository/project/readers/ProjectModel300Reader.java:[353,15]
cannot find symbol
symbol  : class XMLException
location: class org.apache.maven.archiva.repository.project.readers.ProjectModel300Reader

/home/continuum/data/working-directory/667/src/main/java/org/apache/maven/archiva/repository/project/readers/ProjectModel300Reader.java:[389,48]
cannot find symbol
symbol  : class XMLReader
location: class org.apache.maven.archiva.repository.project.readers.ProjectModel300Reader

/home/continuum/data/working-directory/667/src/main/java/org/apache/maven/archiva/repository/project/readers/ProjectModel300Reader.java:[390,15]
cannot find symbol
symbol  : class XMLException
location: class org.apache.maven.archiva.repository.project.readers.ProjectModel300Reader

/home/continuum/data/working-directory/667/src/main/java/org/apache/maven/archiva/repository/project/readers/ProjectModel300Reader.java:[395,53]
cannot find symbol
symbol  : class XMLReader
location: class org.apache.maven.archiva.repository.project.readers.ProjectModel300Reader

/home/continuum/data/working-directory/667/src/main/java/org/apache/maven/archiva/repository/project/readers/ProjectModel300Reader.java:[396,15]
cannot find symbol
symbol  : class XMLException
location: class org.apache.maven.archiva.repository.project.readers.ProjectModel300Reader

/home/continuum/data/working-directory/667/src/main/java/org/apache/maven/archiva/repository/project/readers/ProjectModel300Reader.java:[405,24]
cannot find symbol
symbol  : class XMLReader
location: class org.apache.maven.archiva.repository.project.readers.ProjectModel300Reader

/home/continuum/data/working-directory/667/src/main/java/org/apache/maven/archiva/repository/project/readers/ProjectModel300Reader.java:[406,15]
cannot find symbol
symbol  : class XMLException
location: class org.apache.maven.archiva.repository.project.readers.ProjectModel300Reader

/home/continuum/data/working-directory/667/src/main/java/org/apache/maven/archiva/repository/project/writers/ProjectModel400Writer.java:[40,36]
package org.apache.maven.archiva.xml does not exist

/home/continuum/data/working-directory/667/src/main/java/org/apache/maven/archiva/repository/project/writers/ProjectModel400Writer.java:[41,36]
package org.apache.maven.archiva.xml does not exist

/home/continuum/data/working-directory/667/src/main/java/org/apache/maven/archiva/repository/metadata/RepositoryMetadataWriter.java:[27,36]
package org.apache.maven.archiva.xml does not exist

/home/continuum/data/working-directory/667/src/main/java/org/apache/maven/archiva/repository/metadata/RepositoryMetadataWriter.java:[28,36]
package org.apache.maven.archiva.xml does not exist

/home/continuum/data/working-directory/667/src/main/java/org/apache/maven/archiva/repository/metadata/RepositoryMetadataReader.java:[26,36]
package org.apache.maven.archiva.xml does not exist

/home/continuum/data/working-directory/667/src/main/java/org/apache/maven/archiva/repository/metadata/RepositoryMetadataReader.java:[27,36]
package org.apache.maven.archiva.xml does not exist

/home/continuum/data/working-directory/667/src/main/java/org/apache/maven/archiva/repository/scanner/RepositoryScannerInstance.java:[81,16]
cannot find symbol
symbol  : constructor RepositoryScanStatistics()
location: class org.apache.maven.archiva.repository.scanner.RepositoryScanStatistics

/home/continuum/data/working-directory/667/src/main/java/org/apache/maven/archiva/repository/scanner/RepositoryScannerInstance.java:[82,13]
cannot find symbol
symbol  : method setRepositoryId(java.lang.String)
location: class org.apache.maven.archiva.repository.scanner.RepositoryScanStatistics

/home/continuum/data/working-directory/667/src/main/java/org/apache/maven/archiva/repository/scanner/RepositoryScanStatistics.java:[54,8]
cannot find symbol
symbol  : method setDuration(long)
location: class org.apache.maven.archiva.repository.scanner.RepositoryScanStatistics

/home/continuum/data/working-directory/667/src/main/java/org/apache/maven/archiva/repository/scanner/RepositoryScanStatistics.java:[55,8]
cannot find symbol
symbol  : method setWhenGathered(java.util.Date)
location: class org.apache.maven.archiva.repository.scanner.RepositoryScanStatistics

/home/continuum/data/working-directory/667/src/main/java/org/apache/maven/archiva/repository/scanner/RepositoryScanStatistics.java:[60,21]
cannot find symbol
symbol  : method getTotalFileCount()
location: class org.apache.maven.archiva.repository.scanner.RepositoryScanStatistics

/home/continuum/data/working-directory/667/src/main/java/org/apache/maven/archiva/repository/scanner/RepositoryScanStatistics.java:[61,8]
cannot find symbol
symbol  : method setTotalFileCount(long)
location: class org.apache.maven.archiva.repository.scanner.RepositoryScanStatistics

/home/continuum/data/working-directory/667/src/main/java/org/apache/maven/archiva/repository/scanner/RepositoryScanStatistics.java:[66,21]
cannot find symbol
symbol  : method getNewFileCount()
location: class org.apache.maven.archiva.repository.scanner.RepositoryScanStatistics

/home/continuum/data/working-directory/667/src/main/java/org/apache/maven/archiva/repository/scanner/RepositoryScanStatistics.java:[67,8]
cannot find symbol
symbol  : method setNewFileCount(long)
location: class org.apache.maven.archiva.repository.scanner.RepositoryScanStatistics

/home/continuum/data/working-directory/667/src/main/java/org/apache/maven/archiva/repository/scanner/RepositoryScanStatistics.java:[84,47]
cannot find symbol
symbol  : variable this
location: class org.apache.maven.archiva.repository.scanner.RepositoryScanStatistics

/home/continuum/data/working-directory/667/src/main/java/org/apache/maven/archiva/repository/scanner/RepositoryScanStatistics.java:[120,80]
cannot find symbol
symbol  : variable this
location: class org.apache.maven.archiva.repository.scanner.RepositoryScanStatistics

/home/continuum/data/working-directory/667/src/main/java/org/apache/maven/archiva/repository/scanner/RepositoryScanStatistics.java:[122,13]
cannot find symbol
symbol  : variable this
location: class org.apache.maven.archiva.repository.scanner.RepositoryScanStatistics

/home/continuum/data/working-directory/667/src/main/java/org/apache/maven/archiva/repository/scanner/RepositoryScanStatistics.java:[128,35]
cannot find symbol
symbol  : variable this
location: class org.apache.maven.archiva.repository.scanner.RepositoryScanStatistics

/home/continuum/data/working-directory/667/src/main/java/org/apache/maven/archiva/repository/scanner/RepositoryScanStatistics.java:[131,57]
cannot find symbol
symbol  : variable this
location: class org.apache.maven.archiva.repository.scanner.RepositoryScanStatistics

/home/continuum/data/working-directory/667/src/main/java/org/apache/maven/archiva/repository/scanner/RepositoryScanStatistics.java:[135,13]
cannot find symbol
symbol  : method getTotalFileCount()
location: class org.apache.maven.archiva.repository.scanner.RepositoryScanStatistics

/home/continuum/data/working-directory/667/src/main/java/org/apache/maven/archiva/repository/scanner/RepositoryScanStatistics.java:[137,33]
cannot find symbol
symbol  : variable this
location: class org.apache.maven.archiva.repository.scanner.RepositoryScanStatistics

/home/continuum/data/working-directory/667/src/main/java/org/apache/maven/archiva/repository/scanner/RepositoryScanStatistics.java:[137,54]
cannot find symbol
symbol  : variable this
location: class org.apache.maven.archiva.repository.scanner.RepositoryScanStatistics

/home/continuum/data/working-directory/667/src/main/java/org/apache/maven/archiva/repository/project/readers/ProjectModel400Reader.java:[68,12]
cannot find symbol
symbol  : class XMLReader
location: class org.apache.maven.archiva.repository.project.readers.ProjectModel400Reader

/home/continuum/data/working-directory/667/src/main/java/org/apache/maven/archiva/repository/project/readers/ProjectModel400Reader.java:[68,32]
cannot find symbol
symbol  : class XMLReader
location: class org.apache.maven.archiva.repository.project.readers.ProjectModel400Reader

/home/continuum/data/working-directory/667/src/main/java/org/apache/maven/archiva/repository/project/readers/ProjectModel400Reader.java:[114,16]
cannot find symbol
symbol  : class XMLException
location: class org.apache.maven.archiva.repository.project.readers.ProjectModel400Reader

/home/continuum/data/working-directory/667/src/main/java/org/apache/maven/archiva/repository/project/readers/ProjectModel300Reader.java:[64,12]
cannot find symbol
symbol  : class XMLReader
location: class org.apache.maven.archiva.repository.project.readers.ProjectModel300Reader

/home/continuum/data/working-directory/667/src/main/java/org/apache/maven/archiva/repository/project/readers/ProjectModel300Reader.java:[64,32]
cannot find symbol
symbol  : class XMLReader
location: class org.apache.maven.archiva.repository.project.readers.ProjectModel300Reader

/home/continuum/data/working-directory/667/src/main/java/org/apache/maven/archiva/repository/project/readers/ProjectModel300Reader.java:[114,16]
cannot find symbol
symbol  : class XMLException
location: class org.apache.maven.archiva.repository.project.readers.ProjectModel300Reader

/home/continuum/data/working-directory/667/src/main/java/org/apache/maven/archiva/repository/project/writers/ProjectModel400Writer.java:[143,12]
cannot find symbol
symbol  : variable XMLWriter
location: class org.apache.maven.archiva.repository.project.writers.ProjectModel400Writer

/home/continuum/data/working-directory/667/src/main/java/org/apache/maven/archiva/repository/project/writers/ProjectModel400Writer.java:[145,16]
cannot find symbol
symbol  : class XMLException
location: class org.apache.maven.archiva.repository.project.writers.ProjectModel400Writer

/home/continuum/data/working-directory/667/src/main/java/org/apache/maven/archiva/repository/metadata/RepositoryMetadataWriter.java:[127,12]
cannot find symbol
symbol  : variable XMLWriter
location: class org.apache.maven.archiva.repository.metadata.RepositoryMetadataWriter

/home/continuum/data/working-directory/667/src/main/java/org/apache/maven/archiva/repository/metadata/RepositoryMetadataWriter.java:[129,16]
cannot find symbol
symbol  : class XMLException
location: class org.apache.maven.archiva.repository.metadata.RepositoryMetadataWriter

/home/continuum/data/working-directory/667/src/main/java/org/apache/maven/archiva/repository/metadata/RepositoryMetadataReader.java:[53,12]
cannot find symbol
symbol  : class XMLReader
location: class org.apache.maven.archiva.repository.metadata.RepositoryMetadataReader


[INFO] ------------------------------------------------------------------------
[INFO] For more information, run Maven with the -e switch
[INFO] ------------------------------------------------------------------------
[INFO] Total time: 12 seconds
[INFO] Finished at: Mon Apr 07 07:29:52 PDT 2008
[INFO] Final Memory: 14M/30M
[INFO] ------------------------------------------------------------------------

****************************************************************************



Mime
View raw message