maven-notifications mailing list archives

Site index · List index
Message view « Date » · « Thread »
Top « Date » · « Thread »
From Continuum VMBuild Server <contin...@apache.org>
Subject [continuum] BUILD FAILURE: Archiva Consumers :: Database Consumers
Date Tue, 15 Apr 2008 06:17:28 GMT
Online report : http://vmbuild.apache.org/continuum/buildResult.action?buildId=77298&projectId=661

Build statistics:
  State: Failed
  Previous State: Ok
  Started at: Mon 14 Apr 2008 23:16:44 -0700
  Finished at: Mon 14 Apr 2008 23:17:12 -0700
  Total time: 27s
  Build Trigger: Schedule
  Build Number: 35
  Exit code: 1
  Building machine hostname: vmbuild.apache.org
  Operating system : Linux(unknown)
  Java Home version : 
          java version "1.5.0_12"
          Java(TM) 2 Runtime Environment, Standard Edition (build 1.5.0_12-b04)
          Java HotSpot(TM) Client VM (build 1.5.0_12-b04, mixed mode, sharing)
        
  Builder version :
          Maven version: 2.0.8
          Java version: 1.5.0_12
          OS name: "linux" version: "2.6.20-16-server" arch: "i386" Family: "unix"
    
****************************************************************************
SCM Changes:
****************************************************************************
No files changed

****************************************************************************
Dependencies Changes:
****************************************************************************
org.apache.archiva:archiva-consumer-api:1.1-SNAPSHOT

org.apache.archiva:archiva-consumers:1.1-SNAPSHOT


****************************************************************************
Build Defintion:
****************************************************************************
POM filename: pom.xml
Goals: clean install   
Arguments: --batch-mode --non-recursive
Build Fresh: false
Always Build: false
Default Build Definition: true
Schedule: DEFAULT_SCHEDULE
Profile Name: Maven 2.0.8, Java 5
Description: 


****************************************************************************
Test Summary:
****************************************************************************
Tests: 7
Failures: 7
Total time: 7007

****************************************************************************
Output:
****************************************************************************
[INFO] Scanning for projects...
[INFO] ------------------------------------------------------------------------
[INFO] Building Archiva Consumers :: Database Consumers
[INFO]    task-segment: [clean, install]
[INFO] ------------------------------------------------------------------------
[INFO] [clean:clean]
[INFO] Deleting directory /home/continuum/data/working-directory/661/target
[WARNING] POM for 'jpox:jpox:pom:1.1.9:compile' is invalid. It will be ignored for artifact
resolution. Reason: Not a v4.0.0 POM. for project jpox:jpox at /home/continuum/.m2/repository/jpox/jpox/1.1.9/jpox-1.1.9.pom
[INFO] [enforcer:enforce {execution: default}]
[INFO] [plexus:descriptor {execution: generate}]
[WARNING] POM for 'jpox:jpox:pom:1.1.9:compile' is invalid. It will be ignored for artifact
resolution. Reason: Not a v4.0.0 POM. for project jpox:jpox at /home/continuum/.m2/repository/jpox/jpox/1.1.9/jpox-1.1.9.pom
[INFO] Setting property: classpath.resource.loader.class => 'org.codehaus.plexus.velocity.ContextClassLoaderResourceLoader'.
[INFO] Setting property: velocimacro.messages.on => 'false'.
[INFO] Setting property: resource.loader => 'classpath'.
[INFO] Setting property: resource.manager.logwhenfound => 'false'.
[INFO] [remote-resources:process {execution: default}]
[WARNING] Attempting to build MavenProject instance for Artifact (jpox:jpox:1.1.9) of type:
jar; constructing POM artifact instead.
[WARNING] Invalid project model for artifact [jpox:jpox:1.1.9]. It will be ignored by the
remote resources Mojo.
[INFO] [resources:resources]
[INFO] Using default encoding to copy filtered resources.
[WARNING] POM for 'jpox:jpox:pom:1.1.9:compile' is invalid. It will be ignored for artifact
resolution. Reason: Not a v4.0.0 POM. for project jpox:jpox at /home/continuum/.m2/repository/jpox/jpox/1.1.9/jpox-1.1.9.pom
[INFO] [compiler:compile]
[INFO] Compiling 6 source files to /home/continuum/data/working-directory/661/target/classes
[INFO] [resources:testResources]
[INFO] Using default encoding to copy filtered resources.
[WARNING] POM for 'jpox:jpox:pom:1.1.9:compile' is invalid. It will be ignored for artifact
resolution. Reason: Not a v4.0.0 POM. for project jpox:jpox at /home/continuum/.m2/repository/jpox/jpox/1.1.9/jpox-1.1.9.pom
[INFO] [compiler:testCompile]
[INFO] Compiling 4 source files to /home/continuum/data/working-directory/661/target/test-classes
[WARNING] POM for 'jpox:jpox:pom:1.1.9:compile' is invalid. It will be ignored for artifact
resolution. Reason: Not a v4.0.0 POM. for project jpox:jpox at /home/continuum/.m2/repository/jpox/jpox/1.1.9/jpox-1.1.9.pom
[INFO] [surefire:test]
[INFO] Surefire report directory: /home/continuum/data/working-directory/661/target/surefire-reports

-------------------------------------------------------
 T E S T S
-------------------------------------------------------
Running org.apache.maven.archiva.consumers.database.ArtifactUpdateDatabaseConsumerTest
log4j:WARN No appenders could be found for logger (org.codehaus.plexus.spring.PlexusClassPathXmlApplicationContext).
log4j:WARN Please initialize the log4j system properly.
Tests run: 2, Failures: 0, Errors: 2, Skipped: 0, Time elapsed: 3.545 sec <<< FAILURE!
Running org.apache.maven.archiva.consumers.database.DatabaseCleanupRemoveProjectConsumerTest
Tests run: 3, Failures: 0, Errors: 3, Skipped: 0, Time elapsed: 2.257 sec <<< FAILURE!
Running org.apache.maven.archiva.consumers.database.DatabaseCleanupRemoveArtifactConsumerTest
Tests run: 2, Failures: 0, Errors: 2, Skipped: 0, Time elapsed: 1.234 sec <<< FAILURE!

Results :

Tests in error: 
  testConsumption(org.apache.maven.archiva.consumers.database.ArtifactUpdateDatabaseConsumerTest)
  testConsumptionOfOtherMetadata(org.apache.maven.archiva.consumers.database.ArtifactUpdateDatabaseConsumerTest)
  testIfArtifactWasNotDeleted(org.apache.maven.archiva.consumers.database.DatabaseCleanupRemoveProjectConsumerTest)
  testIfArtifactWasDeleted(org.apache.maven.archiva.consumers.database.DatabaseCleanupRemoveProjectConsumerTest)
  testIfArtifactWasNotAPom(org.apache.maven.archiva.consumers.database.DatabaseCleanupRemoveProjectConsumerTest)
  testIfArtifactWasNotDeleted(org.apache.maven.archiva.consumers.database.DatabaseCleanupRemoveArtifactConsumerTest)
  testIfArtifactWasDeleted(org.apache.maven.archiva.consumers.database.DatabaseCleanupRemoveArtifactConsumerTest)

Tests run: 7, Failures: 0, Errors: 7, Skipped: 0

[INFO] ------------------------------------------------------------------------
[ERROR] BUILD FAILURE
[INFO] ------------------------------------------------------------------------
[INFO] There are test failures.

Please refer to /home/continuum/data/working-directory/661/target/surefire-reports for the
individual test results.
[INFO] ------------------------------------------------------------------------
[INFO] For more information, run Maven with the -e switch
[INFO] ------------------------------------------------------------------------
[INFO] Total time: 20 seconds
[INFO] Finished at: Mon Apr 14 23:17:12 PDT 2008
[INFO] Final Memory: 16M/31M
[INFO] ------------------------------------------------------------------------

****************************************************************************



Mime
View raw message