maven-notifications mailing list archives

Site index · List index
Message view « Date » · « Thread »
Top « Date » · « Thread »
From Continuum VMBuild Server <contin...@apache.org>
Subject [continuum] BUILD SUCCESSFUL: Archiva Base :: Repository Converter
Date Mon, 14 Apr 2008 18:05:32 GMT
Online report : http://vmbuild.apache.org/continuum/buildResult.action?buildId=76955&projectId=672

Build statistics:
  State: Ok
  Previous State: Failed
  Started at: Mon 14 Apr 2008 11:04:44 -0700
  Finished at: Mon 14 Apr 2008 11:05:14 -0700
  Total time: 29s
  Build Trigger: Schedule
  Build Number: 29
  Exit code: 0
  Building machine hostname: vmbuild.apache.org
  Operating system : Linux(unknown)
  Java Home version : 
          java version "1.5.0_12"
          Java(TM) 2 Runtime Environment, Standard Edition (build 1.5.0_12-b04)
          Java HotSpot(TM) Client VM (build 1.5.0_12-b04, mixed mode, sharing)
        
  Builder version :
          Maven version: 2.0.8
          Java version: 1.5.0_12
          OS name: "linux" version: "2.6.20-16-server" arch: "i386" Family: "unix"
    
****************************************************************************
SCM Changes:
****************************************************************************
No files changed

****************************************************************************
Dependencies Changes:
****************************************************************************
org.apache.archiva:archiva-consumer-api:1.1-SNAPSHOT

org.apache.archiva:archiva-artifact-converter:1.1-SNAPSHOT

org.apache.archiva:archiva-repository-layer:1.1-SNAPSHOT

org.apache.archiva:archiva-base:1.1-SNAPSHOT


****************************************************************************
Build Defintion:
****************************************************************************
POM filename: pom.xml
Goals: clean install   
Arguments: --batch-mode --non-recursive
Build Fresh: false
Always Build: false
Default Build Definition: true
Schedule: DEFAULT_SCHEDULE
Profile Name: Maven 2.0.8, Java 5
Description: 


****************************************************************************
Test Summary:
****************************************************************************
Tests: 1
Failures: 0
Total time: 3821

****************************************************************************
Output:
****************************************************************************
[INFO] Scanning for projects...
[INFO] ------------------------------------------------------------------------
[INFO] Building Archiva Base :: Repository Converter
[INFO]    task-segment: [clean, install]
[INFO] ------------------------------------------------------------------------
[INFO] [clean:clean]
[INFO] [enforcer:enforce {execution: default}]
[INFO] [plexus:descriptor {execution: generate}]
[INFO] Setting property: classpath.resource.loader.class => 'org.codehaus.plexus.velocity.ContextClassLoaderResourceLoader'.
[INFO] Setting property: velocimacro.messages.on => 'false'.
[INFO] Setting property: resource.loader => 'classpath'.
[INFO] Setting property: resource.manager.logwhenfound => 'false'.
[INFO] [remote-resources:process {execution: default}]
[INFO] [resources:resources]
[INFO] Using default encoding to copy filtered resources.
[INFO] [compiler:compile]
[INFO] Compiling 4 source files to /home/continuum/data/working-directory/672/target/classes
[INFO] [resources:testResources]
[INFO] Using default encoding to copy filtered resources.
[INFO] [compiler:testCompile]
[INFO] Compiling 1 source file to /home/continuum/data/working-directory/672/target/test-classes
[INFO] [surefire:test]
[INFO] Surefire report directory: /home/continuum/data/working-directory/672/target/surefire-reports

-------------------------------------------------------
 T E S T S
-------------------------------------------------------
Running org.apache.maven.archiva.converter.RepositoryConverterTest
0    [main] WARN  org.codehaus.plexus.spring.PlexusLifecycleBeanPostProcessor  - No loggerManager set in context. Falling back to ConsoleLoggerManager
18   [main] WARN  net.sf.ehcache.config.ConfigurationFactory  - No configuration found. Configuring ehcache from ehcache-failsafe.xml  found in the classpath: jar:file:/home/continuum/.m2/repository/net/sf/ehcache/ehcache/1.3.0/ehcache-1.3.0.jar!/ehcache-failsafe.xml
807  [main] WARN  org.apache.maven.archiva.converter.legacy.LegacyConverterArtifactConsumer  - Unable to convert artifact: test/jars/incorrectSha1Artifact-1.0.0.jar : Not enough parts to the path [test/jars/incorrectSha1Artifact-1.0.0.jar] to construct an ArchivaArtifact from. (Requires at least 4 parts)
org.apache.maven.archiva.repository.layout.LayoutException: Not enough parts to the path [test/jars/incorrectSha1Artifact-1.0.0.jar] to construct an ArchivaArtifact from. (Requires at least 4 parts)
	at org.apache.maven.archiva.repository.content.DefaultPathParser.toArtifactReference(DefaultPathParser.java:66)
	at org.apache.maven.archiva.repository.content.AbstractDefaultRepositoryContent.toArtifactReference(AbstractDefaultRepositoryContent.java:51)
	at org.apache.maven.archiva.repository.content.ManagedDefaultRepositoryContent.toArtifactReference(ManagedDefaultRepositoryContent.java:323)
	at org.apache.maven.archiva.converter.legacy.LegacyConverterArtifactConsumer.processFile(LegacyConverterArtifactConsumer.java:111)
	at org.apache.maven.archiva.repository.scanner.functors.ConsumerProcessFileClosure.execute(ConsumerProcessFileClosure.java:51)
	at org.apache.commons.collections.functors.IfClosure.execute(IfClosure.java:117)
	at org.apache.commons.collections.CollectionUtils.forAllDo(CollectionUtils.java:388)
	at org.apache.maven.archiva.repository.scanner.RepositoryScannerInstance.directoryWalkStep(RepositoryScannerInstance.java:140)
	at org.codehaus.plexus.util.DirectoryWalker.fireStep(DirectoryWalker.java:174)
	at org.codehaus.plexus.util.DirectoryWalker.scanDir(DirectoryWalker.java:392)
	at org.codehaus.plexus.util.DirectoryWalker.scanDir(DirectoryWalker.java:386)
	at org.codehaus.plexus.util.DirectoryWalker.scanDir(DirectoryWalker.java:386)
	at org.codehaus.plexus.util.DirectoryWalker.scan(DirectoryWalker.java:345)
	at org.apache.maven.archiva.repository.scanner.DefaultRepositoryScanner.scan(DefaultRepositoryScanner.java:139)
	at org.apache.maven.archiva.converter.legacy.DefaultLegacyRepositoryConverter.convertLegacyRepository(DefaultLegacyRepositoryConverter.java:96)
	at org.apache.maven.archiva.converter.RepositoryConverterTest.testLegacyConversion(RepositoryConverterTest.java:151)
	at sun.reflect.NativeMethodAccessorImpl.invoke0(Native Method)
	at sun.reflect.NativeMethodAccessorImpl.invoke(NativeMethodAccessorImpl.java:39)
	at sun.reflect.DelegatingMethodAccessorImpl.invoke(DelegatingMethodAccessorImpl.java:25)
	at java.lang.reflect.Method.invoke(Method.java:585)
	at junit.framework.TestCase.runTest(TestCase.java:154)
	at junit.framework.TestCase.runBare(TestCase.java:127)
	at junit.framework.TestResult$1.protect(TestResult.java:106)
	at junit.framework.TestResult.runProtected(TestResult.java:124)
	at junit.framework.TestResult.run(TestResult.java:109)
	at junit.framework.TestCase.run(TestCase.java:118)
	at junit.framework.TestSuite.runTest(TestSuite.java:208)
	at junit.framework.TestSuite.run(TestSuite.java:203)
	at sun.reflect.NativeMethodAccessorImpl.invoke0(Native Method)
	at sun.reflect.NativeMethodAccessorImpl.invoke(NativeMethodAccessorImpl.java:39)
	at sun.reflect.DelegatingMethodAccessorImpl.invoke(DelegatingMethodAccessorImpl.java:25)
	at java.lang.reflect.Method.invoke(Method.java:585)
	at org.apache.maven.surefire.junit.JUnitTestSet.execute(JUnitTestSet.java:213)
	at org.apache.maven.surefire.suite.AbstractDirectoryTestSuite.executeTestSet(AbstractDirectoryTestSuite.java:140)
	at org.apache.maven.surefire.suite.AbstractDirectoryTestSuite.execute(AbstractDirectoryTestSuite.java:127)
	at org.apache.maven.surefire.Surefire.run(Surefire.java:177)
	at sun.reflect.NativeMethodAccessorImpl.invoke0(Native Method)
	at sun.reflect.NativeMethodAccessorImpl.invoke(NativeMethodAccessorImpl.java:39)
	at sun.reflect.DelegatingMethodAccessorImpl.invoke(DelegatingMethodAccessorImpl.java:25)
	at java.lang.reflect.Method.invoke(Method.java:585)
	at org.apache.maven.surefire.booter.SurefireBooter.runSuitesInProcess(SurefireBooter.java:338)
	at org.apache.maven.surefire.booter.SurefireBooter.main(SurefireBooter.java:997)
810  [main] WARN  org.apache.maven.archiva.converter.legacy.LegacyConverterArtifactConsumer  - Unable to convert artifact: test/jars/v3artifact-1.0.0-SNAPSHOT.jar : Not enough parts to the path [test/jars/v3artifact-1.0.0-SNAPSHOT.jar] to construct an ArchivaArtifact from. (Requires at least 4 parts)
org.apache.maven.archiva.repository.layout.LayoutException: Not enough parts to the path [test/jars/v3artifact-1.0.0-SNAPSHOT.jar] to construct an ArchivaArtifact from. (Requires at least 4 parts)
	at org.apache.maven.archiva.repository.content.DefaultPathParser.toArtifactReference(DefaultPathParser.java:66)
	at org.apache.maven.archiva.repository.content.AbstractDefaultRepositoryContent.toArtifactReference(AbstractDefaultRepositoryContent.java:51)
	at org.apache.maven.archiva.repository.content.ManagedDefaultRepositoryContent.toArtifactReference(ManagedDefaultRepositoryContent.java:323)
	at org.apache.maven.archiva.converter.legacy.LegacyConverterArtifactConsumer.processFile(LegacyConverterArtifactConsumer.java:111)
	at org.apache.maven.archiva.repository.scanner.functors.ConsumerProcessFileClosure.execute(ConsumerProcessFileClosure.java:51)
	at org.apache.commons.collections.functors.IfClosure.execute(IfClosure.java:117)
	at org.apache.commons.collections.CollectionUtils.forAllDo(CollectionUtils.java:388)
	at org.apache.maven.archiva.repository.scanner.RepositoryScannerInstance.directoryWalkStep(RepositoryScannerInstance.java:140)
	at org.codehaus.plexus.util.DirectoryWalker.fireStep(DirectoryWalker.java:174)
	at org.codehaus.plexus.util.DirectoryWalker.scanDir(DirectoryWalker.java:392)
	at org.codehaus.plexus.util.DirectoryWalker.scanDir(DirectoryWalker.java:386)
	at org.codehaus.plexus.util.DirectoryWalker.scanDir(DirectoryWalker.java:386)
	at org.codehaus.plexus.util.DirectoryWalker.scan(DirectoryWalker.java:345)
	at org.apache.maven.archiva.repository.scanner.DefaultRepositoryScanner.scan(DefaultRepositoryScanner.java:139)
	at org.apache.maven.archiva.converter.legacy.DefaultLegacyRepositoryConverter.convertLegacyRepository(DefaultLegacyRepositoryConverter.java:96)
	at org.apache.maven.archiva.converter.RepositoryConverterTest.testLegacyConversion(RepositoryConverterTest.java:151)
	at sun.reflect.NativeMethodAccessorImpl.invoke0(Native Method)
	at sun.reflect.NativeMethodAccessorImpl.invoke(NativeMethodAccessorImpl.java:39)
	at sun.reflect.DelegatingMethodAccessorImpl.invoke(DelegatingMethodAccessorImpl.java:25)
	at java.lang.reflect.Method.invoke(Method.java:585)
	at junit.framework.TestCase.runTest(TestCase.java:154)
	at junit.framework.TestCase.runBare(TestCase.java:127)
	at junit.framework.TestResult$1.protect(TestResult.java:106)
	at junit.framework.TestResult.runProtected(TestResult.java:124)
	at junit.framework.TestResult.run(TestResult.java:109)
	at junit.framework.TestCase.run(TestCase.java:118)
	at junit.framework.TestSuite.runTest(TestSuite.java:208)
	at junit.framework.TestSuite.run(TestSuite.java:203)
	at sun.reflect.NativeMethodAccessorImpl.invoke0(Native Method)
	at sun.reflect.NativeMethodAccessorImpl.invoke(NativeMethodAccessorImpl.java:39)
	at sun.reflect.DelegatingMethodAccessorImpl.invoke(DelegatingMethodAccessorImpl.java:25)
	at java.lang.reflect.Method.invoke(Method.java:585)
	at org.apache.maven.surefire.junit.JUnitTestSet.execute(JUnitTestSet.java:213)
	at org.apache.maven.surefire.suite.AbstractDirectoryTestSuite.executeTestSet(AbstractDirectoryTestSuite.java:140)
	at org.apache.maven.surefire.suite.AbstractDirectoryTestSuite.execute(AbstractDirectoryTestSuite.java:127)
	at org.apache.maven.surefire.Surefire.run(Surefire.java:177)
	at sun.reflect.NativeMethodAccessorImpl.invoke0(Native Method)
	at sun.reflect.NativeMethodAccessorImpl.invoke(NativeMethodAccessorImpl.java:39)
	at sun.reflect.DelegatingMethodAccessorImpl.invoke(DelegatingMethodAccessorImpl.java:25)
	at java.lang.reflect.Method.invoke(Method.java:585)
	at org.apache.maven.surefire.booter.SurefireBooter.runSuitesInProcess(SurefireBooter.java:338)
	at org.apache.maven.surefire.booter.SurefireBooter.main(SurefireBooter.java:997)
812  [main] WARN  org.apache.maven.archiva.converter.legacy.LegacyConverterArtifactConsumer  - Unable to convert artifact: test/jars/v4artifact-1.0.0-SNAPSHOT.jar : Not enough parts to the path [test/jars/v4artifact-1.0.0-SNAPSHOT.jar] to construct an ArchivaArtifact from. (Requires at least 4 parts)
org.apache.maven.archiva.repository.layout.LayoutException: Not enough parts to the path [test/jars/v4artifact-1.0.0-SNAPSHOT.jar] to construct an ArchivaArtifact from. (Requires at least 4 parts)
	at org.apache.maven.archiva.repository.content.DefaultPathParser.toArtifactReference(DefaultPathParser.java:66)
	at org.apache.maven.archiva.repository.content.AbstractDefaultRepositoryContent.toArtifactReference(AbstractDefaultRepositoryContent.java:51)
	at org.apache.maven.archiva.repository.content.ManagedDefaultRepositoryContent.toArtifactReference(ManagedDefaultRepositoryContent.java:323)
	at org.apache.maven.archiva.converter.legacy.LegacyConverterArtifactConsumer.processFile(LegacyConverterArtifactConsumer.java:111)
	at org.apache.maven.archiva.repository.scanner.functors.ConsumerProcessFileClosure.execute(ConsumerProcessFileClosure.java:51)
	at org.apache.commons.collections.functors.IfClosure.execute(IfClosure.java:117)
	at org.apache.commons.collections.CollectionUtils.forAllDo(CollectionUtils.java:388)
	at org.apache.maven.archiva.repository.scanner.RepositoryScannerInstance.directoryWalkStep(RepositoryScannerInstance.java:140)
	at org.codehaus.plexus.util.DirectoryWalker.fireStep(DirectoryWalker.java:174)
	at org.codehaus.plexus.util.DirectoryWalker.scanDir(DirectoryWalker.java:392)
	at org.codehaus.plexus.util.DirectoryWalker.scanDir(DirectoryWalker.java:386)
	at org.codehaus.plexus.util.DirectoryWalker.scanDir(DirectoryWalker.java:386)
	at org.codehaus.plexus.util.DirectoryWalker.scan(DirectoryWalker.java:345)
	at org.apache.maven.archiva.repository.scanner.DefaultRepositoryScanner.scan(DefaultRepositoryScanner.java:139)
	at org.apache.maven.archiva.converter.legacy.DefaultLegacyRepositoryConverter.convertLegacyRepository(DefaultLegacyRepositoryConverter.java:96)
	at org.apache.maven.archiva.converter.RepositoryConverterTest.testLegacyConversion(RepositoryConverterTest.java:151)
	at sun.reflect.NativeMethodAccessorImpl.invoke0(Native Method)
	at sun.reflect.NativeMethodAccessorImpl.invoke(NativeMethodAccessorImpl.java:39)
	at sun.reflect.DelegatingMethodAccessorImpl.invoke(DelegatingMethodAccessorImpl.java:25)
	at java.lang.reflect.Method.invoke(Method.java:585)
	at junit.framework.TestCase.runTest(TestCase.java:154)
	at junit.framework.TestCase.runBare(TestCase.java:127)
	at junit.framework.TestResult$1.protect(TestResult.java:106)
	at junit.framework.TestResult.runProtected(TestResult.java:124)
	at junit.framework.TestResult.run(TestResult.java:109)
	at junit.framework.TestCase.run(TestCase.java:118)
	at junit.framework.TestSuite.runTest(TestSuite.java:208)
	at junit.framework.TestSuite.run(TestSuite.java:203)
	at sun.reflect.NativeMethodAccessorImpl.invoke0(Native Method)
	at sun.reflect.NativeMethodAccessorImpl.invoke(NativeMethodAccessorImpl.java:39)
	at sun.reflect.DelegatingMethodAccessorImpl.invoke(DelegatingMethodAccessorImpl.java:25)
	at java.lang.reflect.Method.invoke(Method.java:585)
	at org.apache.maven.surefire.junit.JUnitTestSet.execute(JUnitTestSet.java:213)
	at org.apache.maven.surefire.suite.AbstractDirectoryTestSuite.executeTestSet(AbstractDirectoryTestSuite.java:140)
	at org.apache.maven.surefire.suite.AbstractDirectoryTestSuite.execute(AbstractDirectoryTestSuite.java:127)
	at org.apache.maven.surefire.Surefire.run(Surefire.java:177)
	at sun.reflect.NativeMethodAccessorImpl.invoke0(Native Method)
	at sun.reflect.NativeMethodAccessorImpl.invoke(NativeMethodAccessorImpl.java:39)
	at sun.reflect.DelegatingMethodAccessorImpl.invoke(DelegatingMethodAccessorImpl.java:25)
	at java.lang.reflect.Method.invoke(Method.java:585)
	at org.apache.maven.surefire.booter.SurefireBooter.runSuitesInProcess(SurefireBooter.java:338)
	at org.apache.maven.surefire.booter.SurefireBooter.main(SurefireBooter.java:997)
813  [main] WARN  org.apache.maven.archiva.converter.legacy.LegacyConverterArtifactConsumer  - Unable to convert artifact: test/jars/artifact-two-1.0.0.jar : Not enough parts to the path [test/jars/artifact-two-1.0.0.jar] to construct an ArchivaArtifact from. (Requires at least 4 parts)
org.apache.maven.archiva.repository.layout.LayoutException: Not enough parts to the path [test/jars/artifact-two-1.0.0.jar] to construct an ArchivaArtifact from. (Requires at least 4 parts)
	at org.apache.maven.archiva.repository.content.DefaultPathParser.toArtifactReference(DefaultPathParser.java:66)
	at org.apache.maven.archiva.repository.content.AbstractDefaultRepositoryContent.toArtifactReference(AbstractDefaultRepositoryContent.java:51)
	at org.apache.maven.archiva.repository.content.ManagedDefaultRepositoryContent.toArtifactReference(ManagedDefaultRepositoryContent.java:323)
	at org.apache.maven.archiva.converter.legacy.LegacyConverterArtifactConsumer.processFile(LegacyConverterArtifactConsumer.java:111)
	at org.apache.maven.archiva.repository.scanner.functors.ConsumerProcessFileClosure.execute(ConsumerProcessFileClosure.java:51)
	at org.apache.commons.collections.functors.IfClosure.execute(IfClosure.java:117)
	at org.apache.commons.collections.CollectionUtils.forAllDo(CollectionUtils.java:388)
	at org.apache.maven.archiva.repository.scanner.RepositoryScannerInstance.directoryWalkStep(RepositoryScannerInstance.java:140)
	at org.codehaus.plexus.util.DirectoryWalker.fireStep(DirectoryWalker.java:174)
	at org.codehaus.plexus.util.DirectoryWalker.scanDir(DirectoryWalker.java:392)
	at org.codehaus.plexus.util.DirectoryWalker.scanDir(DirectoryWalker.java:386)
	at org.codehaus.plexus.util.DirectoryWalker.scanDir(DirectoryWalker.java:386)
	at org.codehaus.plexus.util.DirectoryWalker.scan(DirectoryWalker.java:345)
	at org.apache.maven.archiva.repository.scanner.DefaultRepositoryScanner.scan(DefaultRepositoryScanner.java:139)
	at org.apache.maven.archiva.converter.legacy.DefaultLegacyRepositoryConverter.convertLegacyRepository(DefaultLegacyRepositoryConverter.java:96)
	at org.apache.maven.archiva.converter.RepositoryConverterTest.testLegacyConversion(RepositoryConverterTest.java:151)
	at sun.reflect.NativeMethodAccessorImpl.invoke0(Native Method)
	at sun.reflect.NativeMethodAccessorImpl.invoke(NativeMethodAccessorImpl.java:39)
	at sun.reflect.DelegatingMethodAccessorImpl.invoke(DelegatingMethodAccessorImpl.java:25)
	at java.lang.reflect.Method.invoke(Method.java:585)
	at junit.framework.TestCase.runTest(TestCase.java:154)
	at junit.framework.TestCase.runBare(TestCase.java:127)
	at junit.framework.TestResult$1.protect(TestResult.java:106)
	at junit.framework.TestResult.runProtected(TestResult.java:124)
	at junit.framework.TestResult.run(TestResult.java:109)
	at junit.framework.TestCase.run(TestCase.java:118)
	at junit.framework.TestSuite.runTest(TestSuite.java:208)
	at junit.framework.TestSuite.run(TestSuite.java:203)
	at sun.reflect.NativeMethodAccessorImpl.invoke0(Native Method)
	at sun.reflect.NativeMethodAccessorImpl.invoke(NativeMethodAccessorImpl.java:39)
	at sun.reflect.DelegatingMethodAccessorImpl.invoke(DelegatingMethodAccessorImpl.java:25)
	at java.lang.reflect.Method.invoke(Method.java:585)
	at org.apache.maven.surefire.junit.JUnitTestSet.execute(JUnitTestSet.java:213)
	at org.apache.maven.surefire.suite.AbstractDirectoryTestSuite.executeTestSet(AbstractDirectoryTestSuite.java:140)
	at org.apache.maven.surefire.suite.AbstractDirectoryTestSuite.execute(AbstractDirectoryTestSuite.java:127)
	at org.apache.maven.surefire.Surefire.run(Surefire.java:177)
	at sun.reflect.NativeMethodAccessorImpl.invoke0(Native Method)
	at sun.reflect.NativeMethodAccessorImpl.invoke(NativeMethodAccessorImpl.java:39)
	at sun.reflect.DelegatingMethodAccessorImpl.invoke(DelegatingMethodAccessorImpl.java:25)
	at java.lang.reflect.Method.invoke(Method.java:585)
	at org.apache.maven.surefire.booter.SurefireBooter.runSuitesInProcess(SurefireBooter.java:338)
	at org.apache.maven.surefire.booter.SurefireBooter.main(SurefireBooter.java:997)
817  [main] WARN  org.apache.maven.archiva.converter.legacy.LegacyConverterArtifactConsumer  - Unable to convert artifact: test/jars/artifact-one-1.0.0.jar : Not enough parts to the path [test/jars/artifact-one-1.0.0.jar] to construct an ArchivaArtifact from. (Requires at least 4 parts)
org.apache.maven.archiva.repository.layout.LayoutException: Not enough parts to the path [test/jars/artifact-one-1.0.0.jar] to construct an ArchivaArtifact from. (Requires at least 4 parts)
	at org.apache.maven.archiva.repository.content.DefaultPathParser.toArtifactReference(DefaultPathParser.java:66)
	at org.apache.maven.archiva.repository.content.AbstractDefaultRepositoryContent.toArtifactReference(AbstractDefaultRepositoryContent.java:51)
	at org.apache.maven.archiva.repository.content.ManagedDefaultRepositoryContent.toArtifactReference(ManagedDefaultRepositoryContent.java:323)
	at org.apache.maven.archiva.converter.legacy.LegacyConverterArtifactConsumer.processFile(LegacyConverterArtifactConsumer.java:111)
	at org.apache.maven.archiva.repository.scanner.functors.ConsumerProcessFileClosure.execute(ConsumerProcessFileClosure.java:51)
	at org.apache.commons.collections.functors.IfClosure.execute(IfClosure.java:117)
	at org.apache.commons.collections.CollectionUtils.forAllDo(CollectionUtils.java:388)
	at org.apache.maven.archiva.repository.scanner.RepositoryScannerInstance.directoryWalkStep(RepositoryScannerInstance.java:140)
	at org.codehaus.plexus.util.DirectoryWalker.fireStep(DirectoryWalker.java:174)
	at org.codehaus.plexus.util.DirectoryWalker.scanDir(DirectoryWalker.java:392)
	at org.codehaus.plexus.util.DirectoryWalker.scanDir(DirectoryWalker.java:386)
	at org.codehaus.plexus.util.DirectoryWalker.scanDir(DirectoryWalker.java:386)
	at org.codehaus.plexus.util.DirectoryWalker.scan(DirectoryWalker.java:345)
	at org.apache.maven.archiva.repository.scanner.DefaultRepositoryScanner.scan(DefaultRepositoryScanner.java:139)
	at org.apache.maven.archiva.converter.legacy.DefaultLegacyRepositoryConverter.convertLegacyRepository(DefaultLegacyRepositoryConverter.java:96)
	at org.apache.maven.archiva.converter.RepositoryConverterTest.testLegacyConversion(RepositoryConverterTest.java:151)
	at sun.reflect.NativeMethodAccessorImpl.invoke0(Native Method)
	at sun.reflect.NativeMethodAccessorImpl.invoke(NativeMethodAccessorImpl.java:39)
	at sun.reflect.DelegatingMethodAccessorImpl.invoke(DelegatingMethodAccessorImpl.java:25)
	at java.lang.reflect.Method.invoke(Method.java:585)
	at junit.framework.TestCase.runTest(TestCase.java:154)
	at junit.framework.TestCase.runBare(TestCase.java:127)
	at junit.framework.TestResult$1.protect(TestResult.java:106)
	at junit.framework.TestResult.runProtected(TestResult.java:124)
	at junit.framework.TestResult.run(TestResult.java:109)
	at junit.framework.TestCase.run(TestCase.java:118)
	at junit.framework.TestSuite.runTest(TestSuite.java:208)
	at junit.framework.TestSuite.run(TestSuite.java:203)
	at sun.reflect.NativeMethodAccessorImpl.invoke0(Native Method)
	at sun.reflect.NativeMethodAccessorImpl.invoke(NativeMethodAccessorImpl.java:39)
	at sun.reflect.DelegatingMethodAccessorImpl.invoke(DelegatingMethodAccessorImpl.java:25)
	at java.lang.reflect.Method.invoke(Method.java:585)
	at org.apache.maven.surefire.junit.JUnitTestSet.execute(JUnitTestSet.java:213)
	at org.apache.maven.surefire.suite.AbstractDirectoryTestSuite.executeTestSet(AbstractDirectoryTestSuite.java:140)
	at org.apache.maven.surefire.suite.AbstractDirectoryTestSuite.execute(AbstractDirectoryTestSuite.java:127)
	at org.apache.maven.surefire.Surefire.run(Surefire.java:177)
	at sun.reflect.NativeMethodAccessorImpl.invoke0(Native Method)
	at sun.reflect.NativeMethodAccessorImpl.invoke(NativeMethodAccessorImpl.java:39)
	at sun.reflect.DelegatingMethodAccessorImpl.invoke(DelegatingMethodAccessorImpl.java:25)
	at java.lang.reflect.Method.invoke(Method.java:585)
	at org.apache.maven.surefire.booter.SurefireBooter.runSuitesInProcess(SurefireBooter.java:338)
	at org.apache.maven.surefire.booter.SurefireBooter.main(SurefireBooter.java:997)
819  [main] WARN  org.apache.maven.archiva.converter.legacy.LegacyConverterArtifactConsumer  - Unable to convert artifact: test/jars/newversion-artifact-1.0.1.jar : Not enough parts to the path [test/jars/newversion-artifact-1.0.1.jar] to construct an ArchivaArtifact from. (Requires at least 4 parts)
org.apache.maven.archiva.repository.layout.LayoutException: Not enough parts to the path [test/jars/newversion-artifact-1.0.1.jar] to construct an ArchivaArtifact from. (Requires at least 4 parts)
	at org.apache.maven.archiva.repository.content.DefaultPathParser.toArtifactReference(DefaultPathParser.java:66)
	at org.apache.maven.archiva.repository.content.AbstractDefaultRepositoryContent.toArtifactReference(AbstractDefaultRepositoryContent.java:51)
	at org.apache.maven.archiva.repository.content.ManagedDefaultRepositoryContent.toArtifactReference(ManagedDefaultRepositoryContent.java:323)
	at org.apache.maven.archiva.converter.legacy.LegacyConverterArtifactConsumer.processFile(LegacyConverterArtifactConsumer.java:111)
	at org.apache.maven.archiva.repository.scanner.functors.ConsumerProcessFileClosure.execute(ConsumerProcessFileClosure.java:51)
	at org.apache.commons.collections.functors.IfClosure.execute(IfClosure.java:117)
	at org.apache.commons.collections.CollectionUtils.forAllDo(CollectionUtils.java:388)
	at org.apache.maven.archiva.repository.scanner.RepositoryScannerInstance.directoryWalkStep(RepositoryScannerInstance.java:140)
	at org.codehaus.plexus.util.DirectoryWalker.fireStep(DirectoryWalker.java:174)
	at org.codehaus.plexus.util.DirectoryWalker.scanDir(DirectoryWalker.java:392)
	at org.codehaus.plexus.util.DirectoryWalker.scanDir(DirectoryWalker.java:386)
	at org.codehaus.plexus.util.DirectoryWalker.scanDir(DirectoryWalker.java:386)
	at org.codehaus.plexus.util.DirectoryWalker.scan(DirectoryWalker.java:345)
	at org.apache.maven.archiva.repository.scanner.DefaultRepositoryScanner.scan(DefaultRepositoryScanner.java:139)
	at org.apache.maven.archiva.converter.legacy.DefaultLegacyRepositoryConverter.convertLegacyRepository(DefaultLegacyRepositoryConverter.java:96)
	at org.apache.maven.archiva.converter.RepositoryConverterTest.testLegacyConversion(RepositoryConverterTest.java:151)
	at sun.reflect.NativeMethodAccessorImpl.invoke0(Native Method)
	at sun.reflect.NativeMethodAccessorImpl.invoke(NativeMethodAccessorImpl.java:39)
	at sun.reflect.DelegatingMethodAccessorImpl.invoke(DelegatingMethodAccessorImpl.java:25)
	at java.lang.reflect.Method.invoke(Method.java:585)
	at junit.framework.TestCase.runTest(TestCase.java:154)
	at junit.framework.TestCase.runBare(TestCase.java:127)
	at junit.framework.TestResult$1.protect(TestResult.java:106)
	at junit.framework.TestResult.runProtected(TestResult.java:124)
	at junit.framework.TestResult.run(TestResult.java:109)
	at junit.framework.TestCase.run(TestCase.java:118)
	at junit.framework.TestSuite.runTest(TestSuite.java:208)
	at junit.framework.TestSuite.run(TestSuite.java:203)
	at sun.reflect.NativeMethodAccessorImpl.invoke0(Native Method)
	at sun.reflect.NativeMethodAccessorImpl.invoke(NativeMethodAccessorImpl.java:39)
	at sun.reflect.DelegatingMethodAccessorImpl.invoke(DelegatingMethodAccessorImpl.java:25)
	at java.lang.reflect.Method.invoke(Method.java:585)
	at org.apache.maven.surefire.junit.JUnitTestSet.execute(JUnitTestSet.java:213)
	at org.apache.maven.surefire.suite.AbstractDirectoryTestSuite.executeTestSet(AbstractDirectoryTestSuite.java:140)
	at org.apache.maven.surefire.suite.AbstractDirectoryTestSuite.execute(AbstractDirectoryTestSuite.java:127)
	at org.apache.maven.surefire.Surefire.run(Surefire.java:177)
	at sun.reflect.NativeMethodAccessorImpl.invoke0(Native Method)
	at sun.reflect.NativeMethodAccessorImpl.invoke(NativeMethodAccessorImpl.java:39)
	at sun.reflect.DelegatingMethodAccessorImpl.invoke(DelegatingMethodAccessorImpl.java:25)
	at java.lang.reflect.Method.invoke(Method.java:585)
	at org.apache.maven.surefire.booter.SurefireBooter.runSuitesInProcess(SurefireBooter.java:338)
	at org.apache.maven.surefire.booter.SurefireBooter.main(SurefireBooter.java:997)
820  [main] WARN  org.apache.maven.archiva.converter.legacy.LegacyConverterArtifactConsumer  - Unable to convert artifact: test/jars/artifact-three-1.0.0.jar : Not enough parts to the path [test/jars/artifact-three-1.0.0.jar] to construct an ArchivaArtifact from. (Requires at least 4 parts)
org.apache.maven.archiva.repository.layout.LayoutException: Not enough parts to the path [test/jars/artifact-three-1.0.0.jar] to construct an ArchivaArtifact from. (Requires at least 4 parts)
	at org.apache.maven.archiva.repository.content.DefaultPathParser.toArtifactReference(DefaultPathParser.java:66)
	at org.apache.maven.archiva.repository.content.AbstractDefaultRepositoryContent.toArtifactReference(AbstractDefaultRepositoryContent.java:51)
	at org.apache.maven.archiva.repository.content.ManagedDefaultRepositoryContent.toArtifactReference(ManagedDefaultRepositoryContent.java:323)
	at org.apache.maven.archiva.converter.legacy.LegacyConverterArtifactConsumer.processFile(LegacyConverterArtifactConsumer.java:111)
	at org.apache.maven.archiva.repository.scanner.functors.ConsumerProcessFileClosure.execute(ConsumerProcessFileClosure.java:51)
	at org.apache.commons.collections.functors.IfClosure.execute(IfClosure.java:117)
	at org.apache.commons.collections.CollectionUtils.forAllDo(CollectionUtils.java:388)
	at org.apache.maven.archiva.repository.scanner.RepositoryScannerInstance.directoryWalkStep(RepositoryScannerInstance.java:140)
	at org.codehaus.plexus.util.DirectoryWalker.fireStep(DirectoryWalker.java:174)
	at org.codehaus.plexus.util.DirectoryWalker.scanDir(DirectoryWalker.java:392)
	at org.codehaus.plexus.util.DirectoryWalker.scanDir(DirectoryWalker.java:386)
	at org.codehaus.plexus.util.DirectoryWalker.scanDir(DirectoryWalker.java:386)
	at org.codehaus.plexus.util.DirectoryWalker.scan(DirectoryWalker.java:345)
	at org.apache.maven.archiva.repository.scanner.DefaultRepositoryScanner.scan(DefaultRepositoryScanner.java:139)
	at org.apache.maven.archiva.converter.legacy.DefaultLegacyRepositoryConverter.convertLegacyRepository(DefaultLegacyRepositoryConverter.java:96)
	at org.apache.maven.archiva.converter.RepositoryConverterTest.testLegacyConversion(RepositoryConverterTest.java:151)
	at sun.reflect.NativeMethodAccessorImpl.invoke0(Native Method)
	at sun.reflect.NativeMethodAccessorImpl.invoke(NativeMethodAccessorImpl.java:39)
	at sun.reflect.DelegatingMethodAccessorImpl.invoke(DelegatingMethodAccessorImpl.java:25)
	at java.lang.reflect.Method.invoke(Method.java:585)
	at junit.framework.TestCase.runTest(TestCase.java:154)
	at junit.framework.TestCase.runBare(TestCase.java:127)
	at junit.framework.TestResult$1.protect(TestResult.java:106)
	at junit.framework.TestResult.runProtected(TestResult.java:124)
	at junit.framework.TestResult.run(TestResult.java:109)
	at junit.framework.TestCase.run(TestCase.java:118)
	at junit.framework.TestSuite.runTest(TestSuite.java:208)
	at junit.framework.TestSuite.run(TestSuite.java:203)
	at sun.reflect.NativeMethodAccessorImpl.invoke0(Native Method)
	at sun.reflect.NativeMethodAccessorImpl.invoke(NativeMethodAccessorImpl.java:39)
	at sun.reflect.DelegatingMethodAccessorImpl.invoke(DelegatingMethodAccessorImpl.java:25)
	at java.lang.reflect.Method.invoke(Method.java:585)
	at org.apache.maven.surefire.junit.JUnitTestSet.execute(JUnitTestSet.java:213)
	at org.apache.maven.surefire.suite.AbstractDirectoryTestSuite.executeTestSet(AbstractDirectoryTestSuite.java:140)
	at org.apache.maven.surefire.suite.AbstractDirectoryTestSuite.execute(AbstractDirectoryTestSuite.java:127)
	at org.apache.maven.surefire.Surefire.run(Surefire.java:177)
	at sun.reflect.NativeMethodAccessorImpl.invoke0(Native Method)
	at sun.reflect.NativeMethodAccessorImpl.invoke(NativeMethodAccessorImpl.java:39)
	at sun.reflect.DelegatingMethodAccessorImpl.invoke(DelegatingMethodAccessorImpl.java:25)
	at java.lang.reflect.Method.invoke(Method.java:585)
	at org.apache.maven.surefire.booter.SurefireBooter.runSuitesInProcess(SurefireBooter.java:338)
	at org.apache.maven.surefire.booter.SurefireBooter.main(SurefireBooter.java:997)
821  [main] WARN  org.apache.maven.archiva.converter.legacy.LegacyConverterArtifactConsumer  - Unable to convert artifact: test/jars/dryrun-artifact-1.0.0.jar : Not enough parts to the path [test/jars/dryrun-artifact-1.0.0.jar] to construct an ArchivaArtifact from. (Requires at least 4 parts)
org.apache.maven.archiva.repository.layout.LayoutException: Not enough parts to the path [test/jars/dryrun-artifact-1.0.0.jar] to construct an ArchivaArtifact from. (Requires at least 4 parts)
	at org.apache.maven.archiva.repository.content.DefaultPathParser.toArtifactReference(DefaultPathParser.java:66)
	at org.apache.maven.archiva.repository.content.AbstractDefaultRepositoryContent.toArtifactReference(AbstractDefaultRepositoryContent.java:51)
	at org.apache.maven.archiva.repository.content.ManagedDefaultRepositoryContent.toArtifactReference(ManagedDefaultRepositoryContent.java:323)
	at org.apache.maven.archiva.converter.legacy.LegacyConverterArtifactConsumer.processFile(LegacyConverterArtifactConsumer.java:111)
	at org.apache.maven.archiva.repository.scanner.functors.ConsumerProcessFileClosure.execute(ConsumerProcessFileClosure.java:51)
	at org.apache.commons.collections.functors.IfClosure.execute(IfClosure.java:117)
	at org.apache.commons.collections.CollectionUtils.forAllDo(CollectionUtils.java:388)
	at org.apache.maven.archiva.repository.scanner.RepositoryScannerInstance.directoryWalkStep(RepositoryScannerInstance.java:140)
	at org.codehaus.plexus.util.DirectoryWalker.fireStep(DirectoryWalker.java:174)
	at org.codehaus.plexus.util.DirectoryWalker.scanDir(DirectoryWalker.java:392)
	at org.codehaus.plexus.util.DirectoryWalker.scanDir(DirectoryWalker.java:386)
	at org.codehaus.plexus.util.DirectoryWalker.scanDir(DirectoryWalker.java:386)
	at org.codehaus.plexus.util.DirectoryWalker.scan(DirectoryWalker.java:345)
	at org.apache.maven.archiva.repository.scanner.DefaultRepositoryScanner.scan(DefaultRepositoryScanner.java:139)
	at org.apache.maven.archiva.converter.legacy.DefaultLegacyRepositoryConverter.convertLegacyRepository(DefaultLegacyRepositoryConverter.java:96)
	at org.apache.maven.archiva.converter.RepositoryConverterTest.testLegacyConversion(RepositoryConverterTest.java:151)
	at sun.reflect.NativeMethodAccessorImpl.invoke0(Native Method)
	at sun.reflect.NativeMethodAccessorImpl.invoke(NativeMethodAccessorImpl.java:39)
	at sun.reflect.DelegatingMethodAccessorImpl.invoke(DelegatingMethodAccessorImpl.java:25)
	at java.lang.reflect.Method.invoke(Method.java:585)
	at junit.framework.TestCase.runTest(TestCase.java:154)
	at junit.framework.TestCase.runBare(TestCase.java:127)
	at junit.framework.TestResult$1.protect(TestResult.java:106)
	at junit.framework.TestResult.runProtected(TestResult.java:124)
	at junit.framework.TestResult.run(TestResult.java:109)
	at junit.framework.TestCase.run(TestCase.java:118)
	at junit.framework.TestSuite.runTest(TestSuite.java:208)
	at junit.framework.TestSuite.run(TestSuite.java:203)
	at sun.reflect.NativeMethodAccessorImpl.invoke0(Native Method)
	at sun.reflect.NativeMethodAccessorImpl.invoke(NativeMethodAccessorImpl.java:39)
	at sun.reflect.DelegatingMethodAccessorImpl.invoke(DelegatingMethodAccessorImpl.java:25)
	at java.lang.reflect.Method.invoke(Method.java:585)
	at org.apache.maven.surefire.junit.JUnitTestSet.execute(JUnitTestSet.java:213)
	at org.apache.maven.surefire.suite.AbstractDirectoryTestSuite.executeTestSet(AbstractDirectoryTestSuite.java:140)
	at org.apache.maven.surefire.suite.AbstractDirectoryTestSuite.execute(AbstractDirectoryTestSuite.java:127)
	at org.apache.maven.surefire.Surefire.run(Surefire.java:177)
	at sun.reflect.NativeMethodAccessorImpl.invoke0(Native Method)
	at sun.reflect.NativeMethodAccessorImpl.invoke(NativeMethodAccessorImpl.java:39)
	at sun.reflect.DelegatingMethodAccessorImpl.invoke(DelegatingMethodAccessorImpl.java:25)
	at java.lang.reflect.Method.invoke(Method.java:585)
	at org.apache.maven.surefire.booter.SurefireBooter.runSuitesInProcess(SurefireBooter.java:338)
	at org.apache.maven.surefire.booter.SurefireBooter.main(SurefireBooter.java:997)
823  [main] WARN  org.apache.maven.archiva.converter.legacy.LegacyConverterArtifactConsumer  - Unable to convert artifact: test/jars/modified-artifact-1.0.0.jar : Not enough parts to the path [test/jars/modified-artifact-1.0.0.jar] to construct an ArchivaArtifact from. (Requires at least 4 parts)
org.apache.maven.archiva.repository.layout.LayoutException: Not enough parts to the path [test/jars/modified-artifact-1.0.0.jar] to construct an ArchivaArtifact from. (Requires at least 4 parts)
	at org.apache.maven.archiva.repository.content.DefaultPathParser.toArtifactReference(DefaultPathParser.java:66)
	at org.apache.maven.archiva.repository.content.AbstractDefaultRepositoryContent.toArtifactReference(AbstractDefaultRepositoryContent.java:51)
	at org.apache.maven.archiva.repository.content.ManagedDefaultRepositoryContent.toArtifactReference(ManagedDefaultRepositoryContent.java:323)
	at org.apache.maven.archiva.converter.legacy.LegacyConverterArtifactConsumer.processFile(LegacyConverterArtifactConsumer.java:111)
	at org.apache.maven.archiva.repository.scanner.functors.ConsumerProcessFileClosure.execute(ConsumerProcessFileClosure.java:51)
	at org.apache.commons.collections.functors.IfClosure.execute(IfClosure.java:117)
	at org.apache.commons.collections.CollectionUtils.forAllDo(CollectionUtils.java:388)
	at org.apache.maven.archiva.repository.scanner.RepositoryScannerInstance.directoryWalkStep(RepositoryScannerInstance.java:140)
	at org.codehaus.plexus.util.DirectoryWalker.fireStep(DirectoryWalker.java:174)
	at org.codehaus.plexus.util.DirectoryWalker.scanDir(DirectoryWalker.java:392)
	at org.codehaus.plexus.util.DirectoryWalker.scanDir(DirectoryWalker.java:386)
	at org.codehaus.plexus.util.DirectoryWalker.scanDir(DirectoryWalker.java:386)
	at org.codehaus.plexus.util.DirectoryWalker.scan(DirectoryWalker.java:345)
	at org.apache.maven.archiva.repository.scanner.DefaultRepositoryScanner.scan(DefaultRepositoryScanner.java:139)
	at org.apache.maven.archiva.converter.legacy.DefaultLegacyRepositoryConverter.convertLegacyRepository(DefaultLegacyRepositoryConverter.java:96)
	at org.apache.maven.archiva.converter.RepositoryConverterTest.testLegacyConversion(RepositoryConverterTest.java:151)
	at sun.reflect.NativeMethodAccessorImpl.invoke0(Native Method)
	at sun.reflect.NativeMethodAccessorImpl.invoke(NativeMethodAccessorImpl.java:39)
	at sun.reflect.DelegatingMethodAccessorImpl.invoke(DelegatingMethodAccessorImpl.java:25)
	at java.lang.reflect.Method.invoke(Method.java:585)
	at junit.framework.TestCase.runTest(TestCase.java:154)
	at junit.framework.TestCase.runBare(TestCase.java:127)
	at junit.framework.TestResult$1.protect(TestResult.java:106)
	at junit.framework.TestResult.runProtected(TestResult.java:124)
	at junit.framework.TestResult.run(TestResult.java:109)
	at junit.framework.TestCase.run(TestCase.java:118)
	at junit.framework.TestSuite.runTest(TestSuite.java:208)
	at junit.framework.TestSuite.run(TestSuite.java:203)
	at sun.reflect.NativeMethodAccessorImpl.invoke0(Native Method)
	at sun.reflect.NativeMethodAccessorImpl.invoke(NativeMethodAccessorImpl.java:39)
	at sun.reflect.DelegatingMethodAccessorImpl.invoke(DelegatingMethodAccessorImpl.java:25)
	at java.lang.reflect.Method.invoke(Method.java:585)
	at org.apache.maven.surefire.junit.JUnitTestSet.execute(JUnitTestSet.java:213)
	at org.apache.maven.surefire.suite.AbstractDirectoryTestSuite.executeTestSet(AbstractDirectoryTestSuite.java:140)
	at org.apache.maven.surefire.suite.AbstractDirectoryTestSuite.execute(AbstractDirectoryTestSuite.java:127)
	at org.apache.maven.surefire.Surefire.run(Surefire.java:177)
	at sun.reflect.NativeMethodAccessorImpl.invoke0(Native Method)
	at sun.reflect.NativeMethodAccessorImpl.invoke(NativeMethodAccessorImpl.java:39)
	at sun.reflect.DelegatingMethodAccessorImpl.invoke(DelegatingMethodAccessorImpl.java:25)
	at java.lang.reflect.Method.invoke(Method.java:585)
	at org.apache.maven.surefire.booter.SurefireBooter.runSuitesInProcess(SurefireBooter.java:338)
	at org.apache.maven.surefire.booter.SurefireBooter.main(SurefireBooter.java:997)
826  [main] WARN  org.apache.maven.archiva.converter.legacy.LegacyConverterArtifactConsumer  - Unable to convert artifact: test/jars/incorrectMd5Artifact-1.0.0.jar : Not enough parts to the path [test/jars/incorrectMd5Artifact-1.0.0.jar] to construct an ArchivaArtifact from. (Requires at least 4 parts)
org.apache.maven.archiva.repository.layout.LayoutException: Not enough parts to the path [test/jars/incorrectMd5Artifact-1.0.0.jar] to construct an ArchivaArtifact from. (Requires at least 4 parts)
	at org.apache.maven.archiva.repository.content.DefaultPathParser.toArtifactReference(DefaultPathParser.java:66)
	at org.apache.maven.archiva.repository.content.AbstractDefaultRepositoryContent.toArtifactReference(AbstractDefaultRepositoryContent.java:51)
	at org.apache.maven.archiva.repository.content.ManagedDefaultRepositoryContent.toArtifactReference(ManagedDefaultRepositoryContent.java:323)
	at org.apache.maven.archiva.converter.legacy.LegacyConverterArtifactConsumer.processFile(LegacyConverterArtifactConsumer.java:111)
	at org.apache.maven.archiva.repository.scanner.functors.ConsumerProcessFileClosure.execute(ConsumerProcessFileClosure.java:51)
	at org.apache.commons.collections.functors.IfClosure.execute(IfClosure.java:117)
	at org.apache.commons.collections.CollectionUtils.forAllDo(CollectionUtils.java:388)
	at org.apache.maven.archiva.repository.scanner.RepositoryScannerInstance.directoryWalkStep(RepositoryScannerInstance.java:140)
	at org.codehaus.plexus.util.DirectoryWalker.fireStep(DirectoryWalker.java:174)
	at org.codehaus.plexus.util.DirectoryWalker.scanDir(DirectoryWalker.java:392)
	at org.codehaus.plexus.util.DirectoryWalker.scanDir(DirectoryWalker.java:386)
	at org.codehaus.plexus.util.DirectoryWalker.scanDir(DirectoryWalker.java:386)
	at org.codehaus.plexus.util.DirectoryWalker.scan(DirectoryWalker.java:345)
	at org.apache.maven.archiva.repository.scanner.DefaultRepositoryScanner.scan(DefaultRepositoryScanner.java:139)
	at org.apache.maven.archiva.converter.legacy.DefaultLegacyRepositoryConverter.convertLegacyRepository(DefaultLegacyRepositoryConverter.java:96)
	at org.apache.maven.archiva.converter.RepositoryConverterTest.testLegacyConversion(RepositoryConverterTest.java:151)
	at sun.reflect.NativeMethodAccessorImpl.invoke0(Native Method)
	at sun.reflect.NativeMethodAccessorImpl.invoke(NativeMethodAccessorImpl.java:39)
	at sun.reflect.DelegatingMethodAccessorImpl.invoke(DelegatingMethodAccessorImpl.java:25)
	at java.lang.reflect.Method.invoke(Method.java:585)
	at junit.framework.TestCase.runTest(TestCase.java:154)
	at junit.framework.TestCase.runBare(TestCase.java:127)
	at junit.framework.TestResult$1.protect(TestResult.java:106)
	at junit.framework.TestResult.runProtected(TestResult.java:124)
	at junit.framework.TestResult.run(TestResult.java:109)
	at junit.framework.TestCase.run(TestCase.java:118)
	at junit.framework.TestSuite.runTest(TestSuite.java:208)
	at junit.framework.TestSuite.run(TestSuite.java:203)
	at sun.reflect.NativeMethodAccessorImpl.invoke0(Native Method)
	at sun.reflect.NativeMethodAccessorImpl.invoke(NativeMethodAccessorImpl.java:39)
	at sun.reflect.DelegatingMethodAccessorImpl.invoke(DelegatingMethodAccessorImpl.java:25)
	at java.lang.reflect.Method.invoke(Method.java:585)
	at org.apache.maven.surefire.junit.JUnitTestSet.execute(JUnitTestSet.java:213)
	at org.apache.maven.surefire.suite.AbstractDirectoryTestSuite.executeTestSet(AbstractDirectoryTestSuite.java:140)
	at org.apache.maven.surefire.suite.AbstractDirectoryTestSuite.execute(AbstractDirectoryTestSuite.java:127)
	at org.apache.maven.surefire.Surefire.run(Surefire.java:177)
	at sun.reflect.NativeMethodAccessorImpl.invoke0(Native Method)
	at sun.reflect.NativeMethodAccessorImpl.invoke(NativeMethodAccessorImpl.java:39)
	at sun.reflect.DelegatingMethodAccessorImpl.invoke(DelegatingMethodAccessorImpl.java:25)
	at java.lang.reflect.Method.invoke(Method.java:585)
	at org.apache.maven.surefire.booter.SurefireBooter.runSuitesInProcess(SurefireBooter.java:338)
	at org.apache.maven.surefire.booter.SurefireBooter.main(SurefireBooter.java:997)
829  [main] WARN  org.apache.maven.archiva.converter.legacy.LegacyConverterArtifactConsumer  - Unable to convert artifact: test/jars/rollback-created-artifact-1.0.0.jar : Not enough parts to the path [test/jars/rollback-created-artifact-1.0.0.jar] to construct an ArchivaArtifact from. (Requires at least 4 parts)
org.apache.maven.archiva.repository.layout.LayoutException: Not enough parts to the path [test/jars/rollback-created-artifact-1.0.0.jar] to construct an ArchivaArtifact from. (Requires at least 4 parts)
	at org.apache.maven.archiva.repository.content.DefaultPathParser.toArtifactReference(DefaultPathParser.java:66)
	at org.apache.maven.archiva.repository.content.AbstractDefaultRepositoryContent.toArtifactReference(AbstractDefaultRepositoryContent.java:51)
	at org.apache.maven.archiva.repository.content.ManagedDefaultRepositoryContent.toArtifactReference(ManagedDefaultRepositoryContent.java:323)
	at org.apache.maven.archiva.converter.legacy.LegacyConverterArtifactConsumer.processFile(LegacyConverterArtifactConsumer.java:111)
	at org.apache.maven.archiva.repository.scanner.functors.ConsumerProcessFileClosure.execute(ConsumerProcessFileClosure.java:51)
	at org.apache.commons.collections.functors.IfClosure.execute(IfClosure.java:117)
	at org.apache.commons.collections.CollectionUtils.forAllDo(CollectionUtils.java:388)
	at org.apache.maven.archiva.repository.scanner.RepositoryScannerInstance.directoryWalkStep(RepositoryScannerInstance.java:140)
	at org.codehaus.plexus.util.DirectoryWalker.fireStep(DirectoryWalker.java:174)
	at org.codehaus.plexus.util.DirectoryWalker.scanDir(DirectoryWalker.java:392)
	at org.codehaus.plexus.util.DirectoryWalker.scanDir(DirectoryWalker.java:386)
	at org.codehaus.plexus.util.DirectoryWalker.scanDir(DirectoryWalker.java:386)
	at org.codehaus.plexus.util.DirectoryWalker.scan(DirectoryWalker.java:345)
	at org.apache.maven.archiva.repository.scanner.DefaultRepositoryScanner.scan(DefaultRepositoryScanner.java:139)
	at org.apache.maven.archiva.converter.legacy.DefaultLegacyRepositoryConverter.convertLegacyRepository(DefaultLegacyRepositoryConverter.java:96)
	at org.apache.maven.archiva.converter.RepositoryConverterTest.testLegacyConversion(RepositoryConverterTest.java:151)
	at sun.reflect.NativeMethodAccessorImpl.invoke0(Native Method)
	at sun.reflect.NativeMethodAccessorImpl.invoke(NativeMethodAccessorImpl.java:39)
	at sun.reflect.DelegatingMethodAccessorImpl.invoke(DelegatingMethodAccessorImpl.java:25)
	at java.lang.reflect.Method.invoke(Method.java:585)
	at junit.framework.TestCase.runTest(TestCase.java:154)
	at junit.framework.TestCase.runBare(TestCase.java:127)
	at junit.framework.TestResult$1.protect(TestResult.java:106)
	at junit.framework.TestResult.runProtected(TestResult.java:124)
	at junit.framework.TestResult.run(TestResult.java:109)
	at junit.framework.TestCase.run(TestCase.java:118)
	at junit.framework.TestSuite.runTest(TestSuite.java:208)
	at junit.framework.TestSuite.run(TestSuite.java:203)
	at sun.reflect.NativeMethodAccessorImpl.invoke0(Native Method)
	at sun.reflect.NativeMethodAccessorImpl.invoke(NativeMethodAccessorImpl.java:39)
	at sun.reflect.DelegatingMethodAccessorImpl.invoke(DelegatingMethodAccessorImpl.java:25)
	at java.lang.reflect.Method.invoke(Method.java:585)
	at org.apache.maven.surefire.junit.JUnitTestSet.execute(JUnitTestSet.java:213)
	at org.apache.maven.surefire.suite.AbstractDirectoryTestSuite.executeTestSet(AbstractDirectoryTestSuite.java:140)
	at org.apache.maven.surefire.suite.AbstractDirectoryTestSuite.execute(AbstractDirectoryTestSuite.java:127)
	at org.apache.maven.surefire.Surefire.run(Surefire.java:177)
	at sun.reflect.NativeMethodAccessorImpl.invoke0(Native Method)
	at sun.reflect.NativeMethodAccessorImpl.invoke(NativeMethodAccessorImpl.java:39)
	at sun.reflect.DelegatingMethodAccessorImpl.invoke(DelegatingMethodAccessorImpl.java:25)
	at java.lang.reflect.Method.invoke(Method.java:585)
	at org.apache.maven.surefire.booter.SurefireBooter.runSuitesInProcess(SurefireBooter.java:338)
	at org.apache.maven.surefire.booter.SurefireBooter.main(SurefireBooter.java:997)
834  [main] WARN  org.apache.maven.archiva.converter.legacy.LegacyConverterArtifactConsumer  - Unable to convert artifact: test/jars/v4artifact-1.0.0-20060111.120115-1.jar : Not enough parts to the path [test/jars/v4artifact-1.0.0-20060111.120115-1.jar] to construct an ArchivaArtifact from. (Requires at least 4 parts)
org.apache.maven.archiva.repository.layout.LayoutException: Not enough parts to the path [test/jars/v4artifact-1.0.0-20060111.120115-1.jar] to construct an ArchivaArtifact from. (Requires at least 4 parts)
	at org.apache.maven.archiva.repository.content.DefaultPathParser.toArtifactReference(DefaultPathParser.java:66)
	at org.apache.maven.archiva.repository.content.AbstractDefaultRepositoryContent.toArtifactReference(AbstractDefaultRepositoryContent.java:51)
	at org.apache.maven.archiva.repository.content.ManagedDefaultRepositoryContent.toArtifactReference(ManagedDefaultRepositoryContent.java:323)
	at org.apache.maven.archiva.converter.legacy.LegacyConverterArtifactConsumer.processFile(LegacyConverterArtifactConsumer.java:111)
	at org.apache.maven.archiva.repository.scanner.functors.ConsumerProcessFileClosure.execute(ConsumerProcessFileClosure.java:51)
	at org.apache.commons.collections.functors.IfClosure.execute(IfClosure.java:117)
	at org.apache.commons.collections.CollectionUtils.forAllDo(CollectionUtils.java:388)
	at org.apache.maven.archiva.repository.scanner.RepositoryScannerInstance.directoryWalkStep(RepositoryScannerInstance.java:140)
	at org.codehaus.plexus.util.DirectoryWalker.fireStep(DirectoryWalker.java:174)
	at org.codehaus.plexus.util.DirectoryWalker.scanDir(DirectoryWalker.java:392)
	at org.codehaus.plexus.util.DirectoryWalker.scanDir(DirectoryWalker.java:386)
	at org.codehaus.plexus.util.DirectoryWalker.scanDir(DirectoryWalker.java:386)
	at org.codehaus.plexus.util.DirectoryWalker.scan(DirectoryWalker.java:345)
	at org.apache.maven.archiva.repository.scanner.DefaultRepositoryScanner.scan(DefaultRepositoryScanner.java:139)
	at org.apache.maven.archiva.converter.legacy.DefaultLegacyRepositoryConverter.convertLegacyRepository(DefaultLegacyRepositoryConverter.java:96)
	at org.apache.maven.archiva.converter.RepositoryConverterTest.testLegacyConversion(RepositoryConverterTest.java:151)
	at sun.reflect.NativeMethodAccessorImpl.invoke0(Native Method)
	at sun.reflect.NativeMethodAccessorImpl.invoke(NativeMethodAccessorImpl.java:39)
	at sun.reflect.DelegatingMethodAccessorImpl.invoke(DelegatingMethodAccessorImpl.java:25)
	at java.lang.reflect.Method.invoke(Method.java:585)
	at junit.framework.TestCase.runTest(TestCase.java:154)
	at junit.framework.TestCase.runBare(TestCase.java:127)
	at junit.framework.TestResult$1.protect(TestResult.java:106)
	at junit.framework.TestResult.runProtected(TestResult.java:124)
	at junit.framework.TestResult.run(TestResult.java:109)
	at junit.framework.TestCase.run(TestCase.java:118)
	at junit.framework.TestSuite.runTest(TestSuite.java:208)
	at junit.framework.TestSuite.run(TestSuite.java:203)
	at sun.reflect.NativeMethodAccessorImpl.invoke0(Native Method)
	at sun.reflect.NativeMethodAccessorImpl.invoke(NativeMethodAccessorImpl.java:39)
	at sun.reflect.DelegatingMethodAccessorImpl.invoke(DelegatingMethodAccessorImpl.java:25)
	at java.lang.reflect.Method.invoke(Method.java:585)
	at org.apache.maven.surefire.junit.JUnitTestSet.execute(JUnitTestSet.java:213)
	at org.apache.maven.surefire.suite.AbstractDirectoryTestSuite.executeTestSet(AbstractDirectoryTestSuite.java:140)
	at org.apache.maven.surefire.suite.AbstractDirectoryTestSuite.execute(AbstractDirectoryTestSuite.java:127)
	at org.apache.maven.surefire.Surefire.run(Surefire.java:177)
	at sun.reflect.NativeMethodAccessorImpl.invoke0(Native Method)
	at sun.reflect.NativeMethodAccessorImpl.invoke(NativeMethodAccessorImpl.java:39)
	at sun.reflect.DelegatingMethodAccessorImpl.invoke(DelegatingMethodAccessorImpl.java:25)
	at java.lang.reflect.Method.invoke(Method.java:585)
	at org.apache.maven.surefire.booter.SurefireBooter.runSuitesInProcess(SurefireBooter.java:338)
	at org.apache.maven.surefire.booter.SurefireBooter.main(SurefireBooter.java:997)
837  [main] WARN  org.apache.maven.archiva.converter.legacy.LegacyConverterArtifactConsumer  - Unable to convert artifact: test/jars/relocated-v3artifact-1.0.0.jar : Not enough parts to the path [test/jars/relocated-v3artifact-1.0.0.jar] to construct an ArchivaArtifact from. (Requires at least 4 parts)
org.apache.maven.archiva.repository.layout.LayoutException: Not enough parts to the path [test/jars/relocated-v3artifact-1.0.0.jar] to construct an ArchivaArtifact from. (Requires at least 4 parts)
	at org.apache.maven.archiva.repository.content.DefaultPathParser.toArtifactReference(DefaultPathParser.java:66)
	at org.apache.maven.archiva.repository.content.AbstractDefaultRepositoryContent.toArtifactReference(AbstractDefaultRepositoryContent.java:51)
	at org.apache.maven.archiva.repository.content.ManagedDefaultRepositoryContent.toArtifactReference(ManagedDefaultRepositoryContent.java:323)
	at org.apache.maven.archiva.converter.legacy.LegacyConverterArtifactConsumer.processFile(LegacyConverterArtifactConsumer.java:111)
	at org.apache.maven.archiva.repository.scanner.functors.ConsumerProcessFileClosure.execute(ConsumerProcessFileClosure.java:51)
	at org.apache.commons.collections.functors.IfClosure.execute(IfClosure.java:117)
	at org.apache.commons.collections.CollectionUtils.forAllDo(CollectionUtils.java:388)
	at org.apache.maven.archiva.repository.scanner.RepositoryScannerInstance.directoryWalkStep(RepositoryScannerInstance.java:140)
	at org.codehaus.plexus.util.DirectoryWalker.fireStep(DirectoryWalker.java:174)
	at org.codehaus.plexus.util.DirectoryWalker.scanDir(DirectoryWalker.java:392)
	at org.codehaus.plexus.util.DirectoryWalker.scanDir(DirectoryWalker.java:386)
	at org.codehaus.plexus.util.DirectoryWalker.scanDir(DirectoryWalker.java:386)
	at org.codehaus.plexus.util.DirectoryWalker.scan(DirectoryWalker.java:345)
	at org.apache.maven.archiva.repository.scanner.DefaultRepositoryScanner.scan(DefaultRepositoryScanner.java:139)
	at org.apache.maven.archiva.converter.legacy.DefaultLegacyRepositoryConverter.convertLegacyRepository(DefaultLegacyRepositoryConverter.java:96)
	at org.apache.maven.archiva.converter.RepositoryConverterTest.testLegacyConversion(RepositoryConverterTest.java:151)
	at sun.reflect.NativeMethodAccessorImpl.invoke0(Native Method)
	at sun.reflect.NativeMethodAccessorImpl.invoke(NativeMethodAccessorImpl.java:39)
	at sun.reflect.DelegatingMethodAccessorImpl.invoke(DelegatingMethodAccessorImpl.java:25)
	at java.lang.reflect.Method.invoke(Method.java:585)
	at junit.framework.TestCase.runTest(TestCase.java:154)
	at junit.framework.TestCase.runBare(TestCase.java:127)
	at junit.framework.TestResult$1.protect(TestResult.java:106)
	at junit.framework.TestResult.runProtected(TestResult.java:124)
	at junit.framework.TestResult.run(TestResult.java:109)
	at junit.framework.TestCase.run(TestCase.java:118)
	at junit.framework.TestSuite.runTest(TestSuite.java:208)
	at junit.framework.TestSuite.run(TestSuite.java:203)
	at sun.reflect.NativeMethodAccessorImpl.invoke0(Native Method)
	at sun.reflect.NativeMethodAccessorImpl.invoke(NativeMethodAccessorImpl.java:39)
	at sun.reflect.DelegatingMethodAccessorImpl.invoke(DelegatingMethodAccessorImpl.java:25)
	at java.lang.reflect.Method.invoke(Method.java:585)
	at org.apache.maven.surefire.junit.JUnitTestSet.execute(JUnitTestSet.java:213)
	at org.apache.maven.surefire.suite.AbstractDirectoryTestSuite.executeTestSet(AbstractDirectoryTestSuite.java:140)
	at org.apache.maven.surefire.suite.AbstractDirectoryTestSuite.execute(AbstractDirectoryTestSuite.java:127)
	at org.apache.maven.surefire.Surefire.run(Surefire.java:177)
	at sun.reflect.NativeMethodAccessorImpl.invoke0(Native Method)
	at sun.reflect.NativeMethodAccessorImpl.invoke(NativeMethodAccessorImpl.java:39)
	at sun.reflect.DelegatingMethodAccessorImpl.invoke(DelegatingMethodAccessorImpl.java:25)
	at java.lang.reflect.Method.invoke(Method.java:585)
	at org.apache.maven.surefire.booter.SurefireBooter.runSuitesInProcess(SurefireBooter.java:338)
	at org.apache.maven.surefire.booter.SurefireBooter.main(SurefireBooter.java:997)
838  [main] WARN  org.apache.maven.archiva.converter.legacy.LegacyConverterArtifactConsumer  - Unable to convert artifact: test/jars/existing-artifact-1.0.0.jar : Not enough parts to the path [test/jars/existing-artifact-1.0.0.jar] to construct an ArchivaArtifact from. (Requires at least 4 parts)
org.apache.maven.archiva.repository.layout.LayoutException: Not enough parts to the path [test/jars/existing-artifact-1.0.0.jar] to construct an ArchivaArtifact from. (Requires at least 4 parts)
	at org.apache.maven.archiva.repository.content.DefaultPathParser.toArtifactReference(DefaultPathParser.java:66)
	at org.apache.maven.archiva.repository.content.AbstractDefaultRepositoryContent.toArtifactReference(AbstractDefaultRepositoryContent.java:51)
	at org.apache.maven.archiva.repository.content.ManagedDefaultRepositoryContent.toArtifactReference(ManagedDefaultRepositoryContent.java:323)
	at org.apache.maven.archiva.converter.legacy.LegacyConverterArtifactConsumer.processFile(LegacyConverterArtifactConsumer.java:111)
	at org.apache.maven.archiva.repository.scanner.functors.ConsumerProcessFileClosure.execute(ConsumerProcessFileClosure.java:51)
	at org.apache.commons.collections.functors.IfClosure.execute(IfClosure.java:117)
	at org.apache.commons.collections.CollectionUtils.forAllDo(CollectionUtils.java:388)
	at org.apache.maven.archiva.repository.scanner.RepositoryScannerInstance.directoryWalkStep(RepositoryScannerInstance.java:140)
	at org.codehaus.plexus.util.DirectoryWalker.fireStep(DirectoryWalker.java:174)
	at org.codehaus.plexus.util.DirectoryWalker.scanDir(DirectoryWalker.java:392)
	at org.codehaus.plexus.util.DirectoryWalker.scanDir(DirectoryWalker.java:386)
	at org.codehaus.plexus.util.DirectoryWalker.scanDir(DirectoryWalker.java:386)
	at org.codehaus.plexus.util.DirectoryWalker.scan(DirectoryWalker.java:345)
	at org.apache.maven.archiva.repository.scanner.DefaultRepositoryScanner.scan(DefaultRepositoryScanner.java:139)
	at org.apache.maven.archiva.converter.legacy.DefaultLegacyRepositoryConverter.convertLegacyRepository(DefaultLegacyRepositoryConverter.java:96)
	at org.apache.maven.archiva.converter.RepositoryConverterTest.testLegacyConversion(RepositoryConverterTest.java:151)
	at sun.reflect.NativeMethodAccessorImpl.invoke0(Native Method)
	at sun.reflect.NativeMethodAccessorImpl.invoke(NativeMethodAccessorImpl.java:39)
	at sun.reflect.DelegatingMethodAccessorImpl.invoke(DelegatingMethodAccessorImpl.java:25)
	at java.lang.reflect.Method.invoke(Method.java:585)
	at junit.framework.TestCase.runTest(TestCase.java:154)
	at junit.framework.TestCase.runBare(TestCase.java:127)
	at junit.framework.TestResult$1.protect(TestResult.java:106)
	at junit.framework.TestResult.runProtected(TestResult.java:124)
	at junit.framework.TestResult.run(TestResult.java:109)
	at junit.framework.TestCase.run(TestCase.java:118)
	at junit.framework.TestSuite.runTest(TestSuite.java:208)
	at junit.framework.TestSuite.run(TestSuite.java:203)
	at sun.reflect.NativeMethodAccessorImpl.invoke0(Native Method)
	at sun.reflect.NativeMethodAccessorImpl.invoke(NativeMethodAccessorImpl.java:39)
	at sun.reflect.DelegatingMethodAccessorImpl.invoke(DelegatingMethodAccessorImpl.java:25)
	at java.lang.reflect.Method.invoke(Method.java:585)
	at org.apache.maven.surefire.junit.JUnitTestSet.execute(JUnitTestSet.java:213)
	at org.apache.maven.surefire.suite.AbstractDirectoryTestSuite.executeTestSet(AbstractDirectoryTestSuite.java:140)
	at org.apache.maven.surefire.suite.AbstractDirectoryTestSuite.execute(AbstractDirectoryTestSuite.java:127)
	at org.apache.maven.surefire.Surefire.run(Surefire.java:177)
	at sun.reflect.NativeMethodAccessorImpl.invoke0(Native Method)
	at sun.reflect.NativeMethodAccessorImpl.invoke(NativeMethodAccessorImpl.java:39)
	at sun.reflect.DelegatingMethodAccessorImpl.invoke(DelegatingMethodAccessorImpl.java:25)
	at java.lang.reflect.Method.invoke(Method.java:585)
	at org.apache.maven.surefire.booter.SurefireBooter.runSuitesInProcess(SurefireBooter.java:338)
	at org.apache.maven.surefire.booter.SurefireBooter.main(SurefireBooter.java:997)
841  [main] WARN  org.apache.maven.archiva.converter.legacy.LegacyConverterArtifactConsumer  - Unable to convert artifact: test/jars/v3artifact-1.0.0.jar : Not enough parts to the path [test/jars/v3artifact-1.0.0.jar] to construct an ArchivaArtifact from. (Requires at least 4 parts)
org.apache.maven.archiva.repository.layout.LayoutException: Not enough parts to the path [test/jars/v3artifact-1.0.0.jar] to construct an ArchivaArtifact from. (Requires at least 4 parts)
	at org.apache.maven.archiva.repository.content.DefaultPathParser.toArtifactReference(DefaultPathParser.java:66)
	at org.apache.maven.archiva.repository.content.AbstractDefaultRepositoryContent.toArtifactReference(AbstractDefaultRepositoryContent.java:51)
	at org.apache.maven.archiva.repository.content.ManagedDefaultRepositoryContent.toArtifactReference(ManagedDefaultRepositoryContent.java:323)
	at org.apache.maven.archiva.converter.legacy.LegacyConverterArtifactConsumer.processFile(LegacyConverterArtifactConsumer.java:111)
	at org.apache.maven.archiva.repository.scanner.functors.ConsumerProcessFileClosure.execute(ConsumerProcessFileClosure.java:51)
	at org.apache.commons.collections.functors.IfClosure.execute(IfClosure.java:117)
	at org.apache.commons.collections.CollectionUtils.forAllDo(CollectionUtils.java:388)
	at org.apache.maven.archiva.repository.scanner.RepositoryScannerInstance.directoryWalkStep(RepositoryScannerInstance.java:140)
	at org.codehaus.plexus.util.DirectoryWalker.fireStep(DirectoryWalker.java:174)
	at org.codehaus.plexus.util.DirectoryWalker.scanDir(DirectoryWalker.java:392)
	at org.codehaus.plexus.util.DirectoryWalker.scanDir(DirectoryWalker.java:386)
	at org.codehaus.plexus.util.DirectoryWalker.scanDir(DirectoryWalker.java:386)
	at org.codehaus.plexus.util.DirectoryWalker.scan(DirectoryWalker.java:345)
	at org.apache.maven.archiva.repository.scanner.DefaultRepositoryScanner.scan(DefaultRepositoryScanner.java:139)
	at org.apache.maven.archiva.converter.legacy.DefaultLegacyRepositoryConverter.convertLegacyRepository(DefaultLegacyRepositoryConverter.java:96)
	at org.apache.maven.archiva.converter.RepositoryConverterTest.testLegacyConversion(RepositoryConverterTest.java:151)
	at sun.reflect.NativeMethodAccessorImpl.invoke0(Native Method)
	at sun.reflect.NativeMethodAccessorImpl.invoke(NativeMethodAccessorImpl.java:39)
	at sun.reflect.DelegatingMethodAccessorImpl.invoke(DelegatingMethodAccessorImpl.java:25)
	at java.lang.reflect.Method.invoke(Method.java:585)
	at junit.framework.TestCase.runTest(TestCase.java:154)
	at junit.framework.TestCase.runBare(TestCase.java:127)
	at junit.framework.TestResult$1.protect(TestResult.java:106)
	at junit.framework.TestResult.runProtected(TestResult.java:124)
	at junit.framework.TestResult.run(TestResult.java:109)
	at junit.framework.TestCase.run(TestCase.java:118)
	at junit.framework.TestSuite.runTest(TestSuite.java:208)
	at junit.framework.TestSuite.run(TestSuite.java:203)
	at sun.reflect.NativeMethodAccessorImpl.invoke0(Native Method)
	at sun.reflect.NativeMethodAccessorImpl.invoke(NativeMethodAccessorImpl.java:39)
	at sun.reflect.DelegatingMethodAccessorImpl.invoke(DelegatingMethodAccessorImpl.java:25)
	at java.lang.reflect.Method.invoke(Method.java:585)
	at org.apache.maven.surefire.junit.JUnitTestSet.execute(JUnitTestSet.java:213)
	at org.apache.maven.surefire.suite.AbstractDirectoryTestSuite.executeTestSet(AbstractDirectoryTestSuite.java:140)
	at org.apache.maven.surefire.suite.AbstractDirectoryTestSuite.execute(AbstractDirectoryTestSuite.java:127)
	at org.apache.maven.surefire.Surefire.run(Surefire.java:177)
	at sun.reflect.NativeMethodAccessorImpl.invoke0(Native Method)
	at sun.reflect.NativeMethodAccessorImpl.invoke(NativeMethodAccessorImpl.java:39)
	at sun.reflect.DelegatingMethodAccessorImpl.invoke(DelegatingMethodAccessorImpl.java:25)
	at java.lang.reflect.Method.invoke(Method.java:585)
	at org.apache.maven.surefire.booter.SurefireBooter.runSuitesInProcess(SurefireBooter.java:338)
	at org.apache.maven.surefire.booter.SurefireBooter.main(SurefireBooter.java:997)
842  [main] WARN  org.apache.maven.archiva.converter.legacy.LegacyConverterArtifactConsumer  - Unable to convert artifact: test/jars/v4artifact-1.0.0.jar : Not enough parts to the path [test/jars/v4artifact-1.0.0.jar] to construct an ArchivaArtifact from. (Requires at least 4 parts)
org.apache.maven.archiva.repository.layout.LayoutException: Not enough parts to the path [test/jars/v4artifact-1.0.0.jar] to construct an ArchivaArtifact from. (Requires at least 4 parts)
	at org.apache.maven.archiva.repository.content.DefaultPathParser.toArtifactReference(DefaultPathParser.java:66)
	at org.apache.maven.archiva.repository.content.AbstractDefaultRepositoryContent.toArtifactReference(AbstractDefaultRepositoryContent.java:51)
	at org.apache.maven.archiva.repository.content.ManagedDefaultRepositoryContent.toArtifactReference(ManagedDefaultRepositoryContent.java:323)
	at org.apache.maven.archiva.converter.legacy.LegacyConverterArtifactConsumer.processFile(LegacyConverterArtifactConsumer.java:111)
	at org.apache.maven.archiva.repository.scanner.functors.ConsumerProcessFileClosure.execute(ConsumerProcessFileClosure.java:51)
	at org.apache.commons.collections.functors.IfClosure.execute(IfClosure.java:117)
	at org.apache.commons.collections.CollectionUtils.forAllDo(CollectionUtils.java:388)
	at org.apache.maven.archiva.repository.scanner.RepositoryScannerInstance.directoryWalkStep(RepositoryScannerInstance.java:140)
	at org.codehaus.plexus.util.DirectoryWalker.fireStep(DirectoryWalker.java:174)
	at org.codehaus.plexus.util.DirectoryWalker.scanDir(DirectoryWalker.java:392)
	at org.codehaus.plexus.util.DirectoryWalker.scanDir(DirectoryWalker.java:386)
	at org.codehaus.plexus.util.DirectoryWalker.scanDir(DirectoryWalker.java:386)
	at org.codehaus.plexus.util.DirectoryWalker.scan(DirectoryWalker.java:345)
	at org.apache.maven.archiva.repository.scanner.DefaultRepositoryScanner.scan(DefaultRepositoryScanner.java:139)
	at org.apache.maven.archiva.converter.legacy.DefaultLegacyRepositoryConverter.convertLegacyRepository(DefaultLegacyRepositoryConverter.java:96)
	at org.apache.maven.archiva.converter.RepositoryConverterTest.testLegacyConversion(RepositoryConverterTest.java:151)
	at sun.reflect.NativeMethodAccessorImpl.invoke0(Native Method)
	at sun.reflect.NativeMethodAccessorImpl.invoke(NativeMethodAccessorImpl.java:39)
	at sun.reflect.DelegatingMethodAccessorImpl.invoke(DelegatingMethodAccessorImpl.java:25)
	at java.lang.reflect.Method.invoke(Method.java:585)
	at junit.framework.TestCase.runTest(TestCase.java:154)
	at junit.framework.TestCase.runBare(TestCase.java:127)
	at junit.framework.TestResult$1.protect(TestResult.java:106)
	at junit.framework.TestResult.runProtected(TestResult.java:124)
	at junit.framework.TestResult.run(TestResult.java:109)
	at junit.framework.TestCase.run(TestCase.java:118)
	at junit.framework.TestSuite.runTest(TestSuite.java:208)
	at junit.framework.TestSuite.run(TestSuite.java:203)
	at sun.reflect.NativeMethodAccessorImpl.invoke0(Native Method)
	at sun.reflect.NativeMethodAccessorImpl.invoke(NativeMethodAccessorImpl.java:39)
	at sun.reflect.DelegatingMethodAccessorImpl.invoke(DelegatingMethodAccessorImpl.java:25)
	at java.lang.reflect.Method.invoke(Method.java:585)
	at org.apache.maven.surefire.junit.JUnitTestSet.execute(JUnitTestSet.java:213)
	at org.apache.maven.surefire.suite.AbstractDirectoryTestSuite.executeTestSet(AbstractDirectoryTestSuite.java:140)
	at org.apache.maven.surefire.suite.AbstractDirectoryTestSuite.execute(AbstractDirectoryTestSuite.java:127)
	at org.apache.maven.surefire.Surefire.run(Surefire.java:177)
	at sun.reflect.NativeMethodAccessorImpl.invoke0(Native Method)
	at sun.reflect.NativeMethodAccessorImpl.invoke(NativeMethodAccessorImpl.java:39)
	at sun.reflect.DelegatingMethodAccessorImpl.invoke(DelegatingMethodAccessorImpl.java:25)
	at java.lang.reflect.Method.invoke(Method.java:585)
	at org.apache.maven.surefire.booter.SurefireBooter.runSuitesInProcess(SurefireBooter.java:338)
	at org.apache.maven.surefire.booter.SurefireBooter.main(SurefireBooter.java:997)
843  [main] WARN  org.apache.maven.archiva.converter.legacy.LegacyConverterArtifactConsumer  - Unable to convert artifact: test/jars/v3-warnings-artifact-1.0.0.jar : Not enough parts to the path [test/jars/v3-warnings-artifact-1.0.0.jar] to construct an ArchivaArtifact from. (Requires at least 4 parts)
org.apache.maven.archiva.repository.layout.LayoutException: Not enough parts to the path [test/jars/v3-warnings-artifact-1.0.0.jar] to construct an ArchivaArtifact from. (Requires at least 4 parts)
	at org.apache.maven.archiva.repository.content.DefaultPathParser.toArtifactReference(DefaultPathParser.java:66)
	at org.apache.maven.archiva.repository.content.AbstractDefaultRepositoryContent.toArtifactReference(AbstractDefaultRepositoryContent.java:51)
	at org.apache.maven.archiva.repository.content.ManagedDefaultRepositoryContent.toArtifactReference(ManagedDefaultRepositoryContent.java:323)
	at org.apache.maven.archiva.converter.legacy.LegacyConverterArtifactConsumer.processFile(LegacyConverterArtifactConsumer.java:111)
	at org.apache.maven.archiva.repository.scanner.functors.ConsumerProcessFileClosure.execute(ConsumerProcessFileClosure.java:51)
	at org.apache.commons.collections.functors.IfClosure.execute(IfClosure.java:117)
	at org.apache.commons.collections.CollectionUtils.forAllDo(CollectionUtils.java:388)
	at org.apache.maven.archiva.repository.scanner.RepositoryScannerInstance.directoryWalkStep(RepositoryScannerInstance.java:140)
	at org.codehaus.plexus.util.DirectoryWalker.fireStep(DirectoryWalker.java:174)
	at org.codehaus.plexus.util.DirectoryWalker.scanDir(DirectoryWalker.java:392)
	at org.codehaus.plexus.util.DirectoryWalker.scanDir(DirectoryWalker.java:386)
	at org.codehaus.plexus.util.DirectoryWalker.scanDir(DirectoryWalker.java:386)
	at org.codehaus.plexus.util.DirectoryWalker.scan(DirectoryWalker.java:345)
	at org.apache.maven.archiva.repository.scanner.DefaultRepositoryScanner.scan(DefaultRepositoryScanner.java:139)
	at org.apache.maven.archiva.converter.legacy.DefaultLegacyRepositoryConverter.convertLegacyRepository(DefaultLegacyRepositoryConverter.java:96)
	at org.apache.maven.archiva.converter.RepositoryConverterTest.testLegacyConversion(RepositoryConverterTest.java:151)
	at sun.reflect.NativeMethodAccessorImpl.invoke0(Native Method)
	at sun.reflect.NativeMethodAccessorImpl.invoke(NativeMethodAccessorImpl.java:39)
	at sun.reflect.DelegatingMethodAccessorImpl.invoke(DelegatingMethodAccessorImpl.java:25)
	at java.lang.reflect.Method.invoke(Method.java:585)
	at junit.framework.TestCase.runTest(TestCase.java:154)
	at junit.framework.TestCase.runBare(TestCase.java:127)
	at junit.framework.TestResult$1.protect(TestResult.java:106)
	at junit.framework.TestResult.runProtected(TestResult.java:124)
	at junit.framework.TestResult.run(TestResult.java:109)
	at junit.framework.TestCase.run(TestCase.java:118)
	at junit.framework.TestSuite.runTest(TestSuite.java:208)
	at junit.framework.TestSuite.run(TestSuite.java:203)
	at sun.reflect.NativeMethodAccessorImpl.invoke0(Native Method)
	at sun.reflect.NativeMethodAccessorImpl.invoke(NativeMethodAccessorImpl.java:39)
	at sun.reflect.DelegatingMethodAccessorImpl.invoke(DelegatingMethodAccessorImpl.java:25)
	at java.lang.reflect.Method.invoke(Method.java:585)
	at org.apache.maven.surefire.junit.JUnitTestSet.execute(JUnitTestSet.java:213)
	at org.apache.maven.surefire.suite.AbstractDirectoryTestSuite.executeTestSet(AbstractDirectoryTestSuite.java:140)
	at org.apache.maven.surefire.suite.AbstractDirectoryTestSuite.execute(AbstractDirectoryTestSuite.java:127)
	at org.apache.maven.surefire.Surefire.run(Surefire.java:177)
	at sun.reflect.NativeMethodAccessorImpl.invoke0(Native Method)
	at sun.reflect.NativeMethodAccessorImpl.invoke(NativeMethodAccessorImpl.java:39)
	at sun.reflect.DelegatingMethodAccessorImpl.invoke(DelegatingMethodAccessorImpl.java:25)
	at java.lang.reflect.Method.invoke(Method.java:585)
	at org.apache.maven.surefire.booter.SurefireBooter.runSuitesInProcess(SurefireBooter.java:338)
	at org.apache.maven.surefire.booter.SurefireBooter.main(SurefireBooter.java:997)
848  [main] WARN  org.apache.maven.archiva.converter.legacy.LegacyConverterArtifactConsumer  - Unable to convert artifact: test/jars/v3artifact-1.0.0-20060105.130101-3.jar : Not enough parts to the path [test/jars/v3artifact-1.0.0-20060105.130101-3.jar] to construct an ArchivaArtifact from. (Requires at least 4 parts)
org.apache.maven.archiva.repository.layout.LayoutException: Not enough parts to the path [test/jars/v3artifact-1.0.0-20060105.130101-3.jar] to construct an ArchivaArtifact from. (Requires at least 4 parts)
	at org.apache.maven.archiva.repository.content.DefaultPathParser.toArtifactReference(DefaultPathParser.java:66)
	at org.apache.maven.archiva.repository.content.AbstractDefaultRepositoryContent.toArtifactReference(AbstractDefaultRepositoryContent.java:51)
	at org.apache.maven.archiva.repository.content.ManagedDefaultRepositoryContent.toArtifactReference(ManagedDefaultRepositoryContent.java:323)
	at org.apache.maven.archiva.converter.legacy.LegacyConverterArtifactConsumer.processFile(LegacyConverterArtifactConsumer.java:111)
	at org.apache.maven.archiva.repository.scanner.functors.ConsumerProcessFileClosure.execute(ConsumerProcessFileClosure.java:51)
	at org.apache.commons.collections.functors.IfClosure.execute(IfClosure.java:117)
	at org.apache.commons.collections.CollectionUtils.forAllDo(CollectionUtils.java:388)
	at org.apache.maven.archiva.repository.scanner.RepositoryScannerInstance.directoryWalkStep(RepositoryScannerInstance.java:140)
	at org.codehaus.plexus.util.DirectoryWalker.fireStep(DirectoryWalker.java:174)
	at org.codehaus.plexus.util.DirectoryWalker.scanDir(DirectoryWalker.java:392)
	at org.codehaus.plexus.util.DirectoryWalker.scanDir(DirectoryWalker.java:386)
	at org.codehaus.plexus.util.DirectoryWalker.scanDir(DirectoryWalker.java:386)
	at org.codehaus.plexus.util.DirectoryWalker.scan(DirectoryWalker.java:345)
	at org.apache.maven.archiva.repository.scanner.DefaultRepositoryScanner.scan(DefaultRepositoryScanner.java:139)
	at org.apache.maven.archiva.converter.legacy.DefaultLegacyRepositoryConverter.convertLegacyRepository(DefaultLegacyRepositoryConverter.java:96)
	at org.apache.maven.archiva.converter.RepositoryConverterTest.testLegacyConversion(RepositoryConverterTest.java:151)
	at sun.reflect.NativeMethodAccessorImpl.invoke0(Native Method)
	at sun.reflect.NativeMethodAccessorImpl.invoke(NativeMethodAccessorImpl.java:39)
	at sun.reflect.DelegatingMethodAccessorImpl.invoke(DelegatingMethodAccessorImpl.java:25)
	at java.lang.reflect.Method.invoke(Method.java:585)
	at junit.framework.TestCase.runTest(TestCase.java:154)
	at junit.framework.TestCase.runBare(TestCase.java:127)
	at junit.framework.TestResult$1.protect(TestResult.java:106)
	at junit.framework.TestResult.runProtected(TestResult.java:124)
	at junit.framework.TestResult.run(TestResult.java:109)
	at junit.framework.TestCase.run(TestCase.java:118)
	at junit.framework.TestSuite.runTest(TestSuite.java:208)
	at junit.framework.TestSuite.run(TestSuite.java:203)
	at sun.reflect.NativeMethodAccessorImpl.invoke0(Native Method)
	at sun.reflect.NativeMethodAccessorImpl.invoke(NativeMethodAccessorImpl.java:39)
	at sun.reflect.DelegatingMethodAccessorImpl.invoke(DelegatingMethodAccessorImpl.java:25)
	at java.lang.reflect.Method.invoke(Method.java:585)
	at org.apache.maven.surefire.junit.JUnitTestSet.execute(JUnitTestSet.java:213)
	at org.apache.maven.surefire.suite.AbstractDirectoryTestSuite.executeTestSet(AbstractDirectoryTestSuite.java:140)
	at org.apache.maven.surefire.suite.AbstractDirectoryTestSuite.execute(AbstractDirectoryTestSuite.java:127)
	at org.apache.maven.surefire.Surefire.run(Surefire.java:177)
	at sun.reflect.NativeMethodAccessorImpl.invoke0(Native Method)
	at sun.reflect.NativeMethodAccessorImpl.invoke(NativeMethodAccessorImpl.java:39)
	at sun.reflect.DelegatingMethodAccessorImpl.invoke(DelegatingMethodAccessorImpl.java:25)
	at java.lang.reflect.Method.invoke(Method.java:585)
	at org.apache.maven.surefire.booter.SurefireBooter.runSuitesInProcess(SurefireBooter.java:338)
	at org.apache.maven.surefire.booter.SurefireBooter.main(SurefireBooter.java:997)
853  [main] WARN  org.apache.maven.archiva.converter.legacy.LegacyConverterArtifactConsumer  - Unable to convert artifact: test/jars/noPomArtifact-1.0.0.jar : Not enough parts to the path [test/jars/noPomArtifact-1.0.0.jar] to construct an ArchivaArtifact from. (Requires at least 4 parts)
org.apache.maven.archiva.repository.layout.LayoutException: Not enough parts to the path [test/jars/noPomArtifact-1.0.0.jar] to construct an ArchivaArtifact from. (Requires at least 4 parts)
	at org.apache.maven.archiva.repository.content.DefaultPathParser.toArtifactReference(DefaultPathParser.java:66)
	at org.apache.maven.archiva.repository.content.AbstractDefaultRepositoryContent.toArtifactReference(AbstractDefaultRepositoryContent.java:51)
	at org.apache.maven.archiva.repository.content.ManagedDefaultRepositoryContent.toArtifactReference(ManagedDefaultRepositoryContent.java:323)
	at org.apache.maven.archiva.converter.legacy.LegacyConverterArtifactConsumer.processFile(LegacyConverterArtifactConsumer.java:111)
	at org.apache.maven.archiva.repository.scanner.functors.ConsumerProcessFileClosure.execute(ConsumerProcessFileClosure.java:51)
	at org.apache.commons.collections.functors.IfClosure.execute(IfClosure.java:117)
	at org.apache.commons.collections.CollectionUtils.forAllDo(CollectionUtils.java:388)
	at org.apache.maven.archiva.repository.scanner.RepositoryScannerInstance.directoryWalkStep(RepositoryScannerInstance.java:140)
	at org.codehaus.plexus.util.DirectoryWalker.fireStep(DirectoryWalker.java:174)
	at org.codehaus.plexus.util.DirectoryWalker.scanDir(DirectoryWalker.java:392)
	at org.codehaus.plexus.util.DirectoryWalker.scanDir(DirectoryWalker.java:386)
	at org.codehaus.plexus.util.DirectoryWalker.scanDir(DirectoryWalker.java:386)
	at org.codehaus.plexus.util.DirectoryWalker.scan(DirectoryWalker.java:345)
	at org.apache.maven.archiva.repository.scanner.DefaultRepositoryScanner.scan(DefaultRepositoryScanner.java:139)
	at org.apache.maven.archiva.converter.legacy.DefaultLegacyRepositoryConverter.convertLegacyRepository(DefaultLegacyRepositoryConverter.java:96)
	at org.apache.maven.archiva.converter.RepositoryConverterTest.testLegacyConversion(RepositoryConverterTest.java:151)
	at sun.reflect.NativeMethodAccessorImpl.invoke0(Native Method)
	at sun.reflect.NativeMethodAccessorImpl.invoke(NativeMethodAccessorImpl.java:39)
	at sun.reflect.DelegatingMethodAccessorImpl.invoke(DelegatingMethodAccessorImpl.java:25)
	at java.lang.reflect.Method.invoke(Method.java:585)
	at junit.framework.TestCase.runTest(TestCase.java:154)
	at junit.framework.TestCase.runBare(TestCase.java:127)
	at junit.framework.TestResult$1.protect(TestResult.java:106)
	at junit.framework.TestResult.runProtected(TestResult.java:124)
	at junit.framework.TestResult.run(TestResult.java:109)
	at junit.framework.TestCase.run(TestCase.java:118)
	at junit.framework.TestSuite.runTest(TestSuite.java:208)
	at junit.framework.TestSuite.run(TestSuite.java:203)
	at sun.reflect.NativeMethodAccessorImpl.invoke0(Native Method)
	at sun.reflect.NativeMethodAccessorImpl.invoke(NativeMethodAccessorImpl.java:39)
	at sun.reflect.DelegatingMethodAccessorImpl.invoke(DelegatingMethodAccessorImpl.java:25)
	at java.lang.reflect.Method.invoke(Method.java:585)
	at org.apache.maven.surefire.junit.JUnitTestSet.execute(JUnitTestSet.java:213)
	at org.apache.maven.surefire.suite.AbstractDirectoryTestSuite.executeTestSet(AbstractDirectoryTestSuite.java:140)
	at org.apache.maven.surefire.suite.AbstractDirectoryTestSuite.execute(AbstractDirectoryTestSuite.java:127)
	at org.apache.maven.surefire.Surefire.run(Surefire.java:177)
	at sun.reflect.NativeMethodAccessorImpl.invoke0(Native Method)
	at sun.reflect.NativeMethodAccessorImpl.invoke(NativeMethodAccessorImpl.java:39)
	at sun.reflect.DelegatingMethodAccessorImpl.invoke(DelegatingMethodAccessorImpl.java:25)
	at java.lang.reflect.Method.invoke(Method.java:585)
	at org.apache.maven.surefire.booter.SurefireBooter.runSuitesInProcess(SurefireBooter.java:338)
	at org.apache.maven.surefire.booter.SurefireBooter.main(SurefireBooter.java:997)
853  [main] WARN  org.apache.maven.archiva.converter.legacy.LegacyConverterArtifactConsumer  - Unable to convert artifact: test/jars/unmodified-artifact-1.0.0.jar : Not enough parts to the path [test/jars/unmodified-artifact-1.0.0.jar] to construct an ArchivaArtifact from. (Requires at least 4 parts)
org.apache.maven.archiva.repository.layout.LayoutException: Not enough parts to the path [test/jars/unmodified-artifact-1.0.0.jar] to construct an ArchivaArtifact from. (Requires at least 4 parts)
	at org.apache.maven.archiva.repository.content.DefaultPathParser.toArtifactReference(DefaultPathParser.java:66)
	at org.apache.maven.archiva.repository.content.AbstractDefaultRepositoryContent.toArtifactReference(AbstractDefaultRepositoryContent.java:51)
	at org.apache.maven.archiva.repository.content.ManagedDefaultRepositoryContent.toArtifactReference(ManagedDefaultRepositoryContent.java:323)
	at org.apache.maven.archiva.converter.legacy.LegacyConverterArtifactConsumer.processFile(LegacyConverterArtifactConsumer.java:111)
	at org.apache.maven.archiva.repository.scanner.functors.ConsumerProcessFileClosure.execute(ConsumerProcessFileClosure.java:51)
	at org.apache.commons.collections.functors.IfClosure.execute(IfClosure.java:117)
	at org.apache.commons.collections.CollectionUtils.forAllDo(CollectionUtils.java:388)
	at org.apache.maven.archiva.repository.scanner.RepositoryScannerInstance.directoryWalkStep(RepositoryScannerInstance.java:140)
	at org.codehaus.plexus.util.DirectoryWalker.fireStep(DirectoryWalker.java:174)
	at org.codehaus.plexus.util.DirectoryWalker.scanDir(DirectoryWalker.java:392)
	at org.codehaus.plexus.util.DirectoryWalker.scanDir(DirectoryWalker.java:386)
	at org.codehaus.plexus.util.DirectoryWalker.scanDir(DirectoryWalker.java:386)
	at org.codehaus.plexus.util.DirectoryWalker.scan(DirectoryWalker.java:345)
	at org.apache.maven.archiva.repository.scanner.DefaultRepositoryScanner.scan(DefaultRepositoryScanner.java:139)
	at org.apache.maven.archiva.converter.legacy.DefaultLegacyRepositoryConverter.convertLegacyRepository(DefaultLegacyRepositoryConverter.java:96)
	at org.apache.maven.archiva.converter.RepositoryConverterTest.testLegacyConversion(RepositoryConverterTest.java:151)
	at sun.reflect.NativeMethodAccessorImpl.invoke0(Native Method)
	at sun.reflect.NativeMethodAccessorImpl.invoke(NativeMethodAccessorImpl.java:39)
	at sun.reflect.DelegatingMethodAccessorImpl.invoke(DelegatingMethodAccessorImpl.java:25)
	at java.lang.reflect.Method.invoke(Method.java:585)
	at junit.framework.TestCase.runTest(TestCase.java:154)
	at junit.framework.TestCase.runBare(TestCase.java:127)
	at junit.framework.TestResult$1.protect(TestResult.java:106)
	at junit.framework.TestResult.runProtected(TestResult.java:124)
	at junit.framework.TestResult.run(TestResult.java:109)
	at junit.framework.TestCase.run(TestCase.java:118)
	at junit.framework.TestSuite.runTest(TestSuite.java:208)
	at junit.framework.TestSuite.run(TestSuite.java:203)
	at sun.reflect.NativeMethodAccessorImpl.invoke0(Native Method)
	at sun.reflect.NativeMethodAccessorImpl.invoke(NativeMethodAccessorImpl.java:39)
	at sun.reflect.DelegatingMethodAccessorImpl.invoke(DelegatingMethodAccessorImpl.java:25)
	at java.lang.reflect.Method.invoke(Method.java:585)
	at org.apache.maven.surefire.junit.JUnitTestSet.execute(JUnitTestSet.java:213)
	at org.apache.maven.surefire.suite.AbstractDirectoryTestSuite.executeTestSet(AbstractDirectoryTestSuite.java:140)
	at org.apache.maven.surefire.suite.AbstractDirectoryTestSuite.execute(AbstractDirectoryTestSuite.java:127)
	at org.apache.maven.surefire.Surefire.run(Surefire.java:177)
	at sun.reflect.NativeMethodAccessorImpl.invoke0(Native Method)
	at sun.reflect.NativeMethodAccessorImpl.invoke(NativeMethodAccessorImpl.java:39)
	at sun.reflect.DelegatingMethodAccessorImpl.invoke(DelegatingMethodAccessorImpl.java:25)
	at java.lang.reflect.Method.invoke(Method.java:585)
	at org.apache.maven.surefire.booter.SurefireBooter.runSuitesInProcess(SurefireBooter.java:338)
	at org.apache.maven.surefire.booter.SurefireBooter.main(SurefireBooter.java:997)
857  [main] WARN  org.apache.maven.archiva.converter.legacy.LegacyConverterArtifactConsumer  - Unable to convert artifact: test/plugins/maven-foo-plugin-1.0.jar : Not enough parts to the path [test/plugins/maven-foo-plugin-1.0.jar] to construct an ArchivaArtifact from. (Requires at least 4 parts)
org.apache.maven.archiva.repository.layout.LayoutException: Not enough parts to the path [test/plugins/maven-foo-plugin-1.0.jar] to construct an ArchivaArtifact from. (Requires at least 4 parts)
	at org.apache.maven.archiva.repository.content.DefaultPathParser.toArtifactReference(DefaultPathParser.java:66)
	at org.apache.maven.archiva.repository.content.AbstractDefaultRepositoryContent.toArtifactReference(AbstractDefaultRepositoryContent.java:51)
	at org.apache.maven.archiva.repository.content.ManagedDefaultRepositoryContent.toArtifactReference(ManagedDefaultRepositoryContent.java:323)
	at org.apache.maven.archiva.converter.legacy.LegacyConverterArtifactConsumer.processFile(LegacyConverterArtifactConsumer.java:111)
	at org.apache.maven.archiva.repository.scanner.functors.ConsumerProcessFileClosure.execute(ConsumerProcessFileClosure.java:51)
	at org.apache.commons.collections.functors.IfClosure.execute(IfClosure.java:117)
	at org.apache.commons.collections.CollectionUtils.forAllDo(CollectionUtils.java:388)
	at org.apache.maven.archiva.repository.scanner.RepositoryScannerInstance.directoryWalkStep(RepositoryScannerInstance.java:140)
	at org.codehaus.plexus.util.DirectoryWalker.fireStep(DirectoryWalker.java:174)
	at org.codehaus.plexus.util.DirectoryWalker.scanDir(DirectoryWalker.java:392)
	at org.codehaus.plexus.util.DirectoryWalker.scanDir(DirectoryWalker.java:386)
	at org.codehaus.plexus.util.DirectoryWalker.scanDir(DirectoryWalker.java:386)
	at org.codehaus.plexus.util.DirectoryWalker.scan(DirectoryWalker.java:345)
	at org.apache.maven.archiva.repository.scanner.DefaultRepositoryScanner.scan(DefaultRepositoryScanner.java:139)
	at org.apache.maven.archiva.converter.legacy.DefaultLegacyRepositoryConverter.convertLegacyRepository(DefaultLegacyRepositoryConverter.java:96)
	at org.apache.maven.archiva.converter.RepositoryConverterTest.testLegacyConversion(RepositoryConverterTest.java:151)
	at sun.reflect.NativeMethodAccessorImpl.invoke0(Native Method)
	at sun.reflect.NativeMethodAccessorImpl.invoke(NativeMethodAccessorImpl.java:39)
	at sun.reflect.DelegatingMethodAccessorImpl.invoke(DelegatingMethodAccessorImpl.java:25)
	at java.lang.reflect.Method.invoke(Method.java:585)
	at junit.framework.TestCase.runTest(TestCase.java:154)
	at junit.framework.TestCase.runBare(TestCase.java:127)
	at junit.framework.TestResult$1.protect(TestResult.java:106)
	at junit.framework.TestResult.runProtected(TestResult.java:124)
	at junit.framework.TestResult.run(TestResult.java:109)
	at junit.framework.TestCase.run(TestCase.java:118)
	at junit.framework.TestSuite.runTest(TestSuite.java:208)
	at junit.framework.TestSuite.run(TestSuite.java:203)
	at sun.reflect.NativeMethodAccessorImpl.invoke0(Native Method)
	at sun.reflect.NativeMethodAccessorImpl.invoke(NativeMethodAccessorImpl.java:39)
	at sun.reflect.DelegatingMethodAccessorImpl.invoke(DelegatingMethodAccessorImpl.java:25)
	at java.lang.reflect.Method.invoke(Method.java:585)
	at org.apache.maven.surefire.junit.JUnitTestSet.execute(JUnitTestSet.java:213)
	at org.apache.maven.surefire.suite.AbstractDirectoryTestSuite.executeTestSet(AbstractDirectoryTestSuite.java:140)
	at org.apache.maven.surefire.suite.AbstractDirectoryTestSuite.execute(AbstractDirectoryTestSuite.java:127)
	at org.apache.maven.surefire.Surefire.run(Surefire.java:177)
	at sun.reflect.NativeMethodAccessorImpl.invoke0(Native Method)
	at sun.reflect.NativeMethodAccessorImpl.invoke(NativeMethodAccessorImpl.java:39)
	at sun.reflect.DelegatingMethodAccessorImpl.invoke(DelegatingMethodAccessorImpl.java:25)
	at java.lang.reflect.Method.invoke(Method.java:585)
	at org.apache.maven.surefire.booter.SurefireBooter.runSuitesInProcess(SurefireBooter.java:338)
	at org.apache.maven.surefire.booter.SurefireBooter.main(SurefireBooter.java:997)
1001 [main] ERROR org.apache.maven.archiva.repository.scanner.DefaultRepositoryScanner  - Unable to find managed repository configuration for id:legacy
1076 [main] ERROR org.apache.archiva.rss.RssFeedGenerator  - Error occurred while generating the feed : ./apps/archiva/rss/new_artifacts_.xml (No such file or directory)
[INFO] Disposing cache: [ name = url-failures-cache status = STATUS_ALIVE eternal = false overflowToDisk = false maxElementsInMemory = 1000 maxElementsOnDisk = 0 memoryStoreEvictionPolicy = LRU timeToLiveSeconds = 1800 timeToIdleSeconds = 2700 diskPersistent = true diskExpiryThreadIntervalSeconds = 600 cacheEventListeners:  hitCount = 0 memoryStoreHitCount = 0 diskStoreHitCount = 0 missCountNotFound = 0 missCountExpired = 0 ]
Tests run: 1, Failures: 0, Errors: 0, Skipped: 0, Time elapsed: 3.844 sec

Results :

Tests run: 1, Failures: 0, Errors: 0, Skipped: 0

[INFO] [jar:jar]
[INFO] Building jar: /home/continuum/data/working-directory/672/target/archiva-converter-1.1-SNAPSHOT.jar
[INFO] [install:install]
[INFO] Installing /home/continuum/data/working-directory/672/target/archiva-converter-1.1-SNAPSHOT.jar to /home/continuum/.m2/repository/org/apache/archiva/archiva-converter/1.1-SNAPSHOT/archiva-converter-1.1-SNAPSHOT.jar
[INFO] ------------------------------------------------------------------------
[INFO] BUILD SUCCESSFUL
[INFO] ------------------------------------------------------------------------
[INFO] Total time: 22 seconds
[INFO] Finished at: Mon Apr 14 11:05:14 PDT 2008
[INFO] Final Memory: 17M/35M
[INFO] ------------------------------------------------------------------------

****************************************************************************



Mime
View raw message