maven-notifications mailing list archives

Site index · List index
Message view « Date » · « Thread »
Top « Date » · « Thread »
From Continuum VMBuild Server <contin...@apache.org>
Subject [continuum] BUILD FAILURE: Archiva Consumer API
Date Fri, 04 Apr 2008 00:30:14 GMT
Online report : http://vmbuild.apache.org/continuum/buildResult.action?buildId=72957&projectId=659

Build statistics:
  State: Failed
  Previous State: Ok
  Started at: Thu 3 Apr 2008 17:29:44 -0700
  Finished at: Thu 3 Apr 2008 17:29:58 -0700
  Total time: 13s
  Build Trigger: Schedule
  Build Number: 12
  Exit code: 1
  Building machine hostname: vmbuild.apache.org
  Operating system : Linux(unknown)
  Java Home version : 
          java version "1.5.0_12"
          Java(TM) 2 Runtime Environment, Standard Edition (build 1.5.0_12-b04)
          Java HotSpot(TM) Client VM (build 1.5.0_12-b04, mixed mode, sharing)
        
  Builder version :
          Maven version: 2.0.8
          Java version: 1.5.0_12
          OS name: "linux" version: "2.6.20-16-server" arch: "i386" Family: "unix"
    
****************************************************************************
SCM Changes:
****************************************************************************
No files changed

****************************************************************************
Dependencies Changes:
****************************************************************************
org.apache.archiva:archiva-configuration:1.1-SNAPSHOT

org.apache.archiva:archiva-model:1.1-SNAPSHOT

org.apache.archiva:archiva-consumers:1.1-SNAPSHOT


****************************************************************************
Build Defintion:
****************************************************************************
POM filename: pom.xml
Goals: clean install   
Arguments: --batch-mode --non-recursive
Build Fresh: false
Always Build: false
Default Build Definition: true
Schedule: DEFAULT_SCHEDULE
Profile Name: Maven 2.0.8, Java 5
Description: 


****************************************************************************
Test Summary:
****************************************************************************
Tests: 0
Failures: 0
Total time: 0

****************************************************************************
Output:
****************************************************************************
[INFO] Scanning for projects...
[INFO] ------------------------------------------------------------------------
[INFO] Building Archiva Consumer API
[INFO]    task-segment: [clean, install]
[INFO] ------------------------------------------------------------------------
[INFO] [clean:clean]
[INFO] Deleting directory /home/continuum/data/working-directory/659/target
[INFO] [plexus:descriptor {execution: generate}]
[INFO] Setting property: classpath.resource.loader.class => 'org.codehaus.plexus.velocity.ContextClassLoaderResourceLoader'.
[INFO] Setting property: velocimacro.messages.on => 'false'.
[INFO] Setting property: resource.loader => 'classpath'.
[INFO] Setting property: resource.manager.logwhenfound => 'false'.
[INFO] [remote-resources:process {execution: default}]
[INFO] [resources:resources]
[INFO] Using default encoding to copy filtered resources.
[INFO] [compiler:compile]
[INFO] Compiling 11 source files to /home/continuum/data/working-directory/659/target/classes
[INFO] ------------------------------------------------------------------------
[ERROR] BUILD FAILURE
[INFO] ------------------------------------------------------------------------
[INFO] Compilation failure
/home/continuum/data/working-directory/659/src/main/java/org/apache/maven/archiva/consumers/AbstractMonitoredConsumer.java:[103,15]
cannot find symbol
symbol  : variable FileTypes
location: class org.apache.maven.archiva.consumers.AbstractMonitoredConsumer



/home/continuum/data/working-directory/659/src/main/java/org/apache/maven/archiva/consumers/AbstractMonitoredConsumer.java:[103,15]
cannot find symbol
symbol  : variable FileTypes
location: class org.apache.maven.archiva.consumers.AbstractMonitoredConsumer


[INFO] ------------------------------------------------------------------------
[INFO] For more information, run Maven with the -e switch
[INFO] ------------------------------------------------------------------------
[INFO] Total time: 8 seconds
[INFO] Finished at: Thu Apr 03 17:29:58 PDT 2008
[INFO] Final Memory: 14M/25M
[INFO] ------------------------------------------------------------------------

****************************************************************************



Mime
View raw message