maven-notifications mailing list archives

Site index · List index
Message view « Date » · « Thread »
Top « Date » · « Thread »
From Continuum VMBuild Server <contin...@apache.org>
Subject [continuum] BUILD FAILURE: Archiva Repository Interface Layer
Date Tue, 15 Apr 2008 08:14:57 GMT
Online report : http://vmbuild.apache.org/continuum/buildResult.action?buildId=77345&projectId=667

Build statistics:
  State: Failed
  Previous State: Failed
  Started at: Tue 15 Apr 2008 01:13:04 -0700
  Finished at: Tue 15 Apr 2008 01:14:34 -0700
  Total time: 1m 29s
  Build Trigger: Schedule
  Build Number: 33
  Exit code: 1
  Building machine hostname: vmbuild.apache.org
  Operating system : Linux(unknown)
  Java Home version : 
          java version "1.5.0_12"
          Java(TM) 2 Runtime Environment, Standard Edition (build 1.5.0_12-b04)
          Java HotSpot(TM) Client VM (build 1.5.0_12-b04, mixed mode, sharing)
        
  Builder version :
          Maven version: 2.0.8
          Java version: 1.5.0_12
          OS name: "linux" version: "2.6.20-16-server" arch: "i386" Family: "unix"
    
****************************************************************************
SCM Changes:
****************************************************************************
No files changed

****************************************************************************
Dependencies Changes:
****************************************************************************
org.apache.archiva:archiva-consumer-api:1.1-SNAPSHOT

org.apache.archiva:archiva-checksum:1.1-SNAPSHOT

org.apache.archiva:archiva-configuration:1.1-SNAPSHOT


****************************************************************************
Build Defintion:
****************************************************************************
POM filename: pom.xml
Goals: clean install   
Arguments: --batch-mode --non-recursive
Build Fresh: false
Always Build: false
Default Build Definition: true
Schedule: DEFAULT_SCHEDULE
Profile Name: Maven 2.0.8, Java 5
Description: 


****************************************************************************
Test Summary:
****************************************************************************
Tests: 276
Failures: 232
Total time: 56515

****************************************************************************
Output:
****************************************************************************
[INFO] Scanning for projects...
[INFO] ------------------------------------------------------------------------
[INFO] Building Archiva Repository Interface Layer
[INFO]    task-segment: [clean, install]
[INFO] ------------------------------------------------------------------------
[INFO] [clean:clean]
[INFO] snapshot org.apache.archiva:archiva-xml-tools:1.1-SNAPSHOT: checking for updates from snapshots.codehaus.org
[INFO] snapshot org.apache.archiva:archiva-xml-tools:1.1-SNAPSHOT: checking for updates from apache.snapshots
[INFO] snapshot org.apache.archiva:archiva-consumer-api:1.1-SNAPSHOT: checking for updates from snapshots.codehaus.org
[INFO] snapshot org.apache.archiva:archiva-consumer-api:1.1-SNAPSHOT: checking for updates from apache.snapshots
[INFO] snapshot org.apache.archiva:archiva-consumers:1.1-SNAPSHOT: checking for updates from snapshots.codehaus.org
[INFO] snapshot org.apache.archiva:archiva-consumers:1.1-SNAPSHOT: checking for updates from apache.snapshots
[INFO] snapshot org.apache.archiva:archiva-dependency-graph:1.1-SNAPSHOT: checking for updates from snapshots.codehaus.org
[INFO] snapshot org.apache.archiva:archiva-dependency-graph:1.1-SNAPSHOT: checking for updates from apache.snapshots
[INFO] snapshot org.apache.archiva:archiva-rss:1.1-SNAPSHOT: checking for updates from snapshots.codehaus.org
[INFO] snapshot org.apache.archiva:archiva-rss:1.1-SNAPSHOT: checking for updates from apache.snapshots
[INFO] snapshot org.apache.archiva:archiva-web:1.1-SNAPSHOT: checking for updates from snapshots.codehaus.org
[INFO] snapshot org.apache.archiva:archiva-web:1.1-SNAPSHOT: checking for updates from apache.snapshots
[INFO] [enforcer:enforce {execution: default}]
[INFO] [plexus:descriptor {execution: generate}]
[INFO] [plexus:descriptor {execution: descriptor}]
[INFO] Setting property: classpath.resource.loader.class => 'org.codehaus.plexus.velocity.ContextClassLoaderResourceLoader'.
[INFO] Setting property: velocimacro.messages.on => 'false'.
[INFO] Setting property: resource.loader => 'classpath'.
[INFO] Setting property: resource.manager.logwhenfound => 'false'.
[INFO] [remote-resources:process {execution: default}]
[WARNING] Attempting to build MavenProject instance for Artifact (org.apache.commons:commons-io:1.3.2) of type: jar; constructing POM artifact instead.
[INFO] [resources:resources]
[INFO] Using default encoding to copy filtered resources.
[INFO] [plexus:merge-descriptors {execution: merge}]
[INFO] [compiler:compile]
[INFO] Compiling 58 source files to /home/continuum/data/working-directory/667/target/classes
[INFO] [resources:testResources]
[INFO] Using default encoding to copy filtered resources.
[INFO] [compiler:testCompile]
[INFO] Compiling 27 source files to /home/continuum/data/working-directory/667/target/test-classes
[INFO] [surefire:test]
[INFO] Surefire report directory: /home/continuum/data/working-directory/667/target/surefire-reports

-------------------------------------------------------
 T E S T S
-------------------------------------------------------
Running org.apache.maven.archiva.repository.content.RemoteLegacyRepositoryContentTest
2008-04-15 01:13:38,911 [main] WARN  PlexusLifecycleBeanPostProcessor - No loggerManager set in context. Falling back to ConsoleLoggerManager
2008-04-15 01:13:38,960 [main] WARN  ConfigurationFactory           - No configuration found. Configuring ehcache from ehcache-failsafe.xml  found in the classpath: jar:file:/home/continuum/.m2/repository/net/sf/ehcache/ehcache/1.3.0/ehcache-1.3.0.jar!/ehcache-failsafe.xml
[INFO] Disposing cache: [ name = url-failures-cache status = STATUS_ALIVE eternal = false overflowToDisk = false maxElementsInMemory = 1000 maxElementsOnDisk = 0 memoryStoreEvictionPolicy = LRU timeToLiveSeconds = 1800 timeToIdleSeconds = 2700 diskPersistent = true diskExpiryThreadIntervalSeconds = 600 cacheEventListeners:  hitCount = 0 memoryStoreHitCount = 0 diskStoreHitCount = 0 missCountNotFound = 0 missCountExpired = 0 ]
2008-04-15 01:13:39,951 [main] WARN  PlexusLifecycleBeanPostProcessor - No loggerManager set in context. Falling back to ConsoleLoggerManager
[INFO] Disposing cache: [ name = url-failures-cache status = STATUS_ALIVE eternal = false overflowToDisk = false maxElementsInMemory = 1000 maxElementsOnDisk = 0 memoryStoreEvictionPolicy = LRU timeToLiveSeconds = 1800 timeToIdleSeconds = 2700 diskPersistent = true diskExpiryThreadIntervalSeconds = 600 cacheEventListeners:  hitCount = 0 memoryStoreHitCount = 0 diskStoreHitCount = 0 missCountNotFound = 0 missCountExpired = 0 ]
2008-04-15 01:13:40,328 [main] WARN  PlexusLifecycleBeanPostProcessor - No loggerManager set in context. Falling back to ConsoleLoggerManager
[INFO] Disposing cache: [ name = url-failures-cache status = STATUS_ALIVE eternal = false overflowToDisk = false maxElementsInMemory = 1000 maxElementsOnDisk = 0 memoryStoreEvictionPolicy = LRU timeToLiveSeconds = 1800 timeToIdleSeconds = 2700 diskPersistent = true diskExpiryThreadIntervalSeconds = 600 cacheEventListeners:  hitCount = 0 memoryStoreHitCount = 0 diskStoreHitCount = 0 missCountNotFound = 0 missCountExpired = 0 ]
2008-04-15 01:13:40,847 [main] WARN  PlexusLifecycleBeanPostProcessor - No loggerManager set in context. Falling back to ConsoleLoggerManager
[INFO] Disposing cache: [ name = url-failures-cache status = STATUS_ALIVE eternal = false overflowToDisk = false maxElementsInMemory = 1000 maxElementsOnDisk = 0 memoryStoreEvictionPolicy = LRU timeToLiveSeconds = 1800 timeToIdleSeconds = 2700 diskPersistent = true diskExpiryThreadIntervalSeconds = 600 cacheEventListeners:  hitCount = 0 memoryStoreHitCount = 0 diskStoreHitCount = 0 missCountNotFound = 0 missCountExpired = 0 ]
2008-04-15 01:13:41,248 [main] WARN  PlexusLifecycleBeanPostProcessor - No loggerManager set in context. Falling back to ConsoleLoggerManager
[INFO] Disposing cache: [ name = url-failures-cache status = STATUS_ALIVE eternal = false overflowToDisk = false maxElementsInMemory = 1000 maxElementsOnDisk = 0 memoryStoreEvictionPolicy = LRU timeToLiveSeconds = 1800 timeToIdleSeconds = 2700 diskPersistent = true diskExpiryThreadIntervalSeconds = 600 cacheEventListeners:  hitCount = 0 memoryStoreHitCount = 0 diskStoreHitCount = 0 missCountNotFound = 0 missCountExpired = 0 ]
2008-04-15 01:13:41,700 [main] WARN  PlexusLifecycleBeanPostProcessor - No loggerManager set in context. Falling back to ConsoleLoggerManager
[INFO] Disposing cache: [ name = url-failures-cache status = STATUS_ALIVE eternal = false overflowToDisk = false maxElementsInMemory = 1000 maxElementsOnDisk = 0 memoryStoreEvictionPolicy = LRU timeToLiveSeconds = 1800 timeToIdleSeconds = 2700 diskPersistent = true diskExpiryThreadIntervalSeconds = 600 cacheEventListeners:  hitCount = 0 memoryStoreHitCount = 0 diskStoreHitCount = 0 missCountNotFound = 0 missCountExpired = 0 ]
2008-04-15 01:13:42,078 [main] WARN  PlexusLifecycleBeanPostProcessor - No loggerManager set in context. Falling back to ConsoleLoggerManager
[INFO] Disposing cache: [ name = url-failures-cache status = STATUS_ALIVE eternal = false overflowToDisk = false maxElementsInMemory = 1000 maxElementsOnDisk = 0 memoryStoreEvictionPolicy = LRU timeToLiveSeconds = 1800 timeToIdleSeconds = 2700 diskPersistent = true diskExpiryThreadIntervalSeconds = 600 cacheEventListeners:  hitCount = 0 memoryStoreHitCount = 0 diskStoreHitCount = 0 missCountNotFound = 0 missCountExpired = 0 ]
2008-04-15 01:13:42,628 [main] WARN  PlexusLifecycleBeanPostProcessor - No loggerManager set in context. Falling back to ConsoleLoggerManager
[INFO] Disposing cache: [ name = url-failures-cache status = STATUS_ALIVE eternal = false overflowToDisk = false maxElementsInMemory = 1000 maxElementsOnDisk = 0 memoryStoreEvictionPolicy = LRU timeToLiveSeconds = 1800 timeToIdleSeconds = 2700 diskPersistent = true diskExpiryThreadIntervalSeconds = 600 cacheEventListeners:  hitCount = 0 memoryStoreHitCount = 0 diskStoreHitCount = 0 missCountNotFound = 0 missCountExpired = 0 ]
2008-04-15 01:13:43,054 [main] WARN  PlexusLifecycleBeanPostProcessor - No loggerManager set in context. Falling back to ConsoleLoggerManager
[INFO] Disposing cache: [ name = url-failures-cache status = STATUS_ALIVE eternal = false overflowToDisk = false maxElementsInMemory = 1000 maxElementsOnDisk = 0 memoryStoreEvictionPolicy = LRU timeToLiveSeconds = 1800 timeToIdleSeconds = 2700 diskPersistent = true diskExpiryThreadIntervalSeconds = 600 cacheEventListeners:  hitCount = 0 memoryStoreHitCount = 0 diskStoreHitCount = 0 missCountNotFound = 0 missCountExpired = 0 ]
2008-04-15 01:13:43,380 [main] WARN  PlexusLifecycleBeanPostProcessor - No loggerManager set in context. Falling back to ConsoleLoggerManager
[INFO] Disposing cache: [ name = url-failures-cache status = STATUS_ALIVE eternal = false overflowToDisk = false maxElementsInMemory = 1000 maxElementsOnDisk = 0 memoryStoreEvictionPolicy = LRU timeToLiveSeconds = 1800 timeToIdleSeconds = 2700 diskPersistent = true diskExpiryThreadIntervalSeconds = 600 cacheEventListeners:  hitCount = 0 memoryStoreHitCount = 0 diskStoreHitCount = 0 missCountNotFound = 0 missCountExpired = 0 ]
2008-04-15 01:13:43,698 [main] WARN  PlexusLifecycleBeanPostProcessor - No loggerManager set in context. Falling back to ConsoleLoggerManager
[INFO] Disposing cache: [ name = url-failures-cache status = STATUS_ALIVE eternal = false overflowToDisk = false maxElementsInMemory = 1000 maxElementsOnDisk = 0 memoryStoreEvictionPolicy = LRU timeToLiveSeconds = 1800 timeToIdleSeconds = 2700 diskPersistent = true diskExpiryThreadIntervalSeconds = 600 cacheEventListeners:  hitCount = 0 memoryStoreHitCount = 0 diskStoreHitCount = 0 missCountNotFound = 0 missCountExpired = 0 ]
2008-04-15 01:13:44,113 [main] WARN  PlexusLifecycleBeanPostProcessor - No loggerManager set in context. Falling back to ConsoleLoggerManager
[INFO] Disposing cache: [ name = url-failures-cache status = STATUS_ALIVE eternal = false overflowToDisk = false maxElementsInMemory = 1000 maxElementsOnDisk = 0 memoryStoreEvictionPolicy = LRU timeToLiveSeconds = 1800 timeToIdleSeconds = 2700 diskPersistent = true diskExpiryThreadIntervalSeconds = 600 cacheEventListeners:  hitCount = 0 memoryStoreHitCount = 0 diskStoreHitCount = 0 missCountNotFound = 0 missCountExpired = 0 ]
2008-04-15 01:13:44,354 [main] WARN  PlexusLifecycleBeanPostProcessor - No loggerManager set in context. Falling back to ConsoleLoggerManager
[INFO] Disposing cache: [ name = url-failures-cache status = STATUS_ALIVE eternal = false overflowToDisk = false maxElementsInMemory = 1000 maxElementsOnDisk = 0 memoryStoreEvictionPolicy = LRU timeToLiveSeconds = 1800 timeToIdleSeconds = 2700 diskPersistent = true diskExpiryThreadIntervalSeconds = 600 cacheEventListeners:  hitCount = 0 memoryStoreHitCount = 0 diskStoreHitCount = 0 missCountNotFound = 0 missCountExpired = 0 ]
2008-04-15 01:13:44,726 [main] WARN  PlexusLifecycleBeanPostProcessor - No loggerManager set in context. Falling back to ConsoleLoggerManager
[INFO] Disposing cache: [ name = url-failures-cache status = STATUS_ALIVE eternal = false overflowToDisk = false maxElementsInMemory = 1000 maxElementsOnDisk = 0 memoryStoreEvictionPolicy = LRU timeToLiveSeconds = 1800 timeToIdleSeconds = 2700 diskPersistent = true diskExpiryThreadIntervalSeconds = 600 cacheEventListeners:  hitCount = 0 memoryStoreHitCount = 0 diskStoreHitCount = 0 missCountNotFound = 0 missCountExpired = 0 ]
2008-04-15 01:13:45,095 [main] WARN  PlexusLifecycleBeanPostProcessor - No loggerManager set in context. Falling back to ConsoleLoggerManager
[INFO] Disposing cache: [ name = url-failures-cache status = STATUS_ALIVE eternal = false overflowToDisk = false maxElementsInMemory = 1000 maxElementsOnDisk = 0 memoryStoreEvictionPolicy = LRU timeToLiveSeconds = 1800 timeToIdleSeconds = 2700 diskPersistent = true diskExpiryThreadIntervalSeconds = 600 cacheEventListeners:  hitCount = 0 memoryStoreHitCount = 0 diskStoreHitCount = 0 missCountNotFound = 0 missCountExpired = 0 ]
2008-04-15 01:13:45,336 [main] WARN  PlexusLifecycleBeanPostProcessor - No loggerManager set in context. Falling back to ConsoleLoggerManager
[INFO] Disposing cache: [ name = url-failures-cache status = STATUS_ALIVE eternal = false overflowToDisk = false maxElementsInMemory = 1000 maxElementsOnDisk = 0 memoryStoreEvictionPolicy = LRU timeToLiveSeconds = 1800 timeToIdleSeconds = 2700 diskPersistent = true diskExpiryThreadIntervalSeconds = 600 cacheEventListeners:  hitCount = 0 memoryStoreHitCount = 0 diskStoreHitCount = 0 missCountNotFound = 0 missCountExpired = 0 ]
2008-04-15 01:13:45,678 [main] WARN  PlexusLifecycleBeanPostProcessor - No loggerManager set in context. Falling back to ConsoleLoggerManager
[INFO] Disposing cache: [ name = url-failures-cache status = STATUS_ALIVE eternal = false overflowToDisk = false maxElementsInMemory = 1000 maxElementsOnDisk = 0 memoryStoreEvictionPolicy = LRU timeToLiveSeconds = 1800 timeToIdleSeconds = 2700 diskPersistent = true diskExpiryThreadIntervalSeconds = 600 cacheEventListeners:  hitCount = 0 memoryStoreHitCount = 0 diskStoreHitCount = 0 missCountNotFound = 0 missCountExpired = 0 ]
2008-04-15 01:13:45,821 [main] WARN  PlexusLifecycleBeanPostProcessor - No loggerManager set in context. Falling back to ConsoleLoggerManager
[INFO] Disposing cache: [ name = url-failures-cache status = STATUS_ALIVE eternal = false overflowToDisk = false maxElementsInMemory = 1000 maxElementsOnDisk = 0 memoryStoreEvictionPolicy = LRU timeToLiveSeconds = 1800 timeToIdleSeconds = 2700 diskPersistent = true diskExpiryThreadIntervalSeconds = 600 cacheEventListeners:  hitCount = 0 memoryStoreHitCount = 0 diskStoreHitCount = 0 missCountNotFound = 0 missCountExpired = 0 ]
2008-04-15 01:13:46,107 [main] WARN  PlexusLifecycleBeanPostProcessor - No loggerManager set in context. Falling back to ConsoleLoggerManager
[INFO] Disposing cache: [ name = url-failures-cache status = STATUS_ALIVE eternal = false overflowToDisk = false maxElementsInMemory = 1000 maxElementsOnDisk = 0 memoryStoreEvictionPolicy = LRU timeToLiveSeconds = 1800 timeToIdleSeconds = 2700 diskPersistent = true diskExpiryThreadIntervalSeconds = 600 cacheEventListeners:  hitCount = 0 memoryStoreHitCount = 0 diskStoreHitCount = 0 missCountNotFound = 0 missCountExpired = 0 ]
2008-04-15 01:13:46,419 [main] WARN  PlexusLifecycleBeanPostProcessor - No loggerManager set in context. Falling back to ConsoleLoggerManager
[INFO] Disposing cache: [ name = url-failures-cache status = STATUS_ALIVE eternal = false overflowToDisk = false maxElementsInMemory = 1000 maxElementsOnDisk = 0 memoryStoreEvictionPolicy = LRU timeToLiveSeconds = 1800 timeToIdleSeconds = 2700 diskPersistent = true diskExpiryThreadIntervalSeconds = 600 cacheEventListeners:  hitCount = 0 memoryStoreHitCount = 0 diskStoreHitCount = 0 missCountNotFound = 0 missCountExpired = 0 ]
2008-04-15 01:13:46,573 [main] WARN  PlexusLifecycleBeanPostProcessor - No loggerManager set in context. Falling back to ConsoleLoggerManager
[INFO] Disposing cache: [ name = url-failures-cache status = STATUS_ALIVE eternal = false overflowToDisk = false maxElementsInMemory = 1000 maxElementsOnDisk = 0 memoryStoreEvictionPolicy = LRU timeToLiveSeconds = 1800 timeToIdleSeconds = 2700 diskPersistent = true diskExpiryThreadIntervalSeconds = 600 cacheEventListeners:  hitCount = 0 memoryStoreHitCount = 0 diskStoreHitCount = 0 missCountNotFound = 0 missCountExpired = 0 ]
2008-04-15 01:13:46,878 [main] WARN  PlexusLifecycleBeanPostProcessor - No loggerManager set in context. Falling back to ConsoleLoggerManager
[INFO] Disposing cache: [ name = url-failures-cache status = STATUS_ALIVE eternal = false overflowToDisk = false maxElementsInMemory = 1000 maxElementsOnDisk = 0 memoryStoreEvictionPolicy = LRU timeToLiveSeconds = 1800 timeToIdleSeconds = 2700 diskPersistent = true diskExpiryThreadIntervalSeconds = 600 cacheEventListeners:  hitCount = 0 memoryStoreHitCount = 0 diskStoreHitCount = 0 missCountNotFound = 0 missCountExpired = 0 ]
Tests run: 22, Failures: 0, Errors: 0, Skipped: 0, Time elapsed: 10.174 sec
Running org.apache.maven.archiva.repository.metadata.MetadataToolsTest
2008-04-15 01:13:47,143 [main] WARN  PlexusLifecycleBeanPostProcessor - No loggerManager set in context. Falling back to ConsoleLoggerManager
2008-04-15 01:13:47,193 [main] ERROR PlexusComponentFactoryBean     - No field checksums on implementation class class org.apache.maven.archiva.repository.metadata.MetadataTools
2008-04-15 01:13:47,538 [main] WARN  PlexusLifecycleBeanPostProcessor - No loggerManager set in context. Falling back to ConsoleLoggerManager
2008-04-15 01:13:47,707 [main] WARN  PlexusLifecycleBeanPostProcessor - No loggerManager set in context. Falling back to ConsoleLoggerManager
2008-04-15 01:13:47,912 [main] WARN  PlexusLifecycleBeanPostProcessor - No loggerManager set in context. Falling back to ConsoleLoggerManager
2008-04-15 01:13:48,134 [main] WARN  PlexusLifecycleBeanPostProcessor - No loggerManager set in context. Falling back to ConsoleLoggerManager
2008-04-15 01:13:48,273 [main] WARN  PlexusLifecycleBeanPostProcessor - No loggerManager set in context. Falling back to ConsoleLoggerManager
2008-04-15 01:13:48,550 [main] WARN  PlexusLifecycleBeanPostProcessor - No loggerManager set in context. Falling back to ConsoleLoggerManager
2008-04-15 01:13:48,741 [main] WARN  PlexusLifecycleBeanPostProcessor - No loggerManager set in context. Falling back to ConsoleLoggerManager
2008-04-15 01:13:48,871 [main] WARN  PlexusLifecycleBeanPostProcessor - No loggerManager set in context. Falling back to ConsoleLoggerManager
2008-04-15 01:13:49,175 [main] WARN  PlexusLifecycleBeanPostProcessor - No loggerManager set in context. Falling back to ConsoleLoggerManager
2008-04-15 01:13:49,338 [main] WARN  PlexusLifecycleBeanPostProcessor - No loggerManager set in context. Falling back to ConsoleLoggerManager
2008-04-15 01:13:49,549 [main] WARN  PlexusLifecycleBeanPostProcessor - No loggerManager set in context. Falling back to ConsoleLoggerManager
2008-04-15 01:13:49,835 [main] WARN  PlexusLifecycleBeanPostProcessor - No loggerManager set in context. Falling back to ConsoleLoggerManager
2008-04-15 01:13:50,005 [main] WARN  PlexusLifecycleBeanPostProcessor - No loggerManager set in context. Falling back to ConsoleLoggerManager
2008-04-15 01:13:50,276 [main] WARN  PlexusLifecycleBeanPostProcessor - No loggerManager set in context. Falling back to ConsoleLoggerManager
2008-04-15 01:13:50,450 [main] WARN  PlexusLifecycleBeanPostProcessor - No loggerManager set in context. Falling back to ConsoleLoggerManager
2008-04-15 01:13:50,781 [main] WARN  PlexusLifecycleBeanPostProcessor - No loggerManager set in context. Falling back to ConsoleLoggerManager
2008-04-15 01:13:51,122 [main] WARN  PlexusLifecycleBeanPostProcessor - No loggerManager set in context. Falling back to ConsoleLoggerManager
2008-04-15 01:13:51,253 [main] WARN  PlexusLifecycleBeanPostProcessor - No loggerManager set in context. Falling back to ConsoleLoggerManager
2008-04-15 01:13:51,584 [main] WARN  PlexusLifecycleBeanPostProcessor - No loggerManager set in context. Falling back to ConsoleLoggerManager
Tests run: 20, Failures: 0, Errors: 20, Skipped: 0, Time elapsed: 4.704 sec <<< FAILURE!
Running org.apache.maven.archiva.repository.metadata.RepositoryMetadataReaderTest
2008-04-15 01:13:51,757 [main] WARN  PlexusLifecycleBeanPostProcessor - No loggerManager set in context. Falling back to ConsoleLoggerManager
2008-04-15 01:13:51,950 [main] WARN  PlexusLifecycleBeanPostProcessor - No loggerManager set in context. Falling back to ConsoleLoggerManager
Tests run: 2, Failures: 0, Errors: 2, Skipped: 0, Time elapsed: 0.332 sec <<< FAILURE!
Running org.apache.maven.archiva.repository.content.ManagedLegacyRepositoryContentTest
2008-04-15 01:13:52,246 [main] WARN  PlexusLifecycleBeanPostProcessor - No loggerManager set in context. Falling back to ConsoleLoggerManager
2008-04-15 01:13:52,360 [main] WARN  PlexusLifecycleBeanPostProcessor - No loggerManager set in context. Falling back to ConsoleLoggerManager
2008-04-15 01:13:52,490 [main] WARN  PlexusLifecycleBeanPostProcessor - No loggerManager set in context. Falling back to ConsoleLoggerManager
2008-04-15 01:13:52,769 [main] WARN  PlexusLifecycleBeanPostProcessor - No loggerManager set in context. Falling back to ConsoleLoggerManager
2008-04-15 01:13:52,880 [main] WARN  PlexusLifecycleBeanPostProcessor - No loggerManager set in context. Falling back to ConsoleLoggerManager
2008-04-15 01:13:53,000 [main] WARN  PlexusLifecycleBeanPostProcessor - No loggerManager set in context. Falling back to ConsoleLoggerManager
2008-04-15 01:13:53,115 [main] WARN  PlexusLifecycleBeanPostProcessor - No loggerManager set in context. Falling back to ConsoleLoggerManager
2008-04-15 01:13:53,368 [main] WARN  PlexusLifecycleBeanPostProcessor - No loggerManager set in context. Falling back to ConsoleLoggerManager
2008-04-15 01:13:53,488 [main] WARN  PlexusLifecycleBeanPostProcessor - No loggerManager set in context. Falling back to ConsoleLoggerManager
2008-04-15 01:13:53,668 [main] WARN  PlexusLifecycleBeanPostProcessor - No loggerManager set in context. Falling back to ConsoleLoggerManager
2008-04-15 01:13:53,856 [main] WARN  PlexusLifecycleBeanPostProcessor - No loggerManager set in context. Falling back to ConsoleLoggerManager
2008-04-15 01:13:54,045 [main] WARN  PlexusLifecycleBeanPostProcessor - No loggerManager set in context. Falling back to ConsoleLoggerManager
2008-04-15 01:13:54,204 [main] WARN  PlexusLifecycleBeanPostProcessor - No loggerManager set in context. Falling back to ConsoleLoggerManager
2008-04-15 01:13:54,397 [main] WARN  PlexusLifecycleBeanPostProcessor - No loggerManager set in context. Falling back to ConsoleLoggerManager
2008-04-15 01:13:54,586 [main] WARN  PlexusLifecycleBeanPostProcessor - No loggerManager set in context. Falling back to ConsoleLoggerManager
2008-04-15 01:13:54,711 [main] WARN  PlexusLifecycleBeanPostProcessor - No loggerManager set in context. Falling back to ConsoleLoggerManager
2008-04-15 01:13:54,968 [main] WARN  PlexusLifecycleBeanPostProcessor - No loggerManager set in context. Falling back to ConsoleLoggerManager
2008-04-15 01:13:55,076 [main] WARN  PlexusLifecycleBeanPostProcessor - No loggerManager set in context. Falling back to ConsoleLoggerManager
2008-04-15 01:13:55,201 [main] WARN  PlexusLifecycleBeanPostProcessor - No loggerManager set in context. Falling back to ConsoleLoggerManager
2008-04-15 01:13:55,453 [main] WARN  PlexusLifecycleBeanPostProcessor - No loggerManager set in context. Falling back to ConsoleLoggerManager
2008-04-15 01:13:55,580 [main] WARN  PlexusLifecycleBeanPostProcessor - No loggerManager set in context. Falling back to ConsoleLoggerManager
2008-04-15 01:13:55,845 [main] WARN  PlexusLifecycleBeanPostProcessor - No loggerManager set in context. Falling back to ConsoleLoggerManager
2008-04-15 01:13:55,960 [main] WARN  PlexusLifecycleBeanPostProcessor - No loggerManager set in context. Falling back to ConsoleLoggerManager
2008-04-15 01:13:56,130 [main] WARN  PlexusLifecycleBeanPostProcessor - No loggerManager set in context. Falling back to ConsoleLoggerManager
2008-04-15 01:13:56,323 [main] WARN  PlexusLifecycleBeanPostProcessor - No loggerManager set in context. Falling back to ConsoleLoggerManager
Tests run: 25, Failures: 0, Errors: 25, Skipped: 0, Time elapsed: 4.409 sec <<< FAILURE!
Running org.apache.maven.archiva.repository.content.RemoteDefaultRepositoryContentTest
2008-04-15 01:13:56,507 [main] WARN  PlexusLifecycleBeanPostProcessor - No loggerManager set in context. Falling back to ConsoleLoggerManager
2008-04-15 01:13:56,786 [main] WARN  PlexusLifecycleBeanPostProcessor - No loggerManager set in context. Falling back to ConsoleLoggerManager
2008-04-15 01:13:56,919 [main] WARN  PlexusLifecycleBeanPostProcessor - No loggerManager set in context. Falling back to ConsoleLoggerManager
2008-04-15 01:13:57,048 [main] WARN  PlexusLifecycleBeanPostProcessor - No loggerManager set in context. Falling back to ConsoleLoggerManager
2008-04-15 01:13:57,304 [main] WARN  PlexusLifecycleBeanPostProcessor - No loggerManager set in context. Falling back to ConsoleLoggerManager
2008-04-15 01:13:57,436 [main] WARN  PlexusLifecycleBeanPostProcessor - No loggerManager set in context. Falling back to ConsoleLoggerManager
2008-04-15 01:13:57,563 [main] WARN  PlexusLifecycleBeanPostProcessor - No loggerManager set in context. Falling back to ConsoleLoggerManager
2008-04-15 01:13:57,750 [main] WARN  PlexusLifecycleBeanPostProcessor - No loggerManager set in context. Falling back to ConsoleLoggerManager
2008-04-15 01:13:57,949 [main] WARN  PlexusLifecycleBeanPostProcessor - No loggerManager set in context. Falling back to ConsoleLoggerManager
2008-04-15 01:13:58,058 [main] WARN  PlexusLifecycleBeanPostProcessor - No loggerManager set in context. Falling back to ConsoleLoggerManager
2008-04-15 01:13:58,179 [main] WARN  PlexusLifecycleBeanPostProcessor - No loggerManager set in context. Falling back to ConsoleLoggerManager
2008-04-15 01:13:58,427 [main] WARN  PlexusLifecycleBeanPostProcessor - No loggerManager set in context. Falling back to ConsoleLoggerManager
2008-04-15 01:13:58,557 [main] WARN  PlexusLifecycleBeanPostProcessor - No loggerManager set in context. Falling back to ConsoleLoggerManager
2008-04-15 01:13:58,831 [main] WARN  PlexusLifecycleBeanPostProcessor - No loggerManager set in context. Falling back to ConsoleLoggerManager
2008-04-15 01:13:58,940 [main] WARN  PlexusLifecycleBeanPostProcessor - No loggerManager set in context. Falling back to ConsoleLoggerManager
2008-04-15 01:13:59,086 [main] WARN  PlexusLifecycleBeanPostProcessor - No loggerManager set in context. Falling back to ConsoleLoggerManager
2008-04-15 01:13:59,333 [main] WARN  PlexusLifecycleBeanPostProcessor - No loggerManager set in context. Falling back to ConsoleLoggerManager
2008-04-15 01:13:59,448 [main] WARN  PlexusLifecycleBeanPostProcessor - No loggerManager set in context. Falling back to ConsoleLoggerManager
2008-04-15 01:13:59,632 [main] WARN  PlexusLifecycleBeanPostProcessor - No loggerManager set in context. Falling back to ConsoleLoggerManager
2008-04-15 01:13:59,891 [main] WARN  PlexusLifecycleBeanPostProcessor - No loggerManager set in context. Falling back to ConsoleLoggerManager
2008-04-15 01:14:00,006 [main] WARN  PlexusLifecycleBeanPostProcessor - No loggerManager set in context. Falling back to ConsoleLoggerManager
2008-04-15 01:14:00,110 [main] WARN  PlexusLifecycleBeanPostProcessor - No loggerManager set in context. Falling back to ConsoleLoggerManager
2008-04-15 01:14:00,366 [main] WARN  PlexusLifecycleBeanPostProcessor - No loggerManager set in context. Falling back to ConsoleLoggerManager
2008-04-15 01:14:00,488 [main] WARN  PlexusLifecycleBeanPostProcessor - No loggerManager set in context. Falling back to ConsoleLoggerManager
2008-04-15 01:14:00,768 [main] WARN  PlexusLifecycleBeanPostProcessor - No loggerManager set in context. Falling back to ConsoleLoggerManager
Tests run: 25, Failures: 0, Errors: 25, Skipped: 0, Time elapsed: 4.446 sec <<< FAILURE!
Running org.apache.maven.archiva.repository.project.filters.EffectiveProjectModelFilterTest
2008-04-15 01:14:00,951 [main] WARN  PlexusLifecycleBeanPostProcessor - No loggerManager set in context. Falling back to ConsoleLoggerManager
2008-04-15 01:14:01,172 [main] WARN  PlexusLifecycleBeanPostProcessor - No loggerManager set in context. Falling back to ConsoleLoggerManager
Tests run: 2, Failures: 0, Errors: 2, Skipped: 0, Time elapsed: 0.392 sec <<< FAILURE!
Running org.apache.maven.archiva.repository.metadata.RepositoryMetadataWriterTest
2008-04-15 01:14:01,328 [main] WARN  PlexusLifecycleBeanPostProcessor - No loggerManager set in context. Falling back to ConsoleLoggerManager
Tests run: 1, Failures: 0, Errors: 1, Skipped: 0, Time elapsed: 0.127 sec <<< FAILURE!
Running org.apache.maven.archiva.repository.project.writers.ProjectModel400WriterTest
2008-04-15 01:14:01,490 [main] WARN  PlexusLifecycleBeanPostProcessor - No loggerManager set in context. Falling back to ConsoleLoggerManager
2008-04-15 01:14:01,775 [main] WARN  PlexusLifecycleBeanPostProcessor - No loggerManager set in context. Falling back to ConsoleLoggerManager
2008-04-15 01:14:01,883 [main] WARN  PlexusLifecycleBeanPostProcessor - No loggerManager set in context. Falling back to ConsoleLoggerManager
2008-04-15 01:14:01,990 [main] WARN  PlexusLifecycleBeanPostProcessor - No loggerManager set in context. Falling back to ConsoleLoggerManager
Tests run: 4, Failures: 0, Errors: 4, Skipped: 0, Time elapsed: 0.666 sec <<< FAILURE!
Running org.apache.maven.archiva.repository.project.filters.ProjectModelExpressionExpanderTest
2008-04-15 01:14:02,110 [main] WARN  PlexusLifecycleBeanPostProcessor - No loggerManager set in context. Falling back to ConsoleLoggerManager
2008-04-15 01:14:02,360 [main] WARN  PlexusLifecycleBeanPostProcessor - No loggerManager set in context. Falling back to ConsoleLoggerManager
Tests run: 2, Failures: 0, Errors: 2, Skipped: 0, Time elapsed: 0.37 sec <<< FAILURE!
Running org.apache.maven.archiva.repository.RepositoryURLTest
Tests run: 6, Failures: 0, Errors: 0, Skipped: 0, Time elapsed: 0.01 sec
Running org.apache.maven.archiva.repository.scanner.RepositoryContentConsumersTest
2008-04-15 01:14:02,610 [main] WARN  PlexusLifecycleBeanPostProcessor - No loggerManager set in context. Falling back to ConsoleLoggerManager
2008-04-15 01:14:02,993 [main] WARN  PlexusLifecycleBeanPostProcessor - No loggerManager set in context. Falling back to ConsoleLoggerManager
2008-04-15 01:14:03,126 [main] WARN  PlexusLifecycleBeanPostProcessor - No loggerManager set in context. Falling back to ConsoleLoggerManager
2008-04-15 01:14:03,339 [main] WARN  PlexusLifecycleBeanPostProcessor - No loggerManager set in context. Falling back to ConsoleLoggerManager
2008-04-15 01:14:03,671 [main] WARN  PlexusLifecycleBeanPostProcessor - No loggerManager set in context. Falling back to ConsoleLoggerManager
2008-04-15 01:14:03,843 [main] WARN  PlexusLifecycleBeanPostProcessor - No loggerManager set in context. Falling back to ConsoleLoggerManager
2008-04-15 01:14:04,099 [main] WARN  PlexusLifecycleBeanPostProcessor - No loggerManager set in context. Falling back to ConsoleLoggerManager
Tests run: 7, Failures: 0, Errors: 7, Skipped: 0, Time elapsed: 1.76 sec <<< FAILURE!
Running org.apache.maven.archiva.repository.content.ArtifactExtensionMappingTest
2008-04-15 01:14:04,358 [main] WARN  PlexusLifecycleBeanPostProcessor - No loggerManager set in context. Falling back to ConsoleLoggerManager
Tests run: 1, Failures: 0, Errors: 1, Skipped: 0, Time elapsed: 0.232 sec <<< FAILURE!
Running org.apache.maven.archiva.repository.project.readers.ProjectModel300ReaderTest
2008-04-15 01:14:04,539 [main] WARN  PlexusLifecycleBeanPostProcessor - No loggerManager set in context. Falling back to ConsoleLoggerManager
Tests run: 1, Failures: 0, Errors: 1, Skipped: 0, Time elapsed: 0.183 sec <<< FAILURE!
Running org.apache.maven.archiva.repository.content.ManagedDefaultRepositoryContentTest
2008-04-15 01:14:04,780 [main] WARN  PlexusLifecycleBeanPostProcessor - No loggerManager set in context. Falling back to ConsoleLoggerManager
2008-04-15 01:14:04,987 [main] WARN  PlexusLifecycleBeanPostProcessor - No loggerManager set in context. Falling back to ConsoleLoggerManager
2008-04-15 01:14:05,193 [main] WARN  PlexusLifecycleBeanPostProcessor - No loggerManager set in context. Falling back to ConsoleLoggerManager
2008-04-15 01:14:05,312 [main] WARN  PlexusLifecycleBeanPostProcessor - No loggerManager set in context. Falling back to ConsoleLoggerManager
2008-04-15 01:14:05,609 [main] WARN  PlexusLifecycleBeanPostProcessor - No loggerManager set in context. Falling back to ConsoleLoggerManager
2008-04-15 01:14:05,811 [main] WARN  PlexusLifecycleBeanPostProcessor - No loggerManager set in context. Falling back to ConsoleLoggerManager
2008-04-15 01:14:06,066 [main] WARN  PlexusLifecycleBeanPostProcessor - No loggerManager set in context. Falling back to ConsoleLoggerManager
2008-04-15 01:14:06,176 [main] WARN  PlexusLifecycleBeanPostProcessor - No loggerManager set in context. Falling back to ConsoleLoggerManager
2008-04-15 01:14:06,370 [main] WARN  PlexusLifecycleBeanPostProcessor - No loggerManager set in context. Falling back to ConsoleLoggerManager
2008-04-15 01:14:06,673 [main] WARN  PlexusLifecycleBeanPostProcessor - No loggerManager set in context. Falling back to ConsoleLoggerManager
2008-04-15 01:14:06,789 [main] WARN  PlexusLifecycleBeanPostProcessor - No loggerManager set in context. Falling back to ConsoleLoggerManager
2008-04-15 01:14:07,062 [main] WARN  PlexusLifecycleBeanPostProcessor - No loggerManager set in context. Falling back to ConsoleLoggerManager
2008-04-15 01:14:07,257 [main] WARN  PlexusLifecycleBeanPostProcessor - No loggerManager set in context. Falling back to ConsoleLoggerManager
2008-04-15 01:14:07,364 [main] WARN  PlexusLifecycleBeanPostProcessor - No loggerManager set in context. Falling back to ConsoleLoggerManager
2008-04-15 01:14:07,639 [main] WARN  PlexusLifecycleBeanPostProcessor - No loggerManager set in context. Falling back to ConsoleLoggerManager
2008-04-15 01:14:07,855 [main] WARN  PlexusLifecycleBeanPostProcessor - No loggerManager set in context. Falling back to ConsoleLoggerManager
2008-04-15 01:14:08,050 [main] WARN  PlexusLifecycleBeanPostProcessor - No loggerManager set in context. Falling back to ConsoleLoggerManager
2008-04-15 01:14:08,243 [main] WARN  PlexusLifecycleBeanPostProcessor - No loggerManager set in context. Falling back to ConsoleLoggerManager
2008-04-15 01:14:08,445 [main] WARN  PlexusLifecycleBeanPostProcessor - No loggerManager set in context. Falling back to ConsoleLoggerManager
2008-04-15 01:14:08,731 [main] WARN  PlexusLifecycleBeanPostProcessor - No loggerManager set in context. Falling back to ConsoleLoggerManager
2008-04-15 01:14:08,855 [main] WARN  PlexusLifecycleBeanPostProcessor - No loggerManager set in context. Falling back to ConsoleLoggerManager
2008-04-15 01:14:09,127 [main] WARN  PlexusLifecycleBeanPostProcessor - No loggerManager set in context. Falling back to ConsoleLoggerManager
2008-04-15 01:14:09,328 [main] WARN  PlexusLifecycleBeanPostProcessor - No loggerManager set in context. Falling back to ConsoleLoggerManager
2008-04-15 01:14:09,696 [main] WARN  PlexusLifecycleBeanPostProcessor - No loggerManager set in context. Falling back to ConsoleLoggerManager
2008-04-15 01:14:09,960 [main] WARN  PlexusLifecycleBeanPostProcessor - No loggerManager set in context. Falling back to ConsoleLoggerManager
2008-04-15 01:14:10,210 [main] WARN  PlexusLifecycleBeanPostProcessor - No loggerManager set in context. Falling back to ConsoleLoggerManager
2008-04-15 01:14:10,418 [main] WARN  PlexusLifecycleBeanPostProcessor - No loggerManager set in context. Falling back to ConsoleLoggerManager
2008-04-15 01:14:10,678 [main] WARN  PlexusLifecycleBeanPostProcessor - No loggerManager set in context. Falling back to ConsoleLoggerManager
2008-04-15 01:14:10,869 [main] WARN  PlexusLifecycleBeanPostProcessor - No loggerManager set in context. Falling back to ConsoleLoggerManager
2008-04-15 01:14:11,141 [main] WARN  PlexusLifecycleBeanPostProcessor - No loggerManager set in context. Falling back to ConsoleLoggerManager
2008-04-15 01:14:11,251 [main] WARN  PlexusLifecycleBeanPostProcessor - No loggerManager set in context. Falling back to ConsoleLoggerManager
2008-04-15 01:14:11,519 [main] WARN  PlexusLifecycleBeanPostProcessor - No loggerManager set in context. Falling back to ConsoleLoggerManager
2008-04-15 01:14:11,738 [main] WARN  PlexusLifecycleBeanPostProcessor - No loggerManager set in context. Falling back to ConsoleLoggerManager
2008-04-15 01:14:12,012 [main] WARN  PlexusLifecycleBeanPostProcessor - No loggerManager set in context. Falling back to ConsoleLoggerManager
Tests run: 34, Failures: 0, Errors: 34, Skipped: 0, Time elapsed: 7.506 sec <<< FAILURE!
Running org.apache.maven.archiva.repository.content.LegacyPathParserTest
2008-04-15 01:14:12,177 [main] WARN  PlexusLifecycleBeanPostProcessor - No loggerManager set in context. Falling back to ConsoleLoggerManager
2008-04-15 01:14:12,425 [main] WARN  PlexusLifecycleBeanPostProcessor - No loggerManager set in context. Falling back to ConsoleLoggerManager
2008-04-15 01:14:12,543 [main] WARN  PlexusLifecycleBeanPostProcessor - No loggerManager set in context. Falling back to ConsoleLoggerManager
2008-04-15 01:14:12,808 [main] WARN  PlexusLifecycleBeanPostProcessor - No loggerManager set in context. Falling back to ConsoleLoggerManager
2008-04-15 01:14:12,925 [main] WARN  PlexusLifecycleBeanPostProcessor - No loggerManager set in context. Falling back to ConsoleLoggerManager
2008-04-15 01:14:13,030 [main] WARN  PlexusLifecycleBeanPostProcessor - No loggerManager set in context. Falling back to ConsoleLoggerManager
2008-04-15 01:14:13,284 [main] WARN  PlexusLifecycleBeanPostProcessor - No loggerManager set in context. Falling back to ConsoleLoggerManager
2008-04-15 01:14:13,393 [main] WARN  PlexusLifecycleBeanPostProcessor - No loggerManager set in context. Falling back to ConsoleLoggerManager
2008-04-15 01:14:13,596 [main] WARN  PlexusLifecycleBeanPostProcessor - No loggerManager set in context. Falling back to ConsoleLoggerManager
2008-04-15 01:14:13,803 [main] WARN  PlexusLifecycleBeanPostProcessor - No loggerManager set in context. Falling back to ConsoleLoggerManager
2008-04-15 01:14:13,907 [main] WARN  PlexusLifecycleBeanPostProcessor - No loggerManager set in context. Falling back to ConsoleLoggerManager
2008-04-15 01:14:14,111 [main] WARN  PlexusLifecycleBeanPostProcessor - No loggerManager set in context. Falling back to ConsoleLoggerManager
2008-04-15 01:14:14,278 [main] WARN  PlexusLifecycleBeanPostProcessor - No loggerManager set in context. Falling back to ConsoleLoggerManager
2008-04-15 01:14:14,458 [main] WARN  PlexusLifecycleBeanPostProcessor - No loggerManager set in context. Falling back to ConsoleLoggerManager
2008-04-15 01:14:14,637 [main] WARN  PlexusLifecycleBeanPostProcessor - No loggerManager set in context. Falling back to ConsoleLoggerManager
2008-04-15 01:14:14,833 [main] WARN  PlexusLifecycleBeanPostProcessor - No loggerManager set in context. Falling back to ConsoleLoggerManager
2008-04-15 01:14:15,014 [main] WARN  PlexusLifecycleBeanPostProcessor - No loggerManager set in context. Falling back to ConsoleLoggerManager
2008-04-15 01:14:15,206 [main] WARN  PlexusLifecycleBeanPostProcessor - No loggerManager set in context. Falling back to ConsoleLoggerManager
2008-04-15 01:14:15,323 [main] WARN  PlexusLifecycleBeanPostProcessor - No loggerManager set in context. Falling back to ConsoleLoggerManager
2008-04-15 01:14:15,430 [main] WARN  PlexusLifecycleBeanPostProcessor - No loggerManager set in context. Falling back to ConsoleLoggerManager
2008-04-15 01:14:15,717 [main] WARN  PlexusLifecycleBeanPostProcessor - No loggerManager set in context. Falling back to ConsoleLoggerManager
2008-04-15 01:14:15,861 [main] WARN  PlexusLifecycleBeanPostProcessor - No loggerManager set in context. Falling back to ConsoleLoggerManager
2008-04-15 01:14:16,101 [main] WARN  PlexusLifecycleBeanPostProcessor - No loggerManager set in context. Falling back to ConsoleLoggerManager
2008-04-15 01:14:16,219 [main] WARN  PlexusLifecycleBeanPostProcessor - No loggerManager set in context. Falling back to ConsoleLoggerManager
2008-04-15 01:14:16,519 [main] WARN  PlexusLifecycleBeanPostProcessor - No loggerManager set in context. Falling back to ConsoleLoggerManager
Tests run: 25, Failures: 0, Errors: 25, Skipped: 0, Time elapsed: 4.59 sec <<< FAILURE!
Running org.apache.maven.archiva.repository.scanner.RepositoryScannerTest
2008-04-15 01:14:16,918 [main] WARN  PlexusLifecycleBeanPostProcessor - No loggerManager set in context. Falling back to ConsoleLoggerManager
2008-04-15 01:14:17,087 [main] WARN  PlexusLifecycleBeanPostProcessor - No loggerManager set in context. Falling back to ConsoleLoggerManager
2008-04-15 01:14:17,209 [main] WARN  PlexusLifecycleBeanPostProcessor - No loggerManager set in context. Falling back to ConsoleLoggerManager
2008-04-15 01:14:17,407 [main] WARN  PlexusLifecycleBeanPostProcessor - No loggerManager set in context. Falling back to ConsoleLoggerManager
2008-04-15 01:14:17,591 [main] WARN  PlexusLifecycleBeanPostProcessor - No loggerManager set in context. Falling back to ConsoleLoggerManager
2008-04-15 01:14:17,727 [main] WARN  PlexusLifecycleBeanPostProcessor - No loggerManager set in context. Falling back to ConsoleLoggerManager
2008-04-15 01:14:17,971 [main] WARN  PlexusLifecycleBeanPostProcessor - No loggerManager set in context. Falling back to ConsoleLoggerManager
2008-04-15 01:14:18,108 [main] WARN  PlexusLifecycleBeanPostProcessor - No loggerManager set in context. Falling back to ConsoleLoggerManager
Tests run: 8, Failures: 0, Errors: 8, Skipped: 0, Time elapsed: 1.475 sec <<< FAILURE!
Running org.apache.maven.archiva.repository.content.DefaultPathParserTest
2008-04-15 01:14:18,323 [main] WARN  PlexusLifecycleBeanPostProcessor - No loggerManager set in context. Falling back to ConsoleLoggerManager
2008-04-15 01:14:18,430 [main] WARN  PlexusLifecycleBeanPostProcessor - No loggerManager set in context. Falling back to ConsoleLoggerManager
2008-04-15 01:14:18,697 [main] WARN  PlexusLifecycleBeanPostProcessor - No loggerManager set in context. Falling back to ConsoleLoggerManager
2008-04-15 01:14:18,851 [main] WARN  PlexusLifecycleBeanPostProcessor - No loggerManager set in context. Falling back to ConsoleLoggerManager
2008-04-15 01:14:18,972 [main] WARN  PlexusLifecycleBeanPostProcessor - No loggerManager set in context. Falling back to ConsoleLoggerManager
2008-04-15 01:14:19,154 [main] WARN  PlexusLifecycleBeanPostProcessor - No loggerManager set in context. Falling back to ConsoleLoggerManager
2008-04-15 01:14:19,324 [main] WARN  PlexusLifecycleBeanPostProcessor - No loggerManager set in context. Falling back to ConsoleLoggerManager
2008-04-15 01:14:19,438 [main] WARN  PlexusLifecycleBeanPostProcessor - No loggerManager set in context. Falling back to ConsoleLoggerManager
2008-04-15 01:14:19,707 [main] WARN  PlexusLifecycleBeanPostProcessor - No loggerManager set in context. Falling back to ConsoleLoggerManager
2008-04-15 01:14:19,814 [main] WARN  PlexusLifecycleBeanPostProcessor - No loggerManager set in context. Falling back to ConsoleLoggerManager
2008-04-15 01:14:20,093 [main] WARN  PlexusLifecycleBeanPostProcessor - No loggerManager set in context. Falling back to ConsoleLoggerManager
2008-04-15 01:14:20,198 [main] WARN  PlexusLifecycleBeanPostProcessor - No loggerManager set in context. Falling back to ConsoleLoggerManager
2008-04-15 01:14:20,444 [main] WARN  PlexusLifecycleBeanPostProcessor - No loggerManager set in context. Falling back to ConsoleLoggerManager
2008-04-15 01:14:20,555 [main] WARN  PlexusLifecycleBeanPostProcessor - No loggerManager set in context. Falling back to ConsoleLoggerManager
2008-04-15 01:14:20,820 [main] WARN  PlexusLifecycleBeanPostProcessor - No loggerManager set in context. Falling back to ConsoleLoggerManager
2008-04-15 01:14:20,930 [main] WARN  PlexusLifecycleBeanPostProcessor - No loggerManager set in context. Falling back to ConsoleLoggerManager
2008-04-15 01:14:21,179 [main] WARN  PlexusLifecycleBeanPostProcessor - No loggerManager set in context. Falling back to ConsoleLoggerManager
2008-04-15 01:14:21,284 [main] WARN  PlexusLifecycleBeanPostProcessor - No loggerManager set in context. Falling back to ConsoleLoggerManager
2008-04-15 01:14:21,477 [main] WARN  PlexusLifecycleBeanPostProcessor - No loggerManager set in context. Falling back to ConsoleLoggerManager
2008-04-15 01:14:21,653 [main] WARN  PlexusLifecycleBeanPostProcessor - No loggerManager set in context. Falling back to ConsoleLoggerManager
2008-04-15 01:14:21,903 [main] WARN  PlexusLifecycleBeanPostProcessor - No loggerManager set in context. Falling back to ConsoleLoggerManager
2008-04-15 01:14:22,060 [main] WARN  PlexusLifecycleBeanPostProcessor - No loggerManager set in context. Falling back to ConsoleLoggerManager
2008-04-15 01:14:22,257 [main] WARN  PlexusLifecycleBeanPostProcessor - No loggerManager set in context. Falling back to ConsoleLoggerManager
2008-04-15 01:14:22,371 [main] WARN  PlexusLifecycleBeanPostProcessor - No loggerManager set in context. Falling back to ConsoleLoggerManager
2008-04-15 01:14:22,630 [main] WARN  PlexusLifecycleBeanPostProcessor - No loggerManager set in context. Falling back to ConsoleLoggerManager
2008-04-15 01:14:22,773 [main] WARN  PlexusLifecycleBeanPostProcessor - No loggerManager set in context. Falling back to ConsoleLoggerManager
2008-04-15 01:14:23,031 [main] WARN  PlexusLifecycleBeanPostProcessor - No loggerManager set in context. Falling back to ConsoleLoggerManager
Tests run: 27, Failures: 0, Errors: 27, Skipped: 0, Time elapsed: 4.949 sec <<< FAILURE!
Running org.apache.maven.archiva.repository.project.readers.ProjectModel400ReaderTest
2008-04-15 01:14:23,182 [main] WARN  PlexusLifecycleBeanPostProcessor - No loggerManager set in context. Falling back to ConsoleLoggerManager
2008-04-15 01:14:23,358 [main] WARN  PlexusLifecycleBeanPostProcessor - No loggerManager set in context. Falling back to ConsoleLoggerManager
Tests run: 2, Failures: 0, Errors: 2, Skipped: 0, Time elapsed: 0.288 sec <<< FAILURE!
Running org.apache.maven.archiva.repository.content.RepositoryRequestTest
2008-04-15 01:14:23,552 [main] WARN  PlexusLifecycleBeanPostProcessor - No loggerManager set in context. Falling back to ConsoleLoggerManager
2008-04-15 01:14:23,823 [main] WARN  PlexusLifecycleBeanPostProcessor - No loggerManager set in context. Falling back to ConsoleLoggerManager
2008-04-15 01:14:23,947 [main] WARN  PlexusLifecycleBeanPostProcessor - No loggerManager set in context. Falling back to ConsoleLoggerManager
2008-04-15 01:14:24,080 [main] WARN  PlexusLifecycleBeanPostProcessor - No loggerManager set in context. Falling back to ConsoleLoggerManager
2008-04-15 01:14:24,370 [main] WARN  PlexusLifecycleBeanPostProcessor - No loggerManager set in context. Falling back to ConsoleLoggerManager
2008-04-15 01:14:24,531 [main] WARN  PlexusLifecycleBeanPostProcessor - No loggerManager set in context. Falling back to ConsoleLoggerManager
2008-04-15 01:14:24,851 [main] WARN  PlexusLifecycleBeanPostProcessor - No loggerManager set in context. Falling back to ConsoleLoggerManager
2008-04-15 01:14:25,058 [main] WARN  PlexusLifecycleBeanPostProcessor - No loggerManager set in context. Falling back to ConsoleLoggerManager
2008-04-15 01:14:25,267 [main] WARN  PlexusLifecycleBeanPostProcessor - No loggerManager set in context. Falling back to ConsoleLoggerManager
2008-04-15 01:14:25,395 [main] WARN  PlexusLifecycleBeanPostProcessor - No loggerManager set in context. Falling back to ConsoleLoggerManager
2008-04-15 01:14:25,624 [main] WARN  PlexusLifecycleBeanPostProcessor - No loggerManager set in context. Falling back to ConsoleLoggerManager
2008-04-15 01:14:25,845 [main] WARN  PlexusLifecycleBeanPostProcessor - No loggerManager set in context. Falling back to ConsoleLoggerManager
2008-04-15 01:14:26,066 [main] WARN  PlexusLifecycleBeanPostProcessor - No loggerManager set in context. Falling back to ConsoleLoggerManager
2008-04-15 01:14:26,440 [main] WARN  PlexusLifecycleBeanPostProcessor - No loggerManager set in context. Falling back to ConsoleLoggerManager
2008-04-15 01:14:26,738 [main] WARN  PlexusLifecycleBeanPostProcessor - No loggerManager set in context. Falling back to ConsoleLoggerManager
2008-04-15 01:14:27,054 [main] WARN  PlexusLifecycleBeanPostProcessor - No loggerManager set in context. Falling back to ConsoleLoggerManager
2008-04-15 01:14:27,266 [main] WARN  PlexusLifecycleBeanPostProcessor - No loggerManager set in context. Falling back to ConsoleLoggerManager
2008-04-15 01:14:27,477 [main] WARN  PlexusLifecycleBeanPostProcessor - No loggerManager set in context. Falling back to ConsoleLoggerManager
2008-04-15 01:14:27,802 [main] WARN  PlexusLifecycleBeanPostProcessor - No loggerManager set in context. Falling back to ConsoleLoggerManager
2008-04-15 01:14:27,962 [main] WARN  PlexusLifecycleBeanPostProcessor - No loggerManager set in context. Falling back to ConsoleLoggerManager
2008-04-15 01:14:28,266 [main] WARN  PlexusLifecycleBeanPostProcessor - No loggerManager set in context. Falling back to ConsoleLoggerManager
2008-04-15 01:14:28,399 [main] WARN  PlexusLifecycleBeanPostProcessor - No loggerManager set in context. Falling back to ConsoleLoggerManager
2008-04-15 01:14:28,624 [main] WARN  PlexusLifecycleBeanPostProcessor - No loggerManager set in context. Falling back to ConsoleLoggerManager
2008-04-15 01:14:28,827 [main] WARN  PlexusLifecycleBeanPostProcessor - No loggerManager set in context. Falling back to ConsoleLoggerManager
2008-04-15 01:14:29,052 [main] WARN  PlexusLifecycleBeanPostProcessor - No loggerManager set in context. Falling back to ConsoleLoggerManager
2008-04-15 01:14:29,282 [main] WARN  PlexusLifecycleBeanPostProcessor - No loggerManager set in context. Falling back to ConsoleLoggerManager
2008-04-15 01:14:29,477 [main] WARN  PlexusLifecycleBeanPostProcessor - No loggerManager set in context. Falling back to ConsoleLoggerManager
2008-04-15 01:14:29,714 [main] WARN  PlexusLifecycleBeanPostProcessor - No loggerManager set in context. Falling back to ConsoleLoggerManager
2008-04-15 01:14:29,993 [main] WARN  PlexusLifecycleBeanPostProcessor - No loggerManager set in context. Falling back to ConsoleLoggerManager
2008-04-15 01:14:30,267 [main] WARN  PlexusLifecycleBeanPostProcessor - No loggerManager set in context. Falling back to ConsoleLoggerManager
2008-04-15 01:14:30,390 [main] WARN  PlexusLifecycleBeanPostProcessor - No loggerManager set in context. Falling back to ConsoleLoggerManager
2008-04-15 01:14:30,616 [main] WARN  PlexusLifecycleBeanPostProcessor - No loggerManager set in context. Falling back to ConsoleLoggerManager
2008-04-15 01:14:30,929 [main] WARN  PlexusLifecycleBeanPostProcessor - No loggerManager set in context. Falling back to ConsoleLoggerManager
2008-04-15 01:14:31,050 [main] WARN  PlexusLifecycleBeanPostProcessor - No loggerManager set in context. Falling back to ConsoleLoggerManager
2008-04-15 01:14:31,343 [main] WARN  PlexusLifecycleBeanPostProcessor - No loggerManager set in context. Falling back to ConsoleLoggerManager
2008-04-15 01:14:31,570 [main] WARN  PlexusLifecycleBeanPostProcessor - No loggerManager set in context. Falling back to ConsoleLoggerManager
2008-04-15 01:14:31,858 [main] WARN  PlexusLifecycleBeanPostProcessor - No loggerManager set in context. Falling back to ConsoleLoggerManager
2008-04-15 01:14:32,007 [main] WARN  PlexusLifecycleBeanPostProcessor - No loggerManager set in context. Falling back to ConsoleLoggerManager
2008-04-15 01:14:32,278 [main] WARN  PlexusLifecycleBeanPostProcessor - No loggerManager set in context. Falling back to ConsoleLoggerManager
2008-04-15 01:14:32,491 [main] WARN  PlexusLifecycleBeanPostProcessor - No loggerManager set in context. Falling back to ConsoleLoggerManager
2008-04-15 01:14:32,687 [main] WARN  PlexusLifecycleBeanPostProcessor - No loggerManager set in context. Falling back to ConsoleLoggerManager
2008-04-15 01:14:32,920 [main] WARN  PlexusLifecycleBeanPostProcessor - No loggerManager set in context. Falling back to ConsoleLoggerManager
2008-04-15 01:14:33,096 [main] WARN  PlexusLifecycleBeanPostProcessor - No loggerManager set in context. Falling back to ConsoleLoggerManager
2008-04-15 01:14:33,307 [main] WARN  PlexusLifecycleBeanPostProcessor - No loggerManager set in context. Falling back to ConsoleLoggerManager
2008-04-15 01:14:33,516 [main] WARN  PlexusLifecycleBeanPostProcessor - No loggerManager set in context. Falling back to ConsoleLoggerManager
2008-04-15 01:14:33,714 [main] WARN  PlexusLifecycleBeanPostProcessor - No loggerManager set in context. Falling back to ConsoleLoggerManager
Tests run: 46, Failures: 0, Errors: 46, Skipped: 0, Time elapsed: 10.416 sec <<< FAILURE!
Running org.apache.maven.archiva.repository.content.FilenameParserTest
Tests run: 16, Failures: 0, Errors: 0, Skipped: 0, Time elapsed: 0.017 sec

Results :

Tests in error: 
  testGatherSnapshotVersionsA(org.apache.maven.archiva.repository.metadata.MetadataToolsTest)
  testGatherSnapshotVersionsAWithProxies(org.apache.maven.archiva.repository.metadata.MetadataToolsTest)
  testGetRepositorySpecificName(org.apache.maven.archiva.repository.metadata.MetadataToolsTest)
  testUpdateProjectMissingMultipleVersions(org.apache.maven.archiva.repository.metadata.MetadataToolsTest)
  testUpdateProjectMissingMultipleVersionsWithProxies(org.apache.maven.archiva.repository.metadata.MetadataToolsTest)
  testUpdateProjectSimpleYetIncomplete(org.apache.maven.archiva.repository.metadata.MetadataToolsTest)
  testUpdateProjectSimpleYetMissing(org.apache.maven.archiva.repository.metadata.MetadataToolsTest)
  testUpdateVersionSimple10(org.apache.maven.archiva.repository.metadata.MetadataToolsTest)
  testUpdateVersionSimple20(org.apache.maven.archiva.repository.metadata.MetadataToolsTest)
  testUpdateVersionSimple20NotSnapshot(org.apache.maven.archiva.repository.metadata.MetadataToolsTest)
  testUpdateVersionSnapshotA(org.apache.maven.archiva.repository.metadata.MetadataToolsTest)
  testToPathFromVersionReference(org.apache.maven.archiva.repository.metadata.MetadataToolsTest)
  testToPathFromProjectReference(org.apache.maven.archiva.repository.metadata.MetadataToolsTest)
  testToProjectReferenceFooTools(org.apache.maven.archiva.repository.metadata.MetadataToolsTest)
  testToProjectReferenceAReallyLongPath(org.apache.maven.archiva.repository.metadata.MetadataToolsTest)
  testToProjectReferenceCommonsLang(org.apache.maven.archiva.repository.metadata.MetadataToolsTest)
  testToVersionedReferenceFooTool(org.apache.maven.archiva.repository.metadata.MetadataToolsTest)
  testToVersionedReferenceAReallyLongPath(org.apache.maven.archiva.repository.metadata.MetadataToolsTest)
  testToVersionedReferenceCommonsLang(org.apache.maven.archiva.repository.metadata.MetadataToolsTest)
  testToVersionedReferenceSnapshot(org.apache.maven.archiva.repository.metadata.MetadataToolsTest)
  testLoadSimple(org.apache.maven.archiva.repository.metadata.RepositoryMetadataReaderTest)
  testLoadComplex(org.apache.maven.archiva.repository.metadata.RepositoryMetadataReaderTest)
  testGetVersionsFromProjectReference(org.apache.maven.archiva.repository.content.ManagedLegacyRepositoryContentTest)
  testGetVersionsFromVersionedReference(org.apache.maven.archiva.repository.content.ManagedLegacyRepositoryContentTest)
  testGetRelatedArtifacts(org.apache.maven.archiva.repository.content.ManagedLegacyRepositoryContentTest)
  testBadPathMissingType(org.apache.maven.archiva.repository.content.ManagedLegacyRepositoryContentTest)
  testBadPathTooShort(org.apache.maven.archiva.repository.content.ManagedLegacyRepositoryContentTest)
  testGoodButOddVersionSpecGanymedSsh2(org.apache.maven.archiva.repository.content.ManagedLegacyRepositoryContentTest)
  testGoodButOddVersionSpecJavaxComm(org.apache.maven.archiva.repository.content.ManagedLegacyRepositoryContentTest)
  testGoodButOddVersionSpecJavaxPersistence(org.apache.maven.archiva.repository.content.ManagedLegacyRepositoryContentTest)
  testGoodCommonsLang(org.apache.maven.archiva.repository.content.ManagedLegacyRepositoryContentTest)
  testGoodFooLibSources(org.apache.maven.archiva.repository.content.ManagedLegacyRepositoryContentTest)
  testGoodSnapshotMavenTest(org.apache.maven.archiva.repository.content.ManagedLegacyRepositoryContentTest)
  testGoodVersionKeywordInArtifactId(org.apache.maven.archiva.repository.content.ManagedLegacyRepositoryContentTest)
  testBadPathArtifactIdMissingA(org.apache.maven.archiva.repository.content.ManagedLegacyRepositoryContentTest)
  testBadPathArtifactIdMissingB(org.apache.maven.archiva.repository.content.ManagedLegacyRepositoryContentTest)
  testBadPathWrongPackageExtension(org.apache.maven.archiva.repository.content.ManagedLegacyRepositoryContentTest)
  testGoodDerby(org.apache.maven.archiva.repository.content.ManagedLegacyRepositoryContentTest)
  testGoodFooLibJavadoc(org.apache.maven.archiva.repository.content.ManagedLegacyRepositoryContentTest)
  testGoodFooTool(org.apache.maven.archiva.repository.content.ManagedLegacyRepositoryContentTest)
  testGoodGeronimoEjbSpec(org.apache.maven.archiva.repository.content.ManagedLegacyRepositoryContentTest)
  testGoodLdapClientsPom(org.apache.maven.archiva.repository.content.ManagedLegacyRepositoryContentTest)
  testGoodDetectPluginMavenTest(org.apache.maven.archiva.repository.content.ManagedLegacyRepositoryContentTest)
  testGoodDetectPluginAvalonMeta(org.apache.maven.archiva.repository.content.ManagedLegacyRepositoryContentTest)
  testGoodDetectPluginCactusMaven(org.apache.maven.archiva.repository.content.ManagedLegacyRepositoryContentTest)
  testGoodDetectPluginGeronimoPackaging(org.apache.maven.archiva.repository.content.ManagedLegacyRepositoryContentTest)
  testMaven1Maven2PluginTypeDistinc(org.apache.maven.archiva.repository.content.ManagedLegacyRepositoryContentTest)
  testBadPathMissingType(org.apache.maven.archiva.repository.content.RemoteDefaultRepositoryContentTest)
  testBadPathReleaseInSnapshotDir(org.apache.maven.archiva.repository.content.RemoteDefaultRepositoryContentTest)
  testBadPathTimestampedSnapshotNotInSnapshotDir(org.apache.maven.archiva.repository.content.RemoteDefaultRepositoryContentTest)
  testBadPathTooShort(org.apache.maven.archiva.repository.content.RemoteDefaultRepositoryContentTest)
  testBadPathVersionMismatchA(org.apache.maven.archiva.repository.content.RemoteDefaultRepositoryContentTest)
  testBadPathVersionMismatchB(org.apache.maven.archiva.repository.content.RemoteDefaultRepositoryContentTest)
  testBadPathWrongArtifactId(org.apache.maven.archiva.repository.content.RemoteDefaultRepositoryContentTest)
  testGoodButOddVersionSpecGanymedSsh2(org.apache.maven.archiva.repository.content.RemoteDefaultRepositoryContentTest)
  testGoodButOddVersionSpecJavaxComm(org.apache.maven.archiva.repository.content.RemoteDefaultRepositoryContentTest)
  testGoodButOddVersionSpecJavaxPersistence(org.apache.maven.archiva.repository.content.RemoteDefaultRepositoryContentTest)
  testGoodComFooTool(org.apache.maven.archiva.repository.content.RemoteDefaultRepositoryContentTest)
  testGoodCommonsLang(org.apache.maven.archiva.repository.content.RemoteDefaultRepositoryContentTest)
  testGoodDashedArtifactId(org.apache.maven.archiva.repository.content.RemoteDefaultRepositoryContentTest)
  testGoodDotNotationArtifactId(org.apache.maven.archiva.repository.content.RemoteDefaultRepositoryContentTest)
  testGoodDotNotationSameGroupIdAndArtifactId(org.apache.maven.archiva.repository.content.RemoteDefaultRepositoryContentTest)
  testGoodFooLibSources(org.apache.maven.archiva.repository.content.RemoteDefaultRepositoryContentTest)
  testGoodSnapshotMavenTest(org.apache.maven.archiva.repository.content.RemoteDefaultRepositoryContentTest)
  testGoodVersionKeywordInArtifactId(org.apache.maven.archiva.repository.content.RemoteDefaultRepositoryContentTest)
  testGoodDetectMavenTestPlugin(org.apache.maven.archiva.repository.content.RemoteDefaultRepositoryContentTest)
  testGoodDetectCoberturaMavenPlugin(org.apache.maven.archiva.repository.content.RemoteDefaultRepositoryContentTest)
  testToArtifactOnEmptyPath(org.apache.maven.archiva.repository.content.RemoteDefaultRepositoryContentTest)
  testToArtifactOnNullPath(org.apache.maven.archiva.repository.content.RemoteDefaultRepositoryContentTest)
  testToArtifactReferenceOnEmptyPath(org.apache.maven.archiva.repository.content.RemoteDefaultRepositoryContentTest)
  testToArtifactReferenceOnNullPath(org.apache.maven.archiva.repository.content.RemoteDefaultRepositoryContentTest)
  testToPathOnNullArtifactReference(org.apache.maven.archiva.repository.content.RemoteDefaultRepositoryContentTest)
  testBuildEffectiveProject(org.apache.maven.archiva.repository.project.filters.EffectiveProjectModelFilterTest)
  testBuildEffectiveSnapshotProject(org.apache.maven.archiva.repository.project.filters.EffectiveProjectModelFilterTest)
  testWriteSimple(org.apache.maven.archiva.repository.metadata.RepositoryMetadataWriterTest)
  testSimpleWrite(org.apache.maven.archiva.repository.project.writers.ProjectModel400WriterTest)
  testReadWriteSimple(org.apache.maven.archiva.repository.project.writers.ProjectModel400WriterTest)
  testReadWriteMavenParent(org.apache.maven.archiva.repository.project.writers.ProjectModel400WriterTest)
  testReadWriteCocoon(org.apache.maven.archiva.repository.project.writers.ProjectModel400WriterTest)
  testExpressionEvaluation(org.apache.maven.archiva.repository.project.filters.ProjectModelExpressionExpanderTest)
  testExpressionHell(org.apache.maven.archiva.repository.project.filters.ProjectModelExpressionExpanderTest)
  testGetSelectedKnownIds(org.apache.maven.archiva.repository.scanner.RepositoryContentConsumersTest)
  testGetSelectedInvalidIds(org.apache.maven.archiva.repository.scanner.RepositoryContentConsumersTest)
  testGetSelectedKnownConsumerMap(org.apache.maven.archiva.repository.scanner.RepositoryContentConsumersTest)
  testGetSelectedInvalidConsumerMap(org.apache.maven.archiva.repository.scanner.RepositoryContentConsumersTest)
  testGetAvailableKnownList(org.apache.maven.archiva.repository.scanner.RepositoryContentConsumersTest)
  testGetAvailableInvalidList(org.apache.maven.archiva.repository.scanner.RepositoryContentConsumersTest)
  testExecution(org.apache.maven.archiva.repository.scanner.RepositoryContentConsumersTest)
  testIsMavenPlugin(org.apache.maven.archiva.repository.content.ArtifactExtensionMappingTest)
  testLoadSimple(org.apache.maven.archiva.repository.project.readers.ProjectModel300ReaderTest)
  testToPathOnNullArtifactReference(org.apache.maven.archiva.repository.content.ManagedDefaultRepositoryContentTest)
  testGetVersionsBadArtifact(org.apache.maven.archiva.repository.content.ManagedDefaultRepositoryContentTest)
  testGetVersionsMissingMultipleVersions(org.apache.maven.archiva.repository.content.ManagedDefaultRepositoryContentTest)
  testGetVersionsSimple(org.apache.maven.archiva.repository.content.ManagedDefaultRepositoryContentTest)
  testGetVersionsSimpleYetIncomplete(org.apache.maven.archiva.repository.content.ManagedDefaultRepositoryContentTest)
  testGetVersionsSimpleYetMissing(org.apache.maven.archiva.repository.content.ManagedDefaultRepositoryContentTest)
  testGetVersionsSnapshotA(org.apache.maven.archiva.repository.content.ManagedDefaultRepositoryContentTest)
  testToMetadataPathFromProjectReference(org.apache.maven.archiva.repository.content.ManagedDefaultRepositoryContentTest)
  testToMetadataPathFromVersionReference(org.apache.maven.archiva.repository.content.ManagedDefaultRepositoryContentTest)
  testExcludeMetadataFile(org.apache.maven.archiva.repository.content.ManagedDefaultRepositoryContentTest)
  testBadPathMissingType(org.apache.maven.archiva.repository.content.ManagedDefaultRepositoryContentTest)
  testBadPathReleaseInSnapshotDir(org.apache.maven.archiva.repository.content.ManagedDefaultRepositoryContentTest)
  testBadPathTimestampedSnapshotNotInSnapshotDir(org.apache.maven.archiva.repository.content.ManagedDefaultRepositoryContentTest)
  testBadPathTooShort(org.apache.maven.archiva.repository.content.ManagedDefaultRepositoryContentTest)
  testBadPathVersionMismatchA(org.apache.maven.archiva.repository.content.ManagedDefaultRepositoryContentTest)
  testBadPathVersionMismatchB(org.apache.maven.archiva.repository.content.ManagedDefaultRepositoryContentTest)
  testBadPathWrongArtifactId(org.apache.maven.archiva.repository.content.ManagedDefaultRepositoryContentTest)
  testGoodButOddVersionSpecGanymedSsh2(org.apache.maven.archiva.repository.content.ManagedDefaultRepositoryContentTest)
  testGoodButOddVersionSpecJavaxComm(org.apache.maven.archiva.repository.content.ManagedDefaultRepositoryContentTest)
  testGoodButOddVersionSpecJavaxPersistence(org.apache.maven.archiva.repository.content.ManagedDefaultRepositoryContentTest)
  testGoodComFooTool(org.apache.maven.archiva.repository.content.ManagedDefaultRepositoryContentTest)
  testGoodCommonsLang(org.apache.maven.archiva.repository.content.ManagedDefaultRepositoryContentTest)
  testGoodDashedArtifactId(org.apache.maven.archiva.repository.content.ManagedDefaultRepositoryContentTest)
  testGoodDotNotationArtifactId(org.apache.maven.archiva.repository.content.ManagedDefaultRepositoryContentTest)
  testGoodDotNotationSameGroupIdAndArtifactId(org.apache.maven.archiva.repository.content.ManagedDefaultRepositoryContentTest)
  testGoodFooLibSources(org.apache.maven.archiva.repository.content.ManagedDefaultRepositoryContentTest)
  testGoodSnapshotMavenTest(org.apache.maven.archiva.repository.content.ManagedDefaultRepositoryContentTest)
  testGoodVersionKeywordInArtifactId(org.apache.maven.archiva.repository.content.ManagedDefaultRepositoryContentTest)
  testGoodDetectMavenTestPlugin(org.apache.maven.archiva.repository.content.ManagedDefaultRepositoryContentTest)
  testGoodDetectCoberturaMavenPlugin(org.apache.maven.archiva.repository.content.ManagedDefaultRepositoryContentTest)
  testToArtifactOnEmptyPath(org.apache.maven.archiva.repository.content.ManagedDefaultRepositoryContentTest)
  testToArtifactOnNullPath(org.apache.maven.archiva.repository.content.ManagedDefaultRepositoryContentTest)
  testToArtifactReferenceOnEmptyPath(org.apache.maven.archiva.repository.content.ManagedDefaultRepositoryContentTest)
  testToArtifactReferenceOnNullPath(org.apache.maven.archiva.repository.content.ManagedDefaultRepositoryContentTest)
  testBadPathMissingType(org.apache.maven.archiva.repository.content.LegacyPathParserTest)
  testBadPathTooShort(org.apache.maven.archiva.repository.content.LegacyPathParserTest)
  testGoodButDualExtensions(org.apache.maven.archiva.repository.content.LegacyPathParserTest)
  testGoodButOddVersionSpecGanymedSsh2(org.apache.maven.archiva.repository.content.LegacyPathParserTest)
  testGoodButOddVersionSpecJavaxComm(org.apache.maven.archiva.repository.content.LegacyPathParserTest)
  testGoodButOddVersionSpecJavaxPersistence(org.apache.maven.archiva.repository.content.LegacyPathParserTest)
  testGoodCommonsLang(org.apache.maven.archiva.repository.content.LegacyPathParserTest)
  testGoodFooLibSources(org.apache.maven.archiva.repository.content.LegacyPathParserTest)
  testGoodSnapshotMavenTest(org.apache.maven.archiva.repository.content.LegacyPathParserTest)
  testGoodVersionKeywordInArtifactId(org.apache.maven.archiva.repository.content.LegacyPathParserTest)
  testBadPathArtifactIdMissingA(org.apache.maven.archiva.repository.content.LegacyPathParserTest)
  testBadPathArtifactIdMissingB(org.apache.maven.archiva.repository.content.LegacyPathParserTest)
  testBadPathWrongPackageExtension(org.apache.maven.archiva.repository.content.LegacyPathParserTest)
  testGoodDerby(org.apache.maven.archiva.repository.content.LegacyPathParserTest)
  testGoodFooLibJavadoc(org.apache.maven.archiva.repository.content.LegacyPathParserTest)
  testBadClassifierFooLibSources(org.apache.maven.archiva.repository.content.LegacyPathParserTest)
  testGoodFooLibTestSources(org.apache.maven.archiva.repository.content.LegacyPathParserTest)
  testGoodFooTool(org.apache.maven.archiva.repository.content.LegacyPathParserTest)
  testGoodGeronimoEjbSpec(org.apache.maven.archiva.repository.content.LegacyPathParserTest)
  testGoodLdapClientsPom(org.apache.maven.archiva.repository.content.LegacyPathParserTest)
  testGoodDetectPluginMavenTest(org.apache.maven.archiva.repository.content.LegacyPathParserTest)
  testGoodDetectPluginAvalonMeta(org.apache.maven.archiva.repository.content.LegacyPathParserTest)
  testGoodDetectPluginCactusMaven(org.apache.maven.archiva.repository.content.LegacyPathParserTest)
  testGoodDetectPluginGeronimoPackaging(org.apache.maven.archiva.repository.content.LegacyPathParserTest)
  testCustomExceptionsInArtifactResolution(org.apache.maven.archiva.repository.content.LegacyPathParserTest)
  testTimestampRepositoryScanner(org.apache.maven.archiva.repository.scanner.RepositoryScannerTest)
  testTimestampRepositoryScannerFreshScan(org.apache.maven.archiva.repository.scanner.RepositoryScannerTest)
  testTimestampRepositoryScannerProcessUnmodified(org.apache.maven.archiva.repository.scanner.RepositoryScannerTest)
  testDefaultRepositoryScanner(org.apache.maven.archiva.repository.scanner.RepositoryScannerTest)
  testDefaultRepositoryArtifactScanner(org.apache.maven.archiva.repository.scanner.RepositoryScannerTest)
  testDefaultRepositoryMetadataScanner(org.apache.maven.archiva.repository.scanner.RepositoryScannerTest)
  testDefaultRepositoryProjectScanner(org.apache.maven.archiva.repository.scanner.RepositoryScannerTest)
  testLegacyRepositoryArtifactScanner(org.apache.maven.archiva.repository.scanner.RepositoryScannerTest)
  testBadPathMissingType(org.apache.maven.archiva.repository.content.DefaultPathParserTest)
  testBadPathReleaseInSnapshotDir(org.apache.maven.archiva.repository.content.DefaultPathParserTest)
  testBadPathTimestampedSnapshotNotInSnapshotDir(org.apache.maven.archiva.repository.content.DefaultPathParserTest)
  testBadPathTooShort(org.apache.maven.archiva.repository.content.DefaultPathParserTest)
  testBadPathVersionMismatchA(org.apache.maven.archiva.repository.content.DefaultPathParserTest)
  testBadPathVersionMismatchB(org.apache.maven.archiva.repository.content.DefaultPathParserTest)
  testBadPathWrongArtifactId(org.apache.maven.archiva.repository.content.DefaultPathParserTest)
  testGoodButDualExtensions(org.apache.maven.archiva.repository.content.DefaultPathParserTest)
  testGoodButOddVersionSpecGanymedSsh2(org.apache.maven.archiva.repository.content.DefaultPathParserTest)
  testGoodButOddVersionSpecJavaxComm(org.apache.maven.archiva.repository.content.DefaultPathParserTest)
  testGoodButOddVersionSpecJavaxPersistence(org.apache.maven.archiva.repository.content.DefaultPathParserTest)
  testGoodComFooTool(org.apache.maven.archiva.repository.content.DefaultPathParserTest)
  testGoodCommonsLang(org.apache.maven.archiva.repository.content.DefaultPathParserTest)
  testGoodDashedArtifactId(org.apache.maven.archiva.repository.content.DefaultPathParserTest)
  testGoodDotNotationArtifactId(org.apache.maven.archiva.repository.content.DefaultPathParserTest)
  testGoodDotNotationSameGroupIdAndArtifactId(org.apache.maven.archiva.repository.content.DefaultPathParserTest)
  testGoodFooLibSources(org.apache.maven.archiva.repository.content.DefaultPathParserTest)
  testGoodSnapshotMavenTest(org.apache.maven.archiva.repository.content.DefaultPathParserTest)
  testGoodLongSnapshotMavenTest(org.apache.maven.archiva.repository.content.DefaultPathParserTest)
  testClassifiedSnapshotMavenTest(org.apache.maven.archiva.repository.content.DefaultPathParserTest)
  testGoodVersionKeywordInArtifactId(org.apache.maven.archiva.repository.content.DefaultPathParserTest)
  testGoodDetectMavenTestPlugin(org.apache.maven.archiva.repository.content.DefaultPathParserTest)
  testGoodDetectCoberturaMavenPlugin(org.apache.maven.archiva.repository.content.DefaultPathParserTest)
  testToArtifactOnEmptyPath(org.apache.maven.archiva.repository.content.DefaultPathParserTest)
  testToArtifactOnNullPath(org.apache.maven.archiva.repository.content.DefaultPathParserTest)
  testToArtifactReferenceOnEmptyPath(org.apache.maven.archiva.repository.content.DefaultPathParserTest)
  testToArtifactReferenceOnNullPath(org.apache.maven.archiva.repository.content.DefaultPathParserTest)
  testLoadSimple(org.apache.maven.archiva.repository.project.readers.ProjectModel400ReaderTest)
  testLoadWithNamespace(org.apache.maven.archiva.repository.project.readers.ProjectModel400ReaderTest)
  testInvalidRequestNoArtifactId(org.apache.maven.archiva.repository.content.RepositoryRequestTest)
  testInvalidLegacyRequestBadLocation(org.apache.maven.archiva.repository.content.RepositoryRequestTest)
  testInvalidRequestTooShort(org.apache.maven.archiva.repository.content.RepositoryRequestTest)
  testInvalidDefaultRequestBadLocation(org.apache.maven.archiva.repository.content.RepositoryRequestTest)
  testValidLegacyGanymed(org.apache.maven.archiva.repository.content.RepositoryRequestTest)
  testValidDefaultGanymed(org.apache.maven.archiva.repository.content.RepositoryRequestTest)
  testValidLegacyJavaxComm(org.apache.maven.archiva.repository.content.RepositoryRequestTest)
  testValidDefaultJavaxComm(org.apache.maven.archiva.repository.content.RepositoryRequestTest)
  testValidLegacyJavaxPersistence(org.apache.maven.archiva.repository.content.RepositoryRequestTest)
  testValidDefaultJavaxPersistence(org.apache.maven.archiva.repository.content.RepositoryRequestTest)
  testValidLegacyMavenTestPlugin(org.apache.maven.archiva.repository.content.RepositoryRequestTest)
  testValidDefaultMavenTestPlugin(org.apache.maven.archiva.repository.content.RepositoryRequestTest)
  testValidLegacyCommonsLangJavadoc(org.apache.maven.archiva.repository.content.RepositoryRequestTest)
  testValidDefaultCommonsLangJavadoc(org.apache.maven.archiva.repository.content.RepositoryRequestTest)
  testValidLegacyDerbyPom(org.apache.maven.archiva.repository.content.RepositoryRequestTest)
  testValidDefaultDerbyPom(org.apache.maven.archiva.repository.content.RepositoryRequestTest)
  testValidLegacyGeronimoEjbSpec(org.apache.maven.archiva.repository.content.RepositoryRequestTest)
  testValidDefaultGeronimoEjbSpec(org.apache.maven.archiva.repository.content.RepositoryRequestTest)
  testValidLegacyLdapSnapshot(org.apache.maven.archiva.repository.content.RepositoryRequestTest)
  testValidDefaultLdapSnapshot(org.apache.maven.archiva.repository.content.RepositoryRequestTest)
  testValidLegacyTestArchSnapshot(org.apache.maven.archiva.repository.content.RepositoryRequestTest)
  testValidDefaultTestArchSnapshot(org.apache.maven.archiva.repository.content.RepositoryRequestTest)
  testValidLegacyOddDottedArtifactId(org.apache.maven.archiva.repository.content.RepositoryRequestTest)
  testValidDefaultOddDottedArtifactId(org.apache.maven.archiva.repository.content.RepositoryRequestTest)
  testValidLegacyTimestampedSnapshot(org.apache.maven.archiva.repository.content.RepositoryRequestTest)
  testValidDefaultTimestampedSnapshot(org.apache.maven.archiva.repository.content.RepositoryRequestTest)
  testIsSupportFile(org.apache.maven.archiva.repository.content.RepositoryRequestTest)
  testIsMetadata(org.apache.maven.archiva.repository.content.RepositoryRequestTest)
  testIsDefault(org.apache.maven.archiva.repository.content.RepositoryRequestTest)
  testIsLegacy(org.apache.maven.archiva.repository.content.RepositoryRequestTest)
  testToNativePathArtifactDefaultToDefaultDualExtension(org.apache.maven.archiva.repository.content.RepositoryRequestTest)
  testToNativePathArtifactLegacyToDefaultDualExtension(org.apache.maven.archiva.repository.content.RepositoryRequestTest)
  testToNativePathMetadataDefaultToDefault(org.apache.maven.archiva.repository.content.RepositoryRequestTest)
  testNativePathPomLegacyToDefault(org.apache.maven.archiva.repository.content.RepositoryRequestTest)
  testNativePathPomLegacyToLegacy(org.apache.maven.archiva.repository.content.RepositoryRequestTest)
  testNativePathPomLegacyToDefaultEjb(org.apache.maven.archiva.repository.content.RepositoryRequestTest)
  testNativePathPomLegacyToLegacyEjb(org.apache.maven.archiva.repository.content.RepositoryRequestTest)
  testNativePathPomLegacyToLegacyStrutsModule(org.apache.maven.archiva.repository.content.RepositoryRequestTest)
  testNativePathSupportFileLegacyToDefault(org.apache.maven.archiva.repository.content.RepositoryRequestTest)
  testNativePathBadRequestTooShort(org.apache.maven.archiva.repository.content.RepositoryRequestTest)
  testNativePathBadRequestBlank(org.apache.maven.archiva.repository.content.RepositoryRequestTest)
  testNativePathBadRequestNull(org.apache.maven.archiva.repository.content.RepositoryRequestTest)
  testNativePathBadRequestUnknownType(org.apache.maven.archiva.repository.content.RepositoryRequestTest)
  testToNativePathLegacyMetadataDefaultToLegacy(org.apache.maven.archiva.repository.content.RepositoryRequestTest)
  testNativePathPomDefaultToLegacy(org.apache.maven.archiva.repository.content.RepositoryRequestTest)
  testNativePathSupportFileDefaultToLegacy(org.apache.maven.archiva.repository.content.RepositoryRequestTest)

Tests run: 276, Failures: 0, Errors: 232, Skipped: 0

[INFO] ------------------------------------------------------------------------
[ERROR] BUILD FAILURE
[INFO] ------------------------------------------------------------------------
[INFO] There are test failures.

Please refer to /home/continuum/data/working-directory/667/target/surefire-reports for the individual test results.
[INFO] ------------------------------------------------------------------------
[INFO] For more information, run Maven with the -e switch
[INFO] ------------------------------------------------------------------------
[INFO] Total time: 1 minute 21 seconds
[INFO] Finished at: Tue Apr 15 01:14:33 PDT 2008
[INFO] Final Memory: 16M/40M
[INFO] ------------------------------------------------------------------------

****************************************************************************



Mime
View raw message