maven-notifications mailing list archives

Site index · List index
Message view « Date » · « Thread »
Top « Date » · « Thread »
From Hudson <Hud...@sonatype.org>
Subject Build failed in Hudson: Maven-2.1.x #57
Date Thu, 03 Apr 2008 19:16:52 GMT
See http://ci.sonatype.org/job/Maven-2.1.x/57/changes

Changes:

[Herve Boutemy] [MNG-3497] rar, par and ejb3 archives should not be added to classpath

------------------------------------------
started
Updating https://svn.apache.org/repos/asf/maven/components/trunk
U         maven-core/src/main/resources/META-INF/plexus/components.xml
At revision 644444
[maven-2.1.x] $ /opt/maven/2.0/bin/mvn clean deploy -B -U -e -Dmaven.repo.local=/home/j2ee-hudson/repos/Maven-2.1.x
-Pstrict -Dsurefire.useFile=false
+ Error stacktraces are turned on.
[INFO] Scanning for projects...
[INFO] Reactor build order: 
[INFO]   Apache Maven
[INFO]   Maven Workspace
[INFO]   Maven Model
[INFO]   Maven Profile Model
[INFO]   Maven Lifecycle Model
[INFO]   Maven Project Builder
[INFO]   Maven Plugin API
[INFO]   Maven Reporting API
[INFO]   Maven Core
[INFO]   Maven Toolchains
[INFO]   Maven Embedder
[INFO] ------------------------------------------------------------------------
[INFO] Building Apache Maven
[INFO]    task-segment: [clean, deploy]
[INFO] ------------------------------------------------------------------------
[INFO] artifact org.apache.maven.plugins:maven-clean-plugin: checking for updates from central
[INFO] snapshot org.apache.maven.plugins:maven-clean-plugin:2.2-SNAPSHOT: checking for updates
from central
[INFO] snapshot org.apache.maven.plugins:maven-plugins:4-SNAPSHOT: checking for updates from
central
Downloading: http://localhost:8081/nexus/content/groups/public/org/apache/maven/plugins/maven-plugins/4-SNAPSHOT/maven-plugins-4-SNAPSHOT.pom
[INFO] ------------------------------------------------------------------------
[ERROR] BUILD ERROR
[INFO] ------------------------------------------------------------------------
[INFO] Failed to resolve artifact.

GroupId: org.apache.maven.plugins
ArtifactId: maven-plugins
Version: 4-SNAPSHOT

Reason: Unable to download the artifact from any repository

  org.apache.maven.plugins:maven-plugins:pom:4-SNAPSHOT

from the specified remote repositories:
  central (http://Nexus)


[INFO] ------------------------------------------------------------------------
[INFO] Trace
org.apache.maven.lifecycle.LifecycleExecutionException: Error resolving version for 'org.apache.maven.plugins:maven-clean-plugin':
Unable to read the metadata file for artifact 'org.apache.maven.plugins:maven-clean-plugin:pom':
Cannot find parent: org.apache.maven.plugins:maven-plugins for project: null:maven-clean-plugin:maven-plugin:2.2-20061118.060301-1
for project null:maven-clean-plugin:maven-plugin:2.2-20061118.060301-1
	at org.apache.maven.lifecycle.DefaultLifecycleExecutor.verifyPlugin(DefaultLifecycleExecutor.java:1266)
	at org.apache.maven.lifecycle.DefaultLifecycleExecutor.getMojoDescriptor(DefaultLifecycleExecutor.java:1522)
	at org.apache.maven.lifecycle.DefaultLifecycleExecutor.bindLifecycleForPackaging(DefaultLifecycleExecutor.java:1016)
	at org.apache.maven.lifecycle.DefaultLifecycleExecutor.constructLifecycleMappings(DefaultLifecycleExecutor.java:980)
	at org.apache.maven.lifecycle.DefaultLifecycleExecutor.executeGoal(DefaultLifecycleExecutor.java:458)
	at org.apache.maven.lifecycle.DefaultLifecycleExecutor.executeGoalAndHandleFailures(DefaultLifecycleExecutor.java:311)
	at org.apache.maven.lifecycle.DefaultLifecycleExecutor.executeTaskSegments(DefaultLifecycleExecutor.java:278)
	at org.apache.maven.lifecycle.DefaultLifecycleExecutor.execute(DefaultLifecycleExecutor.java:143)
	at org.apache.maven.DefaultMaven.doExecute(DefaultMaven.java:333)
	at org.apache.maven.DefaultMaven.execute(DefaultMaven.java:126)
	at org.apache.maven.cli.MavenCli.main(MavenCli.java:282)
	at sun.reflect.NativeMethodAccessorImpl.invoke0(Native Method)
	at sun.reflect.NativeMethodAccessorImpl.invoke(NativeMethodAccessorImpl.java:39)
	at sun.reflect.DelegatingMethodAccessorImpl.invoke(DelegatingMethodAccessorImpl.java:25)
	at java.lang.reflect.Method.invoke(Method.java:324)
	at org.codehaus.classworlds.Launcher.launchEnhanced(Launcher.java:315)
	at org.codehaus.classworlds.Launcher.launch(Launcher.java:255)
	at org.codehaus.classworlds.Launcher.mainWithExitCode(Launcher.java:430)
	at org.codehaus.classworlds.Launcher.main(Launcher.java:375)
Caused by: org.apache.maven.plugin.version.PluginVersionResolutionException: Error resolving
version for 'org.apache.maven.plugins:maven-clean-plugin': Unable to read the metadata file
for artifact 'org.apache.maven.plugins:maven-clean-plugin:pom': Cannot find parent: org.apache.maven.plugins:maven-plugins
for project: null:maven-clean-plugin:maven-plugin:2.2-20061118.060301-1 for project null:maven-clean-plugin:maven-plugin:2.2-20061118.060301-1
	at org.apache.maven.plugin.version.DefaultPluginVersionManager.resolveMetaVersion(DefaultPluginVersionManager.java:682)
	at org.apache.maven.plugin.version.DefaultPluginVersionManager.resolvePluginVersion(DefaultPluginVersionManager.java:187)
	at org.apache.maven.plugin.version.DefaultPluginVersionManager.resolvePluginVersion(DefaultPluginVersionManager.java:91)
	at org.apache.maven.plugin.DefaultPluginManager.verifyPlugin(DefaultPluginManager.java:167)
	at org.apache.maven.lifecycle.DefaultLifecycleExecutor.verifyPlugin(DefaultLifecycleExecutor.java:1257)
	... 18 more
Caused by: org.apache.maven.artifact.metadata.ArtifactMetadataRetrievalException: Unable to
read the metadata file for artifact 'org.apache.maven.plugins:maven-clean-plugin:pom': Cannot
find parent: org.apache.maven.plugins:maven-plugins for project: null:maven-clean-plugin:maven-plugin:2.2-20061118.060301-1
for project null:maven-clean-plugin:maven-plugin:2.2-20061118.060301-1
	at org.apache.maven.project.artifact.MavenMetadataSource.retrieve(MavenMetadataSource.java:134)
	at org.apache.maven.plugin.version.DefaultPluginVersionManager.resolveMetaVersion(DefaultPluginVersionManager.java:673)
	... 22 more
Caused by: org.apache.maven.project.ProjectBuildingException: Cannot find parent: org.apache.maven.plugins:maven-plugins
for project: null:maven-clean-plugin:maven-plugin:2.2-20061118.060301-1 for project null:maven-clean-plugin:maven-plugin:2.2-20061118.060301-1
	at org.apache.maven.project.DefaultMavenProjectBuilder.assembleLineage(DefaultMavenProjectBuilder.java:1259)
	at org.apache.maven.project.DefaultMavenProjectBuilder.buildInternal(DefaultMavenProjectBuilder.java:745)
	at org.apache.maven.project.DefaultMavenProjectBuilder.buildFromRepository(DefaultMavenProjectBuilder.java:233)
	at org.apache.maven.project.artifact.MavenMetadataSource.retrieve(MavenMetadataSource.java:105)
	... 23 more
Caused by: org.apache.maven.project.ProjectBuildingException: POM 'org.apache.maven.plugins:maven-plugins'
not found in repository: Unable to download the artifact from any repository

  org.apache.maven.plugins:maven-plugins:pom:4-SNAPSHOT

from the specified remote repositories:
  central (http://Nexus)
 for project org.apache.maven.plugins:maven-plugins
	at org.apache.maven.project.DefaultMavenProjectBuilder.findModelFromRepository(DefaultMavenProjectBuilder.java:571)
	at org.apache.maven.project.DefaultMavenProjectBuilder.assembleLineage(DefaultMavenProjectBuilder.java:1255)
	... 26 more
Caused by: org.apache.maven.artifact.resolver.ArtifactNotFoundException: Unable to download
the artifact from any repository

  org.apache.maven.plugins:maven-plugins:pom:4-SNAPSHOT

from the specified remote repositories:
  central (http://Nexus)

	at org.apache.maven.artifact.resolver.DefaultArtifactResolver.resolve(DefaultArtifactResolver.java:206)
	at org.apache.maven.artifact.resolver.DefaultArtifactResolver.resolve(DefaultArtifactResolver.java:73)
	at org.apache.maven.project.DefaultMavenProjectBuilder.findModelFromRepository(DefaultMavenProjectBuilder.java:524)
	... 27 more
Caused by: org.apache.maven.wagon.ResourceDoesNotExistException: Unable to download the artifact
from any repository
	at org.apache.maven.artifact.manager.DefaultWagonManager.getArtifact(DefaultWagonManager.java:324)
	at org.apache.maven.artifact.resolver.DefaultArtifactResolver.resolve(DefaultArtifactResolver.java:194)
	... 29 more
[INFO] ------------------------------------------------------------------------
[INFO] Total time: 1 second
[INFO] Finished at: Thu Apr 03 14:16:52 CDT 2008
[INFO] Final Memory: 2M/4M
[INFO] ------------------------------------------------------------------------


Mime
View raw message