maven-notifications mailing list archives

Site index · List index
Message view « Date » · « Thread »
Top « Date » · « Thread »
From Continuum VMBuild Server <contin...@apache.org>
Subject [continuum] BUILD FAILURE: Archiva Web :: Application
Date Tue, 15 Apr 2008 04:56:51 GMT
Online report : http://vmbuild.apache.org/continuum/buildResult.action?buildId=77258&projectId=683

Build statistics:
  State: Failed
  Previous State: Ok
  Started at: Mon 14 Apr 2008 21:55:34 -0700
  Finished at: Mon 14 Apr 2008 21:56:19 -0700
  Total time: 44s
  Build Trigger: Schedule
  Build Number: 30
  Exit code: 1
  Building machine hostname: vmbuild.apache.org
  Operating system : Linux(unknown)
  Java Home version : 
          java version "1.5.0_12"
          Java(TM) 2 Runtime Environment, Standard Edition (build 1.5.0_12-b04)
          Java HotSpot(TM) Client VM (build 1.5.0_12-b04, mixed mode, sharing)
        
  Builder version :
          Maven version: 2.0.8
          Java version: 1.5.0_12
          OS name: "linux" version: "2.6.20-16-server" arch: "i386" Family: "unix"
    
****************************************************************************
SCM Changes:
****************************************************************************
Changed: joakime @ Mon 14 Apr 2008 21:44:17 -0700
Comment: Replacing plexus-digest with archiva-checksum
Files changed:
  /archiva/trunk/archiva-modules/archiva-base/archiva-checksum/pom.xml ( 648115 )
  /archiva/trunk/archiva-modules/archiva-base/archiva-checksum/src/main/java/org/apache/archiva/checksum/ChecksummedFile.java
( 648115 )
  /archiva/trunk/archiva-modules/archiva-base/archiva-checksum/src/test/java/org/apache/archiva/checksum/ChecksummedFileTest.java
( 648115 )
  /archiva/trunk/archiva-modules/archiva-base/archiva-common/pom.xml ( 648115 )
  /archiva/trunk/archiva-modules/archiva-base/archiva-common/src/main/java/org/apache/maven/archiva/common/utils/Checksums.java
( 648115 )
  /archiva/trunk/archiva-modules/archiva-base/archiva-common/src/test/java/org/apache/maven/archiva/common/utils/ChecksumsTest.java
( 648115 )
  /archiva/trunk/archiva-modules/archiva-base/archiva-policies/pom.xml ( 648115 )
  /archiva/trunk/archiva-modules/archiva-base/archiva-policies/src/main/java/org/apache/maven/archiva/policies/ChecksumPolicy.java
( 648115 )
  /archiva/trunk/archiva-modules/archiva-base/archiva-repository-layer/pom.xml ( 648115 )
  /archiva/trunk/archiva-modules/archiva-base/archiva-repository-layer/src/main/java/org/apache/maven/archiva/repository/metadata/MetadataTools.java
( 648115 )
  /archiva/trunk/archiva-modules/archiva-base/pom.xml ( 648115 )
  /archiva/trunk/archiva-modules/archiva-web/archiva-webapp/src/main/java/org/apache/maven/archiva/web/action/UploadAction.java
( 648115 )
  /archiva/trunk/pom.xml ( 648115 )

****************************************************************************
Dependencies Changes:
****************************************************************************
org.apache.archiva:archiva-report-manager:1.1-SNAPSHOT

org.apache.archiva:archiva-scheduled:1.1-SNAPSHOT

org.apache.archiva:archiva-indexer:1.1-SNAPSHOT

org.apache.archiva:archiva-proxy:1.1-SNAPSHOT

org.apache.archiva:archiva-database:1.1-SNAPSHOT

org.apache.archiva:archiva-repository-layer:1.1-SNAPSHOT

org.apache.archiva:archiva-security:1.1-SNAPSHOT

org.apache.archiva:archiva-core-consumers:1.1-SNAPSHOT

org.apache.archiva:archiva-database-consumers:1.1-SNAPSHOT

org.apache.archiva:archiva-lucene-consumers:1.1-SNAPSHOT

org.apache.archiva:archiva-signature-consumers:1.1-SNAPSHOT

org.apache.archiva:archiva-applet:1.1-SNAPSHOT

org.apache.archiva:archiva-webdav:1.1-SNAPSHOT

org.apache.archiva:archiva-web:1.1-SNAPSHOT


****************************************************************************
Build Defintion:
****************************************************************************
POM filename: pom.xml
Goals: clean install   
Arguments: --batch-mode --non-recursive
Build Fresh: false
Always Build: false
Default Build Definition: true
Schedule: DEFAULT_SCHEDULE
Profile Name: Maven 2.0.8, Java 5
Description: 


****************************************************************************
Test Summary:
****************************************************************************
Tests: 0
Failures: 0
Total time: 0

****************************************************************************
Output:
****************************************************************************
[INFO] Scanning for projects...
[INFO] ------------------------------------------------------------------------
[INFO] Building Archiva Web :: Application
[INFO]    task-segment: [clean, install]
[INFO] ------------------------------------------------------------------------
[INFO] [clean:clean]
[INFO] Deleting directory /home/continuum/data/working-directory/683/target
[INFO] Deleting file-set: /home/continuum/data/working-directory/683/src/main/webapp (included:
[META-INF, archiva-applet.jar, images/redback, template/redback, WEB-INF/classes, WEB-INF/lib,
WEB-INF/database, WEB-INF/logs, redback, css/redback, WEB-INF/jsp/redback, WEB-INF/template/redback,
WEB-INF/logs, WEB-INF/temp, WEB-INF/jasperreports], excluded: [])
[WARNING] POM for 'jpox:jpox:pom:1.1.9:compile' is invalid. It will be ignored for artifact
resolution. Reason: Not a v4.0.0 POM. for project jpox:jpox at /home/continuum/.m2/repository/jpox/jpox/1.1.9/jpox-1.1.9.pom
[WARNING] POM for 'jpox:jpox:pom:1.1.9:compile' is invalid. It will be ignored for artifact
resolution. Reason: Not a v4.0.0 POM. for project jpox:jpox at /home/continuum/.m2/repository/jpox/jpox/1.1.9/jpox-1.1.9.pom
[WARNING] POM for 'jpox:jpox:pom:1.1.9:compile' is invalid. It will be ignored for artifact
resolution. Reason: Not a v4.0.0 POM. for project jpox:jpox at /home/continuum/.m2/repository/jpox/jpox/1.1.9/jpox-1.1.9.pom
[WARNING] POM for 'jpox:jpox:pom:1.1.9:compile' is invalid. It will be ignored for artifact
resolution. Reason: Not a v4.0.0 POM. for project jpox:jpox at /home/continuum/.m2/repository/jpox/jpox/1.1.9/jpox-1.1.9.pom
[INFO] [enforcer:enforce {execution: default}]
[INFO] [plexus:descriptor {execution: generate}]
[WARNING] POM for 'jpox:jpox:pom:1.1.9:compile' is invalid. It will be ignored for artifact
resolution. Reason: Not a v4.0.0 POM. for project jpox:jpox at /home/continuum/.m2/repository/jpox/jpox/1.1.9/jpox-1.1.9.pom
[WARNING] POM for 'jpox:jpox:pom:1.1.9:compile' is invalid. It will be ignored for artifact
resolution. Reason: Not a v4.0.0 POM. for project jpox:jpox at /home/continuum/.m2/repository/jpox/jpox/1.1.9/jpox-1.1.9.pom
[WARNING] POM for 'jpox:jpox:pom:1.1.9:compile' is invalid. It will be ignored for artifact
resolution. Reason: Not a v4.0.0 POM. for project jpox:jpox at /home/continuum/.m2/repository/jpox/jpox/1.1.9/jpox-1.1.9.pom
[WARNING] POM for 'jpox:jpox:pom:1.1.9:compile' is invalid. It will be ignored for artifact
resolution. Reason: Not a v4.0.0 POM. for project jpox:jpox at /home/continuum/.m2/repository/jpox/jpox/1.1.9/jpox-1.1.9.pom
[INFO] Setting property: classpath.resource.loader.class => 'org.codehaus.plexus.velocity.ContextClassLoaderResourceLoader'.
[INFO] Setting property: velocimacro.messages.on => 'false'.
[INFO] Setting property: resource.loader => 'classpath'.
[INFO] Setting property: resource.manager.logwhenfound => 'false'.
[INFO] [remote-resources:process {execution: default}]
[WARNING] Attempting to build MavenProject instance for Artifact (jpox:jpox:1.1.9) of type:
jar; constructing POM artifact instead.
[WARNING] Invalid project model for artifact [jpox:jpox:1.1.9]. It will be ignored by the
remote resources Mojo.
[WARNING] POM for 'jpox:jpox:pom:1.1.9:compile' is invalid. It will be ignored for artifact
resolution. Reason: Not a v4.0.0 POM. for project jpox:jpox at /home/continuum/.m2/repository/jpox/jpox/1.1.9/jpox-1.1.9.pom
[WARNING] POM for 'jpox:jpox:pom:1.1.9:compile' is invalid. It will be ignored for artifact
resolution. Reason: Not a v4.0.0 POM. for project jpox:jpox at /home/continuum/.m2/repository/jpox/jpox/1.1.9/jpox-1.1.9.pom
[WARNING] POM for 'jpox:jpox:pom:1.1.9:compile' is invalid. It will be ignored for artifact
resolution. Reason: Not a v4.0.0 POM. for project jpox:jpox at /home/continuum/.m2/repository/jpox/jpox/1.1.9/jpox-1.1.9.pom
[WARNING] POM for 'jpox:jpox:pom:1.1.9:compile' is invalid. It will be ignored for artifact
resolution. Reason: Not a v4.0.0 POM. for project jpox:jpox at /home/continuum/.m2/repository/jpox/jpox/1.1.9/jpox-1.1.9.pom
[INFO] [antrun:run {execution: default}]
[INFO] Executing tasks
     [copy] Copying 2 files to /home/continuum/data/working-directory/683/target/appserver-base
[INFO] Executed tasks
[INFO] [resources:resources]
[INFO] Using default encoding to copy filtered resources.
[INFO] [dependency:copy {execution: copy}]
[INFO] Configured Artifact: org.apache.archiva:archiva-applet:1.1-SNAPSHOT:jar
[INFO] Copying archiva-applet-1.1-SNAPSHOT.jar to /home/continuum/data/working-directory/683/src/main/webapp/archiva-applet.jar
[WARNING] POM for 'jpox:jpox:pom:1.1.9:compile' is invalid. It will be ignored for artifact
resolution. Reason: Not a v4.0.0 POM. for project jpox:jpox at /home/continuum/.m2/repository/jpox/jpox/1.1.9/jpox-1.1.9.pom
[WARNING] POM for 'jpox:jpox:pom:1.1.9:compile' is invalid. It will be ignored for artifact
resolution. Reason: Not a v4.0.0 POM. for project jpox:jpox at /home/continuum/.m2/repository/jpox/jpox/1.1.9/jpox-1.1.9.pom
[WARNING] POM for 'jpox:jpox:pom:1.1.9:compile' is invalid. It will be ignored for artifact
resolution. Reason: Not a v4.0.0 POM. for project jpox:jpox at /home/continuum/.m2/repository/jpox/jpox/1.1.9/jpox-1.1.9.pom
[WARNING] POM for 'jpox:jpox:pom:1.1.9:compile' is invalid. It will be ignored for artifact
resolution. Reason: Not a v4.0.0 POM. for project jpox:jpox at /home/continuum/.m2/repository/jpox/jpox/1.1.9/jpox-1.1.9.pom
[INFO] [compiler:compile]
[INFO] Compiling 66 source files to /home/continuum/data/working-directory/683/target/classes
[INFO] ------------------------------------------------------------------------
[ERROR] BUILD FAILURE
[INFO] ------------------------------------------------------------------------
[INFO] Compilation failure

/home/continuum/data/working-directory/683/src/main/java/org/apache/maven/archiva/web/action/UploadAction.java:[31,35]
package org.apache.archiva.checksum does not exist

/home/continuum/data/working-directory/683/src/main/java/org/apache/maven/archiva/web/action/UploadAction.java:[32,35]
package org.apache.archiva.checksum does not exist

/home/continuum/data/working-directory/683/src/main/java/org/apache/maven/archiva/web/action/UploadAction.java:[142,12]
cannot find symbol
symbol  : class ChecksumAlgorithm
location: class org.apache.maven.archiva.web.action.UploadAction

/home/continuum/data/working-directory/683/src/main/java/org/apache/maven/archiva/web/action/UploadAction.java:[142,49]
cannot find symbol
symbol  : class ChecksumAlgorithm
location: class org.apache.maven.archiva.web.action.UploadAction

/home/continuum/data/working-directory/683/src/main/java/org/apache/maven/archiva/web/action/UploadAction.java:[142,71]
cannot find symbol
symbol  : variable ChecksumAlgorithm
location: class org.apache.maven.archiva.web.action.UploadAction

/home/continuum/data/working-directory/683/src/main/java/org/apache/maven/archiva/web/action/UploadAction.java:[142,95]
cannot find symbol
symbol  : variable ChecksumAlgorithm
location: class org.apache.maven.archiva.web.action.UploadAction

/home/continuum/data/working-directory/683/src/main/java/org/apache/maven/archiva/web/action/UploadAction.java:[423,8]
cannot find symbol
symbol  : class ChecksummedFile
location: class org.apache.maven.archiva.web.action.UploadAction

/home/continuum/data/working-directory/683/src/main/java/org/apache/maven/archiva/web/action/UploadAction.java:[423,39]
cannot find symbol
symbol  : class ChecksummedFile
location: class org.apache.maven.archiva.web.action.UploadAction


[INFO] ------------------------------------------------------------------------
[INFO] For more information, run Maven with the -e switch
[INFO] ------------------------------------------------------------------------
[INFO] Total time: 35 seconds
[INFO] Finished at: Mon Apr 14 21:56:18 PDT 2008
[INFO] Final Memory: 30M/62M
[INFO] ------------------------------------------------------------------------

****************************************************************************



Mime
View raw message