maven-notifications mailing list archives

Site index · List index
Message view « Date » · « Thread »
Top « Date » · « Thread »
From Hudson <Hud...@sonatype.org>
Subject Build failed in Hudson: maven-shared » Maven Shared Components #66
Date Sat, 10 May 2008 01:21:46 GMT
See http://ci.sonatype.org/job/maven-shared/org.apache.maven.shared$maven-shared-components/66/changes

------------------------------------------
[...truncated 246 lines...]
Downloading: http://localhost:8081/nexus/content/groups/public/org/codehaus/plexus/plexus-utils/1.4.1/plexus-utils-1.4.1.jar
184K downloaded
Downloading: http://localhost:8081/nexus/content/groups/public/velocity/velocity-dep/1.4/velocity-dep-1.4.jar
505K downloaded
Downloading: http://localhost:8081/nexus/content/groups/public/org/apache/maven/shared/maven-downloader/1.1/maven-downloader-1.1.jar
6K downloaded
Downloading: http://localhost:8081/nexus/content/groups/public/org/codehaus/plexus/plexus-velocity/1.1.3/plexus-velocity-1.1.3.jar
7K downloaded
Downloading: http://localhost:8081/nexus/content/groups/public/commons-collections/commons-collections/2.0/commons-collections-2.0.jar
88K downloaded
Downloading: http://localhost:8081/nexus/content/groups/public/velocity/velocity/1.4/velocity-1.4.jar
352K downloaded
Downloading: http://localhost:8081/nexus/content/groups/public/org/codehaus/plexus/plexus-resources/1.0-alpha-4/plexus-resources-1.0-alpha-4.jar
16K downloaded
[INFO] Setting property: classpath.resource.loader.class => 'org.codehaus.plexus.velocity.ContextClassLoaderResourceLoader'.
[INFO] Setting property: velocimacro.messages.on => 'false'.
[INFO] Setting property: resource.loader => 'classpath'.
[INFO] Setting property: resource.manager.logwhenfound => 'false'.
[INFO] [remote-resources:process {execution: default}]
Downloading: http://localhost:8081/nexus/content/groups/public/org/apache/apache-jar-resource-bundle/1.3/apache-jar-resource-bundle-1.3.jar
10K downloaded
Downloading: http://localhost:8081/nexus/content/groups/public/org/apache/maven/maven-repository-metadata/2.0.2/maven-repository-metadata-2.0.2.pom
1K downloaded
Downloading: http://localhost:8081/nexus/content/groups/public/org/apache/maven/maven-model/2.0.2/maven-model-2.0.2.pom
2K downloaded
Downloading: http://localhost:8081/nexus/content/groups/public/org/apache/maven/maven-settings/2.0/maven-settings-2.0.pom
1K downloaded
Downloading: http://localhost:8081/nexus/content/groups/public/org/apache/maven/doxia/doxia-module-xhtml/1.0-alpha-10/doxia-module-xhtml-1.0-alpha-10.pom
1K downloaded
Downloading: http://localhost:8081/nexus/content/groups/public/org/apache/maven/doxia/doxia-modules/1.0-alpha-10/doxia-modules-1.0-alpha-10.pom
2K downloaded
Downloading: http://localhost:8081/nexus/content/groups/public/org/apache/maven/doxia/doxia/1.0-alpha-10/doxia-1.0-alpha-10.pom
8K downloaded
Downloading: http://localhost:8081/nexus/content/groups/public/org/apache/maven/maven-parent/6/maven-parent-6.pom
19K downloaded
Downloading: http://localhost:8081/nexus/content/groups/public/org/codehaus/plexus/plexus-utils/1.4.5/plexus-utils-1.4.5.pom
2K downloaded
Downloading: http://localhost:8081/nexus/content/groups/public/org/apache/maven/doxia/doxia-core/1.0-alpha-10/doxia-core-1.0-alpha-10.pom
2K downloaded
Downloading: http://localhost:8081/nexus/content/groups/public/org/apache/maven/doxia/doxia-sink-api/1.0-alpha-10/doxia-sink-api-1.0-alpha-10.pom
1K downloaded
Downloading: http://localhost:8081/nexus/content/groups/public/org/codehaus/plexus/plexus-container-default/1.0-alpha-30/plexus-container-default-1.0-alpha-30.pom
3K downloaded
Downloading: http://localhost:8081/nexus/content/groups/public/org/codehaus/plexus/plexus-containers/1.0-alpha-30/plexus-containers-1.0-alpha-30.pom
1K downloaded
Downloading: http://localhost:8081/nexus/content/groups/public/org/apache/maven/doxia/doxia-decoration-model/1.0-alpha-10/doxia-decoration-model-1.0-alpha-10.pom
2K downloaded
Downloading: http://localhost:8081/nexus/content/groups/public/org/apache/maven/doxia/doxia-sitetools/1.0-alpha-10/doxia-sitetools-1.0-alpha-10.pom
7K downloaded
Downloading: http://localhost:8081/nexus/content/groups/public/org/apache/maven/doxia/doxia-site-renderer/1.0-alpha-10/doxia-site-renderer-1.0-alpha-10.pom
4K downloaded
Downloading: http://localhost:8081/nexus/content/groups/public/org/codehaus/plexus/plexus-i18n/1.0-beta-7/plexus-i18n-1.0-beta-7.pom
1K downloaded
Downloading: http://localhost:8081/nexus/content/groups/public/org/codehaus/plexus/plexus-components/1.1.12/plexus-components-1.1.12.pom
2K downloaded
Downloading: http://localhost:8081/nexus/content/groups/public/org/codehaus/plexus/plexus/1.0.10/plexus-1.0.10.pom
8K downloaded
Downloading: http://localhost:8081/nexus/content/groups/public/org/codehaus/plexus/plexus-velocity/1.1.7/plexus-velocity-1.1.7.pom
1K downloaded
Downloading: http://localhost:8081/nexus/content/groups/public/org/apache/velocity/velocity/1.5/velocity-1.5.pom
7K downloaded
Downloading: http://localhost:8081/nexus/content/groups/public/commons-collections/commons-collections/3.1/commons-collections-3.1.pom
5K downloaded
Downloading: http://localhost:8081/nexus/content/groups/public/commons-lang/commons-lang/2.1/commons-lang-2.1.pom
9K downloaded
Downloading: http://localhost:8081/nexus/content/groups/public/oro/oro/2.0.8/oro-2.0.8.pom
140b downloaded
Downloading: http://localhost:8081/nexus/content/groups/public/commons-collections/commons-collections/3.2/commons-collections-3.2.pom
10K downloaded
Downloading: http://localhost:8081/nexus/content/groups/public/org/apache/maven/doxia/doxia-module-apt/1.0-alpha-10/doxia-module-apt-1.0-alpha-10.pom
2K downloaded
Downloading: http://localhost:8081/nexus/content/groups/public/org/apache/maven/doxia/doxia-module-fml/1.0-alpha-10/doxia-module-fml-1.0-alpha-10.pom
2K downloaded
Downloading: http://localhost:8081/nexus/content/groups/public/org/apache/maven/doxia/doxia-module-xdoc/1.0-alpha-10/doxia-module-xdoc-1.0-alpha-10.pom
2K downloaded
Downloading: http://localhost:8081/nexus/content/groups/public/org/apache/maven/reporting/maven-reporting-api/2.0.4/maven-reporting-api-2.0.4.pom
902b downloaded
Downloading: http://localhost:8081/nexus/content/groups/public/org/apache/maven/reporting/maven-reporting/2.0.4/maven-reporting-2.0.4.pom
700b downloaded
Downloading: http://localhost:8081/nexus/content/groups/public/org/apache/maven/maven/2.0.4/maven-2.0.4.pom
11K downloaded
Downloading: http://localhost:8081/nexus/content/groups/public/org/codehaus/plexus/plexus-archiver/1.0-alpha-7/plexus-archiver-1.0-alpha-7.pom
1K downloaded
Downloading: http://localhost:8081/nexus/content/groups/public/org/codehaus/plexus/plexus-components/1.1.6/plexus-components-1.1.6.pom
1K downloaded
Downloading: http://localhost:8081/nexus/content/groups/public/org/codehaus/plexus/plexus-utils/1.2/plexus-utils-1.2.pom
767b downloaded
Downloading: http://localhost:8081/nexus/content/groups/public/org/mortbay/jetty/jetty/6.1.5/jetty-6.1.5.pom
4K downloaded
Downloading: http://localhost:8081/nexus/content/groups/public/org/mortbay/jetty/project/6.1.5/project-6.1.5.pom
12K downloaded
Downloading: http://localhost:8081/nexus/content/groups/public/org/mortbay/jetty/jetty-util/6.1.5/jetty-util-6.1.5.pom
3K downloaded
Downloading: http://localhost:8081/nexus/content/groups/public/org/mortbay/jetty/servlet-api-2.5/6.1.5/servlet-api-2.5-6.1.5.pom
3K downloaded
Downloading: http://localhost:8081/nexus/content/groups/public/org/codehaus/plexus/plexus-utils/1.4.5/plexus-utils-1.4.5.jar
200K downloaded
Downloading: http://localhost:8081/nexus/content/groups/public/org/apache/maven/doxia/doxia-module-xhtml/1.0-alpha-10/doxia-module-xhtml-1.0-alpha-10.jar
20K downloaded
Downloading: http://localhost:8081/nexus/content/groups/public/org/apache/maven/doxia/doxia-core/1.0-alpha-10/doxia-core-1.0-alpha-10.jar
53K downloaded
Downloading: http://localhost:8081/nexus/content/groups/public/org/apache/maven/doxia/doxia-decoration-model/1.0-alpha-10/doxia-decoration-model-1.0-alpha-10.jar
48K downloaded
Downloading: http://localhost:8081/nexus/content/groups/public/org/apache/maven/doxia/doxia-site-renderer/1.0-alpha-10/doxia-site-renderer-1.0-alpha-10.jar
44K downloaded
Downloading: http://localhost:8081/nexus/content/groups/public/org/codehaus/plexus/plexus-i18n/1.0-beta-7/plexus-i18n-1.0-beta-7.jar
10K downloaded
Downloading: http://localhost:8081/nexus/content/groups/public/org/codehaus/plexus/plexus-velocity/1.1.7/plexus-velocity-1.1.7.jar
7K downloaded
Downloading: http://localhost:8081/nexus/content/groups/public/org/apache/velocity/velocity/1.5/velocity-1.5.jar
382K downloaded
Downloading: http://localhost:8081/nexus/content/groups/public/commons-collections/commons-collections/3.2/commons-collections-3.2.jar
557K downloaded
Downloading: http://localhost:8081/nexus/content/groups/public/commons-lang/commons-lang/2.1/commons-lang-2.1.jar
202K downloaded
Downloading: http://localhost:8081/nexus/content/groups/public/oro/oro/2.0.8/oro-2.0.8.jar
63K downloaded
Downloading: http://localhost:8081/nexus/content/groups/public/org/apache/maven/doxia/doxia-module-apt/1.0-alpha-10/doxia-module-apt-1.0-alpha-10.jar
45K downloaded
Downloading: http://localhost:8081/nexus/content/groups/public/org/apache/maven/doxia/doxia-module-fml/1.0-alpha-10/doxia-module-fml-1.0-alpha-10.jar
17K downloaded
Downloading: http://localhost:8081/nexus/content/groups/public/org/apache/maven/doxia/doxia-module-xdoc/1.0-alpha-10/doxia-module-xdoc-1.0-alpha-10.jar
26K downloaded
Downloading: http://localhost:8081/nexus/content/groups/public/org/codehaus/plexus/plexus-archiver/1.0-alpha-7/plexus-archiver-1.0-alpha-7.jar
138K downloaded
Downloading: http://localhost:8081/nexus/content/groups/public/org/mortbay/jetty/jetty/6.1.5/jetty-6.1.5.jar
474K downloaded
Downloading: http://localhost:8081/nexus/content/groups/public/org/mortbay/jetty/jetty-util/6.1.5/jetty-util-6.1.5.jar
134K downloaded
Downloading: http://localhost:8081/nexus/content/groups/public/org/mortbay/jetty/servlet-api-2.5/6.1.5/servlet-api-2.5-6.1.5.jar
129K downloaded
[INFO] [site:attach-descriptor]
[INFO] Unable to load parent project from a relative path: Could not find the model file 'http://ci.sonatype.org/job/maven-shared/org.apache.maven.shared$maven-shared-components/ws/../pom/maven/pom.xml'.
 for project unknown
[INFO] Parent project loaded from repository.
Downloading: http://localhost:8081/nexus/content/groups/public/org/apache/maven/maven-project/2.0.6/maven-project-2.0.6.pom
2K downloaded
Downloading: http://localhost:8081/nexus/content/groups/public/org/apache/maven/maven-settings/2.0.6/maven-settings-2.0.6.pom
1K downloaded
Downloading: http://localhost:8081/nexus/content/groups/public/org/apache/maven/maven-model/2.0.6/maven-model-2.0.6.pom
2K downloaded
Downloading: http://localhost:8081/nexus/content/groups/public/org/codehaus/plexus/plexus-container-default/1.0-alpha-9-stable-1/plexus-container-default-1.0-alpha-9-stable-1.pom
3K downloaded
Downloading: http://localhost:8081/nexus/content/groups/public/org/apache/maven/maven-profile/2.0.6/maven-profile-2.0.6.pom
1K downloaded
Downloading: http://localhost:8081/nexus/content/groups/public/org/apache/maven/maven-artifact-manager/2.0.6/maven-artifact-manager-2.0.6.pom
2K downloaded
Downloading: http://localhost:8081/nexus/content/groups/public/org/apache/maven/maven-repository-metadata/2.0.6/maven-repository-metadata-2.0.6.pom
1K downloaded
Downloading: http://localhost:8081/nexus/content/groups/public/org/apache/maven/maven-artifact/2.0.6/maven-artifact-2.0.6.pom
1K downloaded
Downloading: http://localhost:8081/nexus/content/groups/public/org/apache/maven/maven-plugin-registry/2.0.6/maven-plugin-registry-2.0.6.pom
1K downloaded
Downloading: http://localhost:8081/nexus/content/groups/public/org/codehaus/plexus/plexus-digest/1.0/plexus-digest-1.0.pom
1K downloaded
Downloading: http://localhost:8081/nexus/content/groups/public/org/codehaus/plexus/plexus-digest/1.0/plexus-digest-1.0.jar
11K downloaded
[INFO] [install:install]
[INFO] Installing http://ci.sonatype.org/job/maven-shared/org.apache.maven.shared$maven-shared-components/ws/pom.xml
 to /home/j2ee-hudson/repos/maven-shared/org/apache/maven/shared/maven-shared-components/10-SNAPSHOT/maven-shared-components-10-SNAPSHOT.pom
Downloading: http://localhost:8081/nexus/content/groups/public/org/apache/maven/maven-core/2.0/maven-core-2.0.pom
5K downloaded
Downloading: http://localhost:8081/nexus/content/groups/public/org/apache/maven/wagon/wagon-file/1.0-alpha-5/wagon-file-1.0-alpha-5.pom
5K downloaded
Downloading: http://localhost:8081/nexus/content/groups/public/org/apache/maven/maven-plugin-parameter-documenter/2.0/maven-plugin-parameter-documenter-2.0.pom
1K downloaded
Downloading: http://localhost:8081/nexus/content/groups/public/org/apache/maven/wagon/wagon-http-lightweight/1.0-alpha-5/wagon-http-lightweight-1.0-alpha-5.pom
5K downloaded
Downloading: http://localhost:8081/nexus/content/groups/public/org/apache/maven/reporting/maven-reporting-api/2.0/maven-reporting-api-2.0.pom
1K downloaded
Downloading: http://localhost:8081/nexus/content/groups/public/org/apache/maven/reporting/maven-reporting/2.0/maven-reporting-2.0.pom
504b downloaded
Downloading: http://localhost:8081/nexus/content/groups/public/doxia/doxia-sink-api/1.0-alpha-4/doxia-sink-api-1.0-alpha-4.pom
1K downloaded
Downloading: http://localhost:8081/nexus/content/groups/public/org/apache/maven/maven-error-diagnostics/2.0/maven-error-diagnostics-2.0.pom
812b downloaded
Downloading: http://localhost:8081/nexus/content/groups/public/org/apache/maven/maven-plugin-registry/2.0/maven-plugin-registry-2.0.pom
1K downloaded
Downloading: http://localhost:8081/nexus/content/groups/public/org/apache/maven/maven-plugin-descriptor/2.0/maven-plugin-descriptor-2.0.pom
1K downloaded
Downloading: http://localhost:8081/nexus/content/groups/public/org/apache/maven/maven-monitor/2.0/maven-monitor-2.0.pom
400b downloaded
Downloading: http://localhost:8081/nexus/content/groups/public/org/apache/maven/wagon/wagon-ssh/1.0-alpha-5/wagon-ssh-1.0-alpha-5.pom
6K downloaded
Downloading: http://localhost:8081/nexus/content/groups/public/com/jcraft/jsch/0.1.23/jsch-0.1.23.pom
485b downloaded
[INFO] [deploy:deploy]
altDeploymentRepository = null
[INFO] Retrieving previous build number from apache.snapshots
[WARNING] *** CHECKSUM FAILED - Error retrieving checksum file for org/apache/maven/shared/maven-shared-components/10-SNAPSHOT/maven-metadata.xml
- IGNORING
Uploading: http://localhost:8081/nexus/content/repositories/maven.snapshots/org/apache/maven/shared/maven-shared-components/10-SNAPSHOT/maven-shared-components-10-20080510.012146-60.pom
3K uploaded
[HUDSON] Archiving http://ci.sonatype.org/job/maven-shared/org.apache.maven.shared$maven-shared-components/ws/pom.xml
 to /home/j2ee-hudson/.hudson/jobs/maven-shared/modules/org.apache.maven.shared$maven-shared-components/builds/2008-05-09_20-21-33/archive/org.apache.maven.shared/maven-shared-components/10-SNAPSHOT/pom.xml
[INFO] ------------------------------------------------------------------------
[ERROR] BUILD ERROR
[INFO] ------------------------------------------------------------------------
[INFO] Error deploying artifact: Failed to transfer file: http://localhost:8081/nexus/content/repositories/maven.snapshots/org/apache/maven/shared/maven-shared-components/10-SNAPSHOT/maven-shared-components-10-20080510.012146-60.pom.
Return code is: 401

[INFO] ------------------------------------------------------------------------
[INFO] Trace
org.apache.maven.lifecycle.LifecycleExecutionException: Error deploying artifact: Failed to
transfer file: http://localhost:8081/nexus/content/repositories/maven.snapshots/org/apache/maven/shared/maven-shared-components/10-SNAPSHOT/maven-shared-components-10-20080510.012146-60.pom.
Return code is: 401
	at org.apache.maven.lifecycle.DefaultLifecycleExecutor.executeGoals(DefaultLifecycleExecutor.java:583)
	at org.apache.maven.lifecycle.DefaultLifecycleExecutor.executeGoalWithLifecycle(DefaultLifecycleExecutor.java:499)
	at org.apache.maven.lifecycle.DefaultLifecycleExecutor.executeGoal(DefaultLifecycleExecutor.java:478)
	at org.apache.maven.lifecycle.DefaultLifecycleExecutor.executeGoalAndHandleFailures(DefaultLifecycleExecutor.java:330)
	at org.apache.maven.lifecycle.DefaultLifecycleExecutor.executeTaskSegments(DefaultLifecycleExecutor.java:291)
	at org.apache.maven.lifecycle.DefaultLifecycleExecutor.execute(DefaultLifecycleExecutor.java:142)
	at org.apache.maven.lifecycle.LifecycleExecutorInterceptor.execute(LifecycleExecutorInterceptor.java:42)
	at org.apache.maven.DefaultMaven.doExecute(DefaultMaven.java:336)
	at org.apache.maven.DefaultMaven.execute(DefaultMaven.java:129)
	at org.apache.maven.cli.MavenCli.main(MavenCli.java:287)
	at sun.reflect.NativeMethodAccessorImpl.invoke0(Native Method)
	at sun.reflect.NativeMethodAccessorImpl.invoke(NativeMethodAccessorImpl.java:39)
	at sun.reflect.DelegatingMethodAccessorImpl.invoke(DelegatingMethodAccessorImpl.java:25)
	at java.lang.reflect.Method.invoke(Method.java:597)
	at org.codehaus.classworlds.Launcher.launchEnhanced(Launcher.java:315)
	at org.codehaus.classworlds.Launcher.launch(Launcher.java:255)
	at hudson.maven.agent.Main.launch(Main.java:111)
	at hudson.maven.MavenBuilder.call(MavenBuilder.java:129)
	at hudson.maven.MavenModuleSetBuild$Builder.call(MavenModuleSetBuild.java:522)
	at hudson.maven.MavenModuleSetBuild$Builder.call(MavenModuleSetBuild.java:468)
	at hudson.remoting.UserRequest.perform(UserRequest.java:69)
	at hudson.remoting.UserRequest.perform(UserRequest.java:23)
	at hudson.remoting.Request$2.run(Request.java:200)
	at java.util.concurrent.Executors$RunnableAdapter.call(Executors.java:441)
	at java.util.concurrent.FutureTask$Sync.innerRun(FutureTask.java:303)
	at java.util.concurrent.FutureTask.run(FutureTask.java:138)
	at java.util.concurrent.ThreadPoolExecutor$Worker.runTask(ThreadPoolExecutor.java:885)
	at java.util.concurrent.ThreadPoolExecutor$Worker.run(ThreadPoolExecutor.java:907)
	at java.lang.Thread.run(Thread.java:619)
Caused by: org.apache.maven.plugin.MojoExecutionException: Error deploying artifact: Failed
to transfer file: http://localhost:8081/nexus/content/repositories/maven.snapshots/org/apache/maven/shared/maven-shared-components/10-SNAPSHOT/maven-shared-components-10-20080510.012146-60.pom.
Return code is: 401
	at org.apache.maven.plugin.deploy.DeployMojo.execute(DeployMojo.java:174)
	at org.apache.maven.plugin.DefaultPluginManager.executeMojo(DefaultPluginManager.java:451)
	at hudson.maven.agent.PluginManagerInterceptor.executeMojo(PluginManagerInterceptor.java:136)
	at org.apache.maven.lifecycle.DefaultLifecycleExecutor.executeGoals(DefaultLifecycleExecutor.java:558)
	... 28 more
Caused by: org.apache.maven.artifact.deployer.ArtifactDeploymentException: Error deploying
artifact: Failed to transfer file: http://localhost:8081/nexus/content/repositories/maven.snapshots/org/apache/maven/shared/maven-shared-components/10-SNAPSHOT/maven-shared-components-10-20080510.012146-60.pom.
Return code is: 401
	at org.apache.maven.artifact.deployer.DefaultArtifactDeployer.deploy(DefaultArtifactDeployer.java:94)
	at org.apache.maven.plugin.deploy.DeployMojo.execute(DeployMojo.java:152)
	... 31 more
Caused by: org.apache.maven.wagon.TransferFailedException: Failed to transfer file: http://localhost:8081/nexus/content/repositories/maven.snapshots/org/apache/maven/shared/maven-shared-components/10-SNAPSHOT/maven-shared-components-10-20080510.012146-60.pom.
Return code is: 401
	at org.apache.maven.wagon.providers.http.LightweightHttpWagon.put(LightweightHttpWagon.java:172)
	at org.apache.maven.artifact.manager.DefaultWagonManager.putRemoteFile(DefaultWagonManager.java:244)
	at org.apache.maven.artifact.manager.DefaultWagonManager.putArtifact(DefaultWagonManager.java:160)
	at org.apache.maven.artifact.deployer.DefaultArtifactDeployer.deploy(DefaultArtifactDeployer.java:80)
	... 32 more
[INFO] ------------------------------------------------------------------------
[INFO] Total time: 11 seconds
[INFO] Finished at: Fri May 09 20:21:46 CDT 2008
[INFO] Final Memory: 31M/426M
[INFO] ------------------------------------------------------------------------


Mime
View raw message