maven-notifications mailing list archives

Site index · List index
Message view « Date » · « Thread »
Top « Date » · « Thread »
From Hudson <Hud...@sonatype.org>
Subject Build failed in Hudson: Maven-2.1.x-ITs #104
Date Tue, 13 May 2008 16:16:26 GMT
See http://ci.sonatype.org/job/Maven-2.1.x-ITs/104/changes

------------------------------------------
[...truncated 1602 lines...]
for artifact: 
  org.apache.maven.plugins:maven-assembly-plugin:maven-plugin:2.1
from the specified remote repositories:
  Nexus (http://localhost:8081/nexus/content/groups/public),
  snapshots (http://snapshots.maven.codehaus.org/maven2)
org.apache.maven.plugin.loader.PluginLoaderException: Failed to load plugin. Reason: Missing:
----------
1) org.apache.maven.wagon:wagon-file:jar:1.0-alpha-7
  Try downloading the file manually from the project website.
  Then, install it using the command: 
      mvn install:install-file -DgroupId=org.apache.maven.wagon -DartifactId=wagon-file -Dversion=1.0-alpha-7
-Dpackaging=jar -Dfile=/path/to/file
  Alternatively, if you host your own repository you can deploy the file there: 
      mvn deploy:deploy-file -DgroupId=org.apache.maven.wagon -DartifactId=wagon-file -Dversion=1.0-alpha-7
-Dpackaging=jar -Dfile=/path/to/file -Durl=[url] -DrepositoryId=[id]
  Path to dependency: 
  	1) org.apache.maven.plugins:maven-assembly-plugin:maven-plugin:2.1
  	2) org.apache.maven:maven-core:jar:2.0.4
  	3) org.apache.maven.wagon:wagon-file:jar:1.0-alpha-7
----------
1 required artifact is missing.
for artifact: 
  org.apache.maven.plugins:maven-assembly-plugin:maven-plugin:2.1
from the specified remote repositories:
  Nexus (http://localhost:8081/nexus/content/groups/public),
  snapshots (http://snapshots.maven.codehaus.org/maven2)
	at org.apache.maven.plugin.loader.DefaultPluginLoader.loadPlugin(DefaultPluginLoader.java:89)
	at org.apache.maven.plugin.loader.DefaultPluginLoader.loadPlugin(DefaultPluginLoader.java:52)
	at org.apache.maven.lifecycle.plan.DefaultBuildPlanner.loadPluginDescriptor(DefaultBuildPlanner.java:322)
	at org.apache.maven.lifecycle.plan.DefaultBuildPlanner.findForkModifiers(DefaultBuildPlanner.java:192)
	at org.apache.maven.lifecycle.plan.DefaultBuildPlanner.addForkedLifecycleModifiers(DefaultBuildPlanner.java:179)
	at org.apache.maven.lifecycle.plan.DefaultBuildPlanner.constructBuildPlan_aroundBody0(DefaultBuildPlanner.java:117)
	at org.apache.maven.lifecycle.plan.DefaultBuildPlanner.constructBuildPlan_aroundBody1$advice(DefaultBuildPlanner.java:403)
	at org.apache.maven.lifecycle.plan.DefaultBuildPlanner.constructBuildPlan(DefaultBuildPlanner.java:1)
	at org.apache.maven.lifecycle.DefaultLifecycleExecutor.getLifecycleBindings(DefaultLifecycleExecutor.java:400)
	at org.apache.maven.lifecycle.DefaultLifecycleExecutor.executeTaskSegmentForProject(DefaultLifecycleExecutor.java:235)
	at org.apache.maven.lifecycle.DefaultLifecycleExecutor.executeTaskSegments(DefaultLifecycleExecutor.java:191)
	at org.apache.maven.lifecycle.DefaultLifecycleExecutor.execute(DefaultLifecycleExecutor.java:149)
	at org.apache.maven.DefaultMaven.execute_aroundBody0(DefaultMaven.java:223)
	at org.apache.maven.DefaultMaven.execute_aroundBody1$advice(DefaultMaven.java:304)
	at org.apache.maven.DefaultMaven.execute(DefaultMaven.java:1)
	at org.apache.maven.embedder.MavenEmbedder.execute_aroundBody2(MavenEmbedder.java:904)
	at org.apache.maven.embedder.MavenEmbedder.execute_aroundBody3$advice(MavenEmbedder.java:304)
	at org.apache.maven.embedder.MavenEmbedder.execute(MavenEmbedder.java:1)
	at org.apache.maven.cli.MavenCli.doMain(MavenCli.java:176)
	at org.apache.maven.cli.MavenCli.main(MavenCli.java:63)
	at sun.reflect.NativeMethodAccessorImpl.invoke0(Native Method)
	at sun.reflect.NativeMethodAccessorImpl.invoke(NativeMethodAccessorImpl.java:39)
	at sun.reflect.DelegatingMethodAccessorImpl.invoke(DelegatingMethodAccessorImpl.java:25)
	at java.lang.reflect.Method.invoke(Method.java:585)
	at org.codehaus.plexus.classworlds.launcher.Launcher.launchEnhanced(Launcher.java:289)
	at org.codehaus.plexus.classworlds.launcher.Launcher.launch(Launcher.java:229)
	at org.codehaus.plexus.classworlds.launcher.Launcher.mainWithExitCode(Launcher.java:408)
	at org.codehaus.plexus.classworlds.launcher.Launcher.main(Launcher.java:351)
Caused by: org.apache.maven.artifact.resolver.MultipleArtifactsNotFoundException: Missing:
----------
1) org.apache.maven.wagon:wagon-file:jar:1.0-alpha-7
  Try downloading the file manually from the project website.
  Then, install it using the command: 
      mvn install:install-file -DgroupId=org.apache.maven.wagon -DartifactId=wagon-file -Dversion=1.0-alpha-7
-Dpackaging=jar -Dfile=/path/to/file
  Alternatively, if you host your own repository you can deploy the file there: 
      mvn deploy:deploy-file -DgroupId=org.apache.maven.wagon -DartifactId=wagon-file -Dversion=1.0-alpha-7
-Dpackaging=jar -Dfile=/path/to/file -Durl=[url] -DrepositoryId=[id]
  Path to dependency: 
  	1) org.apache.maven.plugins:maven-assembly-plugin:maven-plugin:2.1
  	2) org.apache.maven:maven-core:jar:2.0.4
  	3) org.apache.maven.wagon:wagon-file:jar:1.0-alpha-7
----------
1 required artifact is missing.
for artifact: 
  org.apache.maven.plugins:maven-assembly-plugin:maven-plugin:2.1
from the specified remote repositories:
  Nexus (http://localhost:8081/nexus/content/groups/public),
  snapshots (http://snapshots.maven.codehaus.org/maven2)
	at org.apache.maven.artifact.resolver.DefaultArtifactResolver.resolveTransitively(DefaultArtifactResolver.java:496)
	at org.apache.maven.artifact.resolver.DefaultArtifactResolver.resolveTransitively(DefaultArtifactResolver.java:400)
	at org.apache.maven.artifact.resolver.DefaultArtifactResolver.resolveTransitively(DefaultArtifactResolver.java:343)
	at org.apache.maven.plugin.DefaultPluginManager.getPluginArtifacts(DefaultPluginManager.java:434)
	at org.apache.maven.plugin.DefaultPluginManager.addPlugin(DefaultPluginManager.java:277)
	at org.apache.maven.plugin.DefaultPluginManager.verifyVersionedPlugin(DefaultPluginManager.java:211)
	at org.apache.maven.plugin.DefaultPluginManager.verifyPlugin(DefaultPluginManager.java:186)
	at org.apache.maven.plugin.loader.DefaultPluginLoader.loadPlugin(DefaultPluginLoader.java:79)
	... 27 more
Error stacktrace:
org.apache.maven.lifecycle.LifecycleExecutionException: Failed to construct build plan for:
it0129 - extension
Id: org.apache.maven.its.it0129:it0129-extension:pom:1.0
task-segment: [clean:clean, install]. Reason: Failed to resolve plugin for mojo binding: org.apache.maven.plugins:maven-assembly-plugin:2.1:single
	at org.apache.maven.lifecycle.DefaultLifecycleExecutor.getLifecycleBindings(DefaultLifecycleExecutor.java:414)
	at org.apache.maven.lifecycle.DefaultLifecycleExecutor.executeTaskSegmentForProject(DefaultLifecycleExecutor.java:235)
	at org.apache.maven.lifecycle.DefaultLifecycleExecutor.executeTaskSegments(DefaultLifecycleExecutor.java:191)
	at org.apache.maven.lifecycle.DefaultLifecycleExecutor.execute(DefaultLifecycleExecutor.java:149)
	at org.apache.maven.DefaultMaven.execute_aroundBody0(DefaultMaven.java:223)
	at org.apache.maven.DefaultMaven.execute_aroundBody1$advice(DefaultMaven.java:304)
	at org.apache.maven.DefaultMaven.execute(DefaultMaven.java:1)
	at org.apache.maven.embedder.MavenEmbedder.execute_aroundBody2(MavenEmbedder.java:904)
	at org.apache.maven.embedder.MavenEmbedder.execute_aroundBody3$advice(MavenEmbedder.java:304)
	at org.apache.maven.embedder.MavenEmbedder.execute(MavenEmbedder.java:1)
	at org.apache.maven.cli.MavenCli.doMain(MavenCli.java:176)
	at org.apache.maven.cli.MavenCli.main(MavenCli.java:63)
	at sun.reflect.NativeMethodAccessorImpl.invoke0(Native Method)
	at sun.reflect.NativeMethodAccessorImpl.invoke(NativeMethodAccessorImpl.java:39)
	at sun.reflect.DelegatingMethodAccessorImpl.invoke(DelegatingMethodAccessorImpl.java:25)
	at java.lang.reflect.Method.invoke(Method.java:585)
	at org.codehaus.plexus.classworlds.launcher.Launcher.launchEnhanced(Launcher.java:289)
	at org.codehaus.plexus.classworlds.launcher.Launcher.launch(Launcher.java:229)
	at org.codehaus.plexus.classworlds.launcher.Launcher.mainWithExitCode(Launcher.java:408)
	at org.codehaus.plexus.classworlds.launcher.Launcher.main(Launcher.java:351)
Caused by: org.apache.maven.lifecycle.plan.LifecyclePlannerException: Failed to resolve plugin
for mojo binding: org.apache.maven.plugins:maven-assembly-plugin:2.1:single
	at org.apache.maven.lifecycle.plan.DefaultBuildPlanner.loadPluginDescriptor(DefaultBuildPlanner.java:345)
	at org.apache.maven.lifecycle.plan.DefaultBuildPlanner.findForkModifiers(DefaultBuildPlanner.java:192)
	at org.apache.maven.lifecycle.plan.DefaultBuildPlanner.addForkedLifecycleModifiers(DefaultBuildPlanner.java:179)
	at org.apache.maven.lifecycle.plan.DefaultBuildPlanner.constructBuildPlan_aroundBody0(DefaultBuildPlanner.java:117)
	at org.apache.maven.lifecycle.plan.DefaultBuildPlanner.constructBuildPlan_aroundBody1$advice(DefaultBuildPlanner.java:403)
	at org.apache.maven.lifecycle.plan.DefaultBuildPlanner.constructBuildPlan(DefaultBuildPlanner.java:1)
	at org.apache.maven.lifecycle.DefaultLifecycleExecutor.getLifecycleBindings(DefaultLifecycleExecutor.java:400)
	... 19 more
Caused by: org.apache.maven.plugin.loader.PluginLoaderException: Failed to load plugin. Reason:
Missing:
----------
1) org.apache.maven.wagon:wagon-file:jar:1.0-alpha-7
  Try downloading the file manually from the project website.
  Then, install it using the command: 
      mvn install:install-file -DgroupId=org.apache.maven.wagon -DartifactId=wagon-file -Dversion=1.0-alpha-7
-Dpackaging=jar -Dfile=/path/to/file
  Alternatively, if you host your own repository you can deploy the file there: 
      mvn deploy:deploy-file -DgroupId=org.apache.maven.wagon -DartifactId=wagon-file -Dversion=1.0-alpha-7
-Dpackaging=jar -Dfile=/path/to/file -Durl=[url] -DrepositoryId=[id]
  Path to dependency: 
  	1) org.apache.maven.plugins:maven-assembly-plugin:maven-plugin:2.1
  	2) org.apache.maven:maven-core:jar:2.0.4
  	3) org.apache.maven.wagon:wagon-file:jar:1.0-alpha-7
----------
1 required artifact is missing.
for artifact: 
  org.apache.maven.plugins:maven-assembly-plugin:maven-plugin:2.1
from the specified remote repositories:
  Nexus (http://localhost:8081/nexus/content/groups/public),
  snapshots (http://snapshots.maven.codehaus.org/maven2)
	at org.apache.maven.plugin.loader.DefaultPluginLoader.loadPlugin(DefaultPluginLoader.java:89)
	at org.apache.maven.plugin.loader.DefaultPluginLoader.loadPlugin(DefaultPluginLoader.java:52)
	at org.apache.maven.lifecycle.plan.DefaultBuildPlanner.loadPluginDescriptor(DefaultBuildPlanner.java:322)
	... 25 more
Caused by: org.apache.maven.artifact.resolver.MultipleArtifactsNotFoundException: Missing:
----------
1) org.apache.maven.wagon:wagon-file:jar:1.0-alpha-7
  Try downloading the file manually from the project website.
  Then, install it using the command: 
      mvn install:install-file -DgroupId=org.apache.maven.wagon -DartifactId=wagon-file -Dversion=1.0-alpha-7
-Dpackaging=jar -Dfile=/path/to/file
  Alternatively, if you host your own repository you can deploy the file there: 
      mvn deploy:deploy-file -DgroupId=org.apache.maven.wagon -DartifactId=wagon-file -Dversion=1.0-alpha-7
-Dpackaging=jar -Dfile=/path/to/file -Durl=[url] -DrepositoryId=[id]
  Path to dependency: 
  	1) org.apache.maven.plugins:maven-assembly-plugin:maven-plugin:2.1
  	2) org.apache.maven:maven-core:jar:2.0.4
  	3) org.apache.maven.wagon:wagon-file:jar:1.0-alpha-7
----------
1 required artifact is missing.
for artifact: 
  org.apache.maven.plugins:maven-assembly-plugin:maven-plugin:2.1
from the specified remote repositories:
  Nexus (http://localhost:8081/nexus/content/groups/public),
  snapshots (http://snapshots.maven.codehaus.org/maven2)
	at org.apache.maven.artifact.resolver.DefaultArtifactResolver.resolveTransitively(DefaultArtifactResolver.java:496)
	at org.apache.maven.artifact.resolver.DefaultArtifactResolver.resolveTransitively(DefaultArtifactResolver.java:400)
	at org.apache.maven.artifact.resolver.DefaultArtifactResolver.resolveTransitively(DefaultArtifactResolver.java:343)
	at org.apache.maven.plugin.DefaultPluginManager.getPluginArtifacts(DefaultPluginManager.java:434)
	at org.apache.maven.plugin.DefaultPluginManager.addPlugin(DefaultPluginManager.java:277)
	at org.apache.maven.plugin.DefaultPluginManager.verifyVersionedPlugin(DefaultPluginManager.java:211)
	at org.apache.maven.plugin.DefaultPluginManager.verifyPlugin(DefaultPluginManager.java:186)
	at org.apache.maven.plugin.loader.DefaultPluginLoader.loadPlugin(DefaultPluginLoader.java:79)
	... 27 more
[INFO] ------------------------------------------------------------------------
[INFO] BUILD FAILED
[INFO] ------------------------------------------------------------------------
[INFO] Total time: 2 seconds
[INFO] Finished at: Tue May 13 11:08:25 CDT 2008
[INFO] Final Memory: 3M/169M
[INFO] ------------------------------------------------------------------------
	at org.apache.maven.it.Verifier.executeGoals(Verifier.java:1039)
	at org.apache.maven.it.Verifier.executeGoal(Verifier.java:894)
	at org.apache.maven.it.Verifier.executeGoal(Verifier.java:888)
	at org.apache.maven.integrationtests.MavenIT0129ResourceProvidedToAPluginAsAPluginDependency.testit0129(MavenIT0129ResourceProvidedToAPluginAsAPluginDependency.java:29)
	at org.apache.maven.integrationtests.MavenIT0129ResourceProvidedToAPluginAsAPluginDependency.testit0129(MavenIT0129ResourceProvidedToAPluginAsAPluginDependency.java:29)
	at sun.reflect.NativeMethodAccessorImpl.invoke0(Native Method)
	at sun.reflect.NativeMethodAccessorImpl.invoke(NativeMethodAccessorImpl.java:39)
	at sun.reflect.DelegatingMethodAccessorImpl.invoke(DelegatingMethodAccessorImpl.java:25)
	at java.lang.reflect.Method.invoke(Method.java:585)
	at junit.framework.TestCase.runTest(TestCase.java:154)
	at org.apache.maven.integrationtests.AbstractMavenIntegrationTestCase.runTest(AbstractMavenIntegrationTestCase.java:100)
	at junit.framework.TestCase.runBare(TestCase.java:127)
	at junit.framework.TestResult$1.protect(TestResult.java:106)
	at junit.framework.TestResult.runProtected(TestResult.java:124)
	at junit.framework.TestResult.run(TestResult.java:109)
	at junit.framework.TestCase.run(TestCase.java:118)
	at junit.framework.TestSuite.runTest(TestSuite.java:208)
	at junit.framework.TestSuite.run(TestSuite.java:203)
	at junit.framework.TestSuite.runTest(TestSuite.java:208)
	at junit.framework.TestSuite.run(TestSuite.java:203)
	at sun.reflect.NativeMethodAccessorImpl.invoke0(Native Method)
	at sun.reflect.NativeMethodAccessorImpl.invoke(NativeMethodAccessorImpl.java:39)
	at sun.reflect.DelegatingMethodAccessorImpl.invoke(DelegatingMethodAccessorImpl.java:25)
	at java.lang.reflect.Method.invoke(Method.java:585)
	at org.apache.maven.surefire.junit.JUnitTestSet.execute(JUnitTestSet.java:213)
	at org.apache.maven.surefire.suite.AbstractDirectoryTestSuite.executeTestSet(AbstractDirectoryTestSuite.java:138)
	at org.apache.maven.surefire.suite.AbstractDirectoryTestSuite.execute(AbstractDirectoryTestSuite.java:125)
	at org.apache.maven.surefire.Surefire.run(Surefire.java:132)
	at sun.reflect.NativeMethodAccessorImpl.invoke0(Native Method)
	at sun.reflect.NativeMethodAccessorImpl.invoke(NativeMethodAccessorImpl.java:39)
	at sun.reflect.DelegatingMethodAccessorImpl.invoke(DelegatingMethodAccessorImpl.java:25)
	at java.lang.reflect.Method.invoke(Method.java:585)
	at org.apache.maven.surefire.booter.SurefireBooter.runSuitesInProcess(SurefireBooter.java:290)
	at org.apache.maven.surefire.booter.SurefireBooter.main(SurefireBooter.java:818)


Results :

Tests in error: 
  testitMNG3473(org.apache.maven.integrationtests.MavenITmng3473PluginReportCrash)
  testit0129(org.apache.maven.integrationtests.MavenIT0129ResourceProvidedToAPluginAsAPluginDependency)

Tests run: 145, Failures: 0, Errors: 2, Skipped: 0

[INFO] ------------------------------------------------------------------------
[ERROR] BUILD FAILURE
[INFO] ------------------------------------------------------------------------
[INFO] There are test failures.
[INFO] ------------------------------------------------------------------------
[INFO] Trace
org.apache.maven.BuildFailureException: There are test failures.
	at org.apache.maven.lifecycle.DefaultLifecycleExecutor.executeGoals(DefaultLifecycleExecutor.java:579)
	at org.apache.maven.lifecycle.DefaultLifecycleExecutor.executeGoalWithLifecycle(DefaultLifecycleExecutor.java:499)
	at org.apache.maven.lifecycle.DefaultLifecycleExecutor.executeGoal(DefaultLifecycleExecutor.java:478)
	at org.apache.maven.lifecycle.DefaultLifecycleExecutor.executeGoalAndHandleFailures(DefaultLifecycleExecutor.java:330)
	at org.apache.maven.lifecycle.DefaultLifecycleExecutor.executeTaskSegments(DefaultLifecycleExecutor.java:291)
	at org.apache.maven.lifecycle.DefaultLifecycleExecutor.execute(DefaultLifecycleExecutor.java:142)
	at org.apache.maven.DefaultMaven.doExecute(DefaultMaven.java:336)
	at org.apache.maven.DefaultMaven.execute(DefaultMaven.java:129)
	at org.apache.maven.cli.MavenCli.main(MavenCli.java:287)
	at sun.reflect.NativeMethodAccessorImpl.invoke0(Native Method)
	at sun.reflect.NativeMethodAccessorImpl.invoke(NativeMethodAccessorImpl.java:39)
	at sun.reflect.DelegatingMethodAccessorImpl.invoke(DelegatingMethodAccessorImpl.java:25)
	at java.lang.reflect.Method.invoke(Method.java:585)
	at org.codehaus.classworlds.Launcher.launchEnhanced(Launcher.java:315)
	at org.codehaus.classworlds.Launcher.launch(Launcher.java:255)
	at org.codehaus.classworlds.Launcher.mainWithExitCode(Launcher.java:430)
	at org.codehaus.classworlds.Launcher.main(Launcher.java:375)
Caused by: org.apache.maven.plugin.MojoFailureException: There are test failures.
	at org.apache.maven.plugin.surefire.SurefirePlugin.execute(SurefirePlugin.java:425)
	at org.apache.maven.plugin.DefaultPluginManager.executeMojo(DefaultPluginManager.java:451)
	at org.apache.maven.lifecycle.DefaultLifecycleExecutor.executeGoals(DefaultLifecycleExecutor.java:558)
	... 16 more
[INFO] ------------------------------------------------------------------------
[INFO] Total time: 11 minutes 40 seconds
[INFO] Finished at: Tue May 13 11:16:26 CDT 2008
[INFO] Final Memory: 37M/372M
[INFO] ------------------------------------------------------------------------


Mime
View raw message