maven-notifications mailing list archives

Site index · List index
Message view « Date » · « Thread »
Top « Date » · « Thread »
From Hudson <Hud...@sonatype.org>
Subject Build failed in Hudson: Maven-2.1.x-ITs #95
Date Mon, 05 May 2008 00:17:26 GMT
See http://ci.sonatype.org/job/Maven-2.1.x-ITs/95/changes

------------------------------------------
[...truncated 821 lines...]
0107(testit0107).. Ok
0105(testit0105).. Ok
0104(testit0104).. Ok
0103(testit0103).. Ok
0102(testit0102).. Ok
0101(testit0101).. Ok
0100(testit0100).. Ok
0099(testit0099).. Ok
0098(testit0098).. Ok
0097(testit0097).. Ok
0096(testit0096).. Ok
0095(testit0095).. Ok
0094(testit0094).. Ok
0092(testit0092).. Skipping (version 2.1-SNAPSHOT not in range [,2.1-SNAPSHOT))
0090(testit0090).. Ok
0089(testit0089).. Ok
0088(testit0088).. Ok
0087(testit0087).. Ok
0086(testit0086).. Ok
0085(testit0085).. Ok
0084(testit0084).. Ok
0083(testit0083).. Ok
0082(testit0082).. Ok
0081(testit0081).. Ok
0080(testit0080).. Ok
0079(testit0079).. Ok
0078(testit0078).. Ok
0077(testit0077).. Ok
0076(testit0076).. Ok
0075(testit0075).. Ok
0074(testit0074).. Failure
0073(testit0073).. Ok
0072(testit0072).. Ok
0071(testit0071).. Ok
0070(testit0070).. Ok
0069(testit0069).. Ok
0068(testit0068).. Ok
0067(testit0067).. Ok
0066(testit0066).. Ok
0065(testit0065).. Ok
0064(testit0064).. Ok
0063(testit0063).. Ok
0062(testit0062).. Ok
0061(testit0061).. Ok
0060(testit0060).. Ok
0059(testit0059).. Ok
0058(testit0058).. Ok
0057(testit0057).. Ok
0056(testit0056).. Ok
0055(testit0055).. Ok
0054(testit0054).. Ok
0053(testit0053).. Ok
0052(testit0052).. Ok
0051(testit0051).. Skipping (version 2.1-SNAPSHOT not in range [,2.1-SNAPSHOT))
0050(testit0050).. Ok
0049(testit0049).. Ok
0048(testit0048).. Ok
0047(testit0047).. Ok
0046(testit0046).. Ok
0045(testit0045).. Ok
0044(testit0044).. Ok
0043(testit0043).. Ok
0042(testit0042).. Ok
0041(testit0041).. Ok
0040(testit0040).. Ok
0039(testit0039).. Ok
0038(testit0038).. Ok
0037(testit0037).. Ok
0036(testit0036).. Ok
0035(testit0035).. Ok
0034(testit0034).. Ok
0033(testit0033).. Ok
0032(testit0032).. Ok
0031(testit0031).. Skipping (version 2.1-SNAPSHOT not in range [,2.1-SNAPSHOT))
0030(testit0030).. Ok
0029(testit0029).. Ok
0028(testit0028).. Ok
0027(testit0027).. Ok
0026(testit0026).. Skipping (version 2.1-SNAPSHOT not in range [,2.1-SNAPSHOT))
0025(testit0025).. Ok
0024(testit0024).. Ok
0023(testit0023).. Ok
0022(testit0022).. Ok
0021(testit0021).. Ok
0019(testit0019).. Ok
0017(testit0017).. Ok
0016(testit0016).. Ok
0014(testit0014).. Ok
0013(testit0013).. Ok
0012(testit0012).. Ok
0011(testit0011).. Ok
0010(testit0010).. Ok
0009(testit0009).. Ok
0008(testit0008).. Ok
0007(testit0007).. Ok
0006(testit0006).. Ok
0005(testit0005).. Ok
0004(testit0004).. Ok
0003(testit0003).. Ok
0002(testit0002).. Ok
0001(testit0001).. Ok
0000(testit0000).. Ok
Tests run: 145, Failures: 0, Errors: 1, Skipped: 0, Time elapsed: 668.298 sec <<<
FAILURE!
testit0074(org.apache.maven.integrationtests.MavenIT0074Test)  Time elapsed: 4.354 sec  <<<
ERROR!
org.apache.maven.it.VerificationException: Exit code was non-zero: 100; log = 
+ Error stacktraces are turned on.
[WARNING] The <pluginRepositories/> section of the POM has been deprecated. Please update
the following profiles:
- development (source: settings.xml)
[INFO] Searching repository for plugin with prefix: 'clean'.
[INFO] Attempting to resolve a version for plugin: org.apache.maven.plugins:maven-eclipse-plugin
using meta-version: LATEST
[INFO] Using version: 2.5.2-20080422.072722-1 of plugin: org.apache.maven.plugins:maven-eclipse-plugin
[WARNING] Attempting to build MavenProject instance for Artifact (org.apache.maven.plugins:maven-eclipse-plugin:2.5.2-20080422.072722-1)
of type: maven-plugin; constructing POM artifact instead.
[INFO] Scanning for projects...
[WARNING] Attempting to build MavenProject instance for Artifact (org.apache.maven.plugins:maven-eclipse-plugin:2.5.2-20080422.072722-1)
of type: maven-plugin; constructing POM artifact instead.
[INFO] ------------------------------------------------------------------------
[INFO] Building Maven Integration Test :: it0074
[INFO] 
[INFO] Id: org.apache.maven.its.it0074:maven-it-it0074:jar:1.0
[INFO] task-segment: [clean:clean, eclipse:eclipse]
[INFO] ------------------------------------------------------------------------
[WARNING] Attempting to build MavenProject instance for Artifact (org.apache.maven.plugins:maven-eclipse-plugin:2.5.2-20080422.072722-1)
of type: maven-plugin; constructing POM artifact instead.
[WARNING] Attempting to build MavenProject instance for Artifact (org.apache.maven.plugins:maven-eclipse-plugin:2.5.2-20080422.072722-1)
of type: maven-plugin; constructing POM artifact instead.
[INFO] [clean:clean]
[INFO] [statemgmt:start-fork]
[INFO] Starting forked execution [fork id: -1234408523]
[INFO] [compiler:compile]
[INFO] Compiling 1 source file to http://ci.sonatype.org/job/Maven-2.1.x-ITs/ws/maven-core-its/target/it-working-folder/it0074/target/classes

[INFO] [statemgmt:end-fork]
[INFO] Ending forked execution [fork id: -1234408523]
[WARNING] Attempting to build MavenProject instance for Artifact (org.apache.maven.plugins:maven-eclipse-plugin:2.5.2-20080422.072722-1)
of type: maven-plugin; constructing POM artifact instead.
[INFO] [eclipse:eclipse]
[INFO] Using as WTP server : null
[INFO] Adding default classpath contaigner: org.eclipse.jdt.launching.JRE_CONTAINER
[INFO] Using source status cache: http://ci.sonatype.org/job/Maven-2.1.x-ITs/ws/maven-core-its/target/it-working-folder/it0074/target/mvn-eclipse-cache.properties

---------------------------------------------------
constituent[0]: http://ci.sonatype.org/job/Maven-2.1.x-ITs/ws/maven-core-its/target/maven-installation/apache-maven-2.1-SNAPSHOT/lib/plexus-container-default-1.0-alpha-46-20080419.145100-1.jar

constituent[1]: http://ci.sonatype.org/job/Maven-2.1.x-ITs/ws/maven-core-its/target/maven-installation/apache-maven-2.1-SNAPSHOT/lib/wagon-provider-api-1.0-beta-2.jar

constituent[2]: http://ci.sonatype.org/job/Maven-2.1.x-ITs/ws/maven-core-its/target/maven-installation/apache-maven-2.1-SNAPSHOT/lib/retrotranslator-runtime-1.2.1.jar

constituent[3]: http://ci.sonatype.org/job/Maven-2.1.x-ITs/ws/maven-core-its/target/maven-installation/apache-maven-2.1-SNAPSHOT/lib/commons-cli-1.0.jar

constituent[4]: http://ci.sonatype.org/job/Maven-2.1.x-ITs/ws/maven-core-its/target/maven-installation/apache-maven-2.1-SNAPSHOT/lib/wagon-ssh-1.0-beta-2.jar

constituent[5]: http://ci.sonatype.org/job/Maven-2.1.x-ITs/ws/maven-core-its/target/maven-installation/apache-maven-2.1-SNAPSHOT/lib/wagon-ssh-external-1.0-beta-2.jar

constituent[6]: http://ci.sonatype.org/job/Maven-2.1.x-ITs/ws/maven-core-its/target/maven-installation/apache-maven-2.1-SNAPSHOT/lib/maven-embedder-2.1-SNAPSHOT.jar

constituent[7]: http://ci.sonatype.org/job/Maven-2.1.x-ITs/ws/maven-core-its/target/maven-installation/apache-maven-2.1-SNAPSHOT/lib/wagon-http-shared-1.0-beta-2.jar

constituent[8]: http://ci.sonatype.org/job/Maven-2.1.x-ITs/ws/maven-core-its/target/maven-installation/apache-maven-2.1-SNAPSHOT/lib/plexus-utils-1.4.5.jar

constituent[9]: http://ci.sonatype.org/job/Maven-2.1.x-ITs/ws/maven-core-its/target/maven-installation/apache-maven-2.1-SNAPSHOT/lib/xbean-reflect-3.4-20080418.173627-4.jar

constituent[10]: http://ci.sonatype.org/job/Maven-2.1.x-ITs/ws/maven-core-its/target/maven-installation/apache-maven-2.1-SNAPSHOT/lib/commons-logging-api-1.1.jar

constituent[11]: http://ci.sonatype.org/job/Maven-2.1.x-ITs/ws/maven-core-its/target/maven-installation/apache-maven-2.1-SNAPSHOT/lib/maven-profile-2.1-SNAPSHOT.jar

constituent[12]: http://ci.sonatype.org/job/Maven-2.1.x-ITs/ws/maven-core-its/target/maven-installation/apache-maven-2.1-SNAPSHOT/lib/backport-util-concurrent-3.0.jar

constituent[13]: http://ci.sonatype.org/job/Maven-2.1.x-ITs/ws/maven-core-its/target/maven-installation/apache-maven-2.1-SNAPSHOT/lib/maven-core-2.1-SNAPSHOT.jar

constituent[14]: http://ci.sonatype.org/job/Maven-2.1.x-ITs/ws/maven-core-its/target/maven-installation/apache-maven-2.1-SNAPSHOT/lib/doxia-sink-api-1.0-alpha-9.jar

constituent[15]: http://ci.sonatype.org/job/Maven-2.1.x-ITs/ws/maven-core-its/target/maven-installation/apache-maven-2.1-SNAPSHOT/lib/aspectjrt-1.5.3.jar

constituent[16]: http://ci.sonatype.org/job/Maven-2.1.x-ITs/ws/maven-core-its/target/maven-installation/apache-maven-2.1-SNAPSHOT/lib/maven-model-2.1-SNAPSHOT.jar

constituent[17]: http://ci.sonatype.org/job/Maven-2.1.x-ITs/ws/maven-core-its/target/maven-installation/apache-maven-2.1-SNAPSHOT/lib/wagon-http-lightweight-1.0-beta-2.jar

constituent[18]: http://ci.sonatype.org/job/Maven-2.1.x-ITs/ws/maven-core-its/target/maven-installation/apache-maven-2.1-SNAPSHOT/lib/maven-project-2.1-SNAPSHOT.jar

constituent[19]: http://ci.sonatype.org/job/Maven-2.1.x-ITs/ws/maven-core-its/target/maven-installation/apache-maven-2.1-SNAPSHOT/lib/maven-lifecycle-2.1-SNAPSHOT.jar

constituent[20]: http://ci.sonatype.org/job/Maven-2.1.x-ITs/ws/maven-core-its/target/maven-installation/apache-maven-2.1-SNAPSHOT/lib/plexus-interactivity-api-1.0-alpha-6.jar

constituent[21]: http://ci.sonatype.org/job/Maven-2.1.x-ITs/ws/maven-core-its/target/maven-installation/apache-maven-2.1-SNAPSHOT/lib/maven-reporting-api-2.1-SNAPSHOT.jar

constituent[22]: http://ci.sonatype.org/job/Maven-2.1.x-ITs/ws/maven-core-its/target/maven-installation/apache-maven-2.1-SNAPSHOT/lib/jtidy-4aug2000r7-dev.jar

constituent[23]: http://ci.sonatype.org/job/Maven-2.1.x-ITs/ws/maven-core-its/target/maven-installation/apache-maven-2.1-SNAPSHOT/lib/maven-toolchain-2.1-SNAPSHOT.jar

constituent[24]: http://ci.sonatype.org/job/Maven-2.1.x-ITs/ws/maven-core-its/target/maven-installation/apache-maven-2.1-SNAPSHOT/lib/wagon-ssh-common-1.0-beta-2.jar

constituent[25]: http://ci.sonatype.org/job/Maven-2.1.x-ITs/ws/maven-core-its/target/maven-installation/apache-maven-2.1-SNAPSHOT/lib/plexus-interpolation-1.0-SNAPSHOT.jar

constituent[26]: http://ci.sonatype.org/job/Maven-2.1.x-ITs/ws/maven-core-its/target/maven-installation/apache-maven-2.1-SNAPSHOT/lib/maven-plugin-api-2.1-SNAPSHOT.jar

constituent[27]: http://ci.sonatype.org/job/Maven-2.1.x-ITs/ws/maven-core-its/target/maven-installation/apache-maven-2.1-SNAPSHOT/lib/log4j-1.2.12.jar

constituent[28]: http://ci.sonatype.org/job/Maven-2.1.x-ITs/ws/maven-core-its/target/maven-installation/apache-maven-2.1-SNAPSHOT/lib/maven-artifact-3.0-20080505.000330-80.jar

constituent[29]: http://ci.sonatype.org/job/Maven-2.1.x-ITs/ws/maven-core-its/target/maven-installation/apache-maven-2.1-SNAPSHOT/lib/maven-workspace-2.1-SNAPSHOT.jar

constituent[30]: http://ci.sonatype.org/job/Maven-2.1.x-ITs/ws/maven-core-its/target/maven-installation/apache-maven-2.1-SNAPSHOT/lib/wagon-file-1.0-beta-2.jar

constituent[31]: http://ci.sonatype.org/job/Maven-2.1.x-ITs/ws/maven-core-its/target/maven-installation/apache-maven-2.1-SNAPSHOT/lib/jsch-0.1.27.jar

---------------------------------------------------
java.lang.ClassCastException: org.codehaus.plexus.util.xml.Xpp3Dom
	at org.apache.maven.plugin.ide.IdeUtils.findCompilerPluginSettingInPlugins(IdeUtils.java:457)
	at org.apache.maven.plugin.ide.IdeUtils.getCompilerPluginSetting(IdeUtils.java:106)
	at org.apache.maven.plugin.ide.IdeUtils.getCompilerSourceVersion(IdeUtils.java:125)
	at org.apache.maven.plugin.eclipse.writers.EclipseSettingsWriter.write(EclipseSettingsWriter.java:64)
	at org.apache.maven.plugin.eclipse.EclipsePlugin.writeConfiguration(EclipsePlugin.java:948)
	at org.apache.maven.plugin.ide.AbstractIdeSupportMojo.execute(AbstractIdeSupportMojo.java:494)
	at org.apache.maven.plugin.DefaultPluginManager.executeMojo(DefaultPluginManager.java:577)
	at org.apache.maven.lifecycle.DefaultLifecycleExecutor.executeGoalAndHandleFailures(DefaultLifecycleExecutor.java:498)
	at org.apache.maven.lifecycle.DefaultLifecycleExecutor.executeTaskSegmentForProject(DefaultLifecycleExecutor.java:265)
	at org.apache.maven.lifecycle.DefaultLifecycleExecutor.executeTaskSegments(DefaultLifecycleExecutor.java:191)
	at org.apache.maven.lifecycle.DefaultLifecycleExecutor.execute(DefaultLifecycleExecutor.java:149)
	at org.apache.maven.DefaultMaven.execute_aroundBody0(DefaultMaven.java:223)
	at org.apache.maven.DefaultMaven.execute_aroundBody1$advice(DefaultMaven.java:304)
	at org.apache.maven.DefaultMaven.execute(DefaultMaven.java:1)
	at org.apache.maven.embedder.MavenEmbedder.execute_aroundBody2(MavenEmbedder.java:904)
	at org.apache.maven.embedder.MavenEmbedder.execute_aroundBody3$advice(MavenEmbedder.java:304)
	at org.apache.maven.embedder.MavenEmbedder.execute(MavenEmbedder.java:1)
	at org.apache.maven.cli.MavenCli.doMain(MavenCli.java:176)
	at org.apache.maven.cli.MavenCli.main(MavenCli.java:63)
	at sun.reflect.NativeMethodAccessorImpl.invoke0(Native Method)
	at sun.reflect.NativeMethodAccessorImpl.invoke(NativeMethodAccessorImpl.java:39)
	at sun.reflect.DelegatingMethodAccessorImpl.invoke(DelegatingMethodAccessorImpl.java:25)
	at java.lang.reflect.Method.invoke(Method.java:585)
	at org.codehaus.plexus.classworlds.launcher.Launcher.launchEnhanced(Launcher.java:289)
	at org.codehaus.plexus.classworlds.launcher.Launcher.launch(Launcher.java:229)
	at org.codehaus.plexus.classworlds.launcher.Launcher.mainWithExitCode(Launcher.java:408)
	at org.codehaus.plexus.classworlds.launcher.Launcher.main(Launcher.java:351)
	at org.apache.maven.it.Verifier.executeGoals(Verifier.java:1022)
	at org.apache.maven.it.Verifier.executeGoal(Verifier.java:877)
	at org.apache.maven.it.Verifier.executeGoal(Verifier.java:871)
	at org.apache.maven.integrationtests.MavenIT0074Test.testit0074(MavenIT0074Test.java:21)


Results :

Tests in error: 
  testit0074(org.apache.maven.integrationtests.MavenIT0074Test)

Tests run: 145, Failures: 0, Errors: 1, Skipped: 0

[INFO] ------------------------------------------------------------------------
[ERROR] BUILD FAILURE
[INFO] ------------------------------------------------------------------------
[INFO] There are test failures.

Please refer to http://ci.sonatype.org/job/Maven-2.1.x-ITs/ws/maven-core-its/target/surefire-reports
 for the individual test results.
[INFO] ------------------------------------------------------------------------
[INFO] Trace
org.apache.maven.BuildFailureException: There are test failures.

Please refer to http://ci.sonatype.org/job/Maven-2.1.x-ITs/ws/maven-core-its/target/surefire-reports
 for the individual test results.
	at org.apache.maven.lifecycle.DefaultLifecycleExecutor.executeGoals(DefaultLifecycleExecutor.java:560)
	at org.apache.maven.lifecycle.DefaultLifecycleExecutor.executeGoalWithLifecycle(DefaultLifecycleExecutor.java:480)
	at org.apache.maven.lifecycle.DefaultLifecycleExecutor.executeGoal(DefaultLifecycleExecutor.java:459)
	at org.apache.maven.lifecycle.DefaultLifecycleExecutor.executeGoalAndHandleFailures(DefaultLifecycleExecutor.java:311)
	at org.apache.maven.lifecycle.DefaultLifecycleExecutor.executeTaskSegments(DefaultLifecycleExecutor.java:278)
	at org.apache.maven.lifecycle.DefaultLifecycleExecutor.execute(DefaultLifecycleExecutor.java:143)
	at org.apache.maven.DefaultMaven.doExecute(DefaultMaven.java:333)
	at org.apache.maven.DefaultMaven.execute(DefaultMaven.java:126)
	at org.apache.maven.cli.MavenCli.main(MavenCli.java:282)
	at sun.reflect.NativeMethodAccessorImpl.invoke0(Native Method)
	at sun.reflect.NativeMethodAccessorImpl.invoke(NativeMethodAccessorImpl.java:39)
	at sun.reflect.DelegatingMethodAccessorImpl.invoke(DelegatingMethodAccessorImpl.java:25)
	at java.lang.reflect.Method.invoke(Method.java:585)
	at org.codehaus.classworlds.Launcher.launchEnhanced(Launcher.java:315)
	at org.codehaus.classworlds.Launcher.launch(Launcher.java:255)
	at org.codehaus.classworlds.Launcher.mainWithExitCode(Launcher.java:430)
	at org.codehaus.classworlds.Launcher.main(Launcher.java:375)
Caused by: org.apache.maven.plugin.MojoFailureException: There are test failures.

Please refer to http://ci.sonatype.org/job/Maven-2.1.x-ITs/ws/maven-core-its/target/surefire-reports
 for the individual test results.
	at org.apache.maven.plugin.surefire.SurefirePlugin.execute(SurefirePlugin.java:530)
	at org.apache.maven.plugin.DefaultPluginManager.executeMojo(DefaultPluginManager.java:447)
	at org.apache.maven.lifecycle.DefaultLifecycleExecutor.executeGoals(DefaultLifecycleExecutor.java:539)
	... 16 more
[INFO] ------------------------------------------------------------------------
[INFO] Total time: 11 minutes 26 seconds
[INFO] Finished at: Sun May 04 19:17:26 CDT 2008
[INFO] Final Memory: 33M/420M
[INFO] ------------------------------------------------------------------------


Mime
View raw message