maven-notifications mailing list archives

Site index · List index
Message view « Date » · « Thread »
Top « Date » · « Thread »
From Hudson <Hud...@sonatype.org>
Subject Build failed in Hudson: Maven-2.0.x-ITs #122
Date Tue, 13 May 2008 16:21:44 GMT
See http://ci.sonatype.org/job/Maven-2.0.x-ITs/122/changes

------------------------------------------
[...truncated 1099 lines...]
	at junit.framework.TestCase.runBare(TestCase.java:127)
	at junit.framework.TestResult$1.protect(TestResult.java:106)
	at junit.framework.TestResult.runProtected(TestResult.java:124)
	at junit.framework.TestResult.run(TestResult.java:109)
	at junit.framework.TestCase.run(TestCase.java:118)
	at junit.framework.TestSuite.runTest(TestSuite.java:208)
	at junit.framework.TestSuite.run(TestSuite.java:203)
	at junit.framework.TestSuite.runTest(TestSuite.java:208)
	at junit.framework.TestSuite.run(TestSuite.java:203)
	at sun.reflect.NativeMethodAccessorImpl.invoke0(Native Method)
	at sun.reflect.NativeMethodAccessorImpl.invoke(NativeMethodAccessorImpl.java:39)
	at sun.reflect.DelegatingMethodAccessorImpl.invoke(DelegatingMethodAccessorImpl.java:25)
	at java.lang.reflect.Method.invoke(Method.java:324)
	at org.apache.maven.surefire.junit.JUnitTestSet.execute(JUnitTestSet.java:213)
	at org.apache.maven.surefire.suite.AbstractDirectoryTestSuite.executeTestSet(AbstractDirectoryTestSuite.java:138)
	at org.apache.maven.surefire.suite.AbstractDirectoryTestSuite.execute(AbstractDirectoryTestSuite.java:125)
	at org.apache.maven.surefire.Surefire.run(Surefire.java:132)
	at sun.reflect.NativeMethodAccessorImpl.invoke0(Native Method)
	at sun.reflect.NativeMethodAccessorImpl.invoke(NativeMethodAccessorImpl.java:39)
	at sun.reflect.DelegatingMethodAccessorImpl.invoke(DelegatingMethodAccessorImpl.java:25)
	at java.lang.reflect.Method.invoke(Method.java:324)
	at org.apache.maven.surefire.booter.SurefireBooter.runSuitesInProcess(SurefireBooter.java:290)
	at org.apache.maven.surefire.booter.SurefireBooter.main(SurefireBooter.java:818)

testit0112(org.apache.maven.integrationtests.MavenIT0112ExtensionsThatDragDependencies)  Time
elapsed: 4.988 sec  <<< ERROR!
org.apache.maven.it.VerificationException: Exit code was non-zero: 1; log = 
+ Error stacktraces are turned on.
[INFO] Scanning for projects...
[INFO] Searching repository for plugin with prefix: 'clean'.
[INFO] ------------------------------------------------------------------------
[INFO] Building Test Wagon SCM
[INFO]    task-segment: [clean:clean, install]
[INFO] ------------------------------------------------------------------------
[INFO] [clean:clean]
[INFO] [resources:resources]
[INFO] Using default encoding to copy filtered resources.
Downloading: http://localhost:8081/nexus/content/groups/public/org/apache/maven/scm/maven-scm-api/1.0-beta-4/maven-scm-api-1.0-beta-4.pom
617b downloaded
Downloading: http://localhost:8081/nexus/content/groups/public/org/apache/maven/scm/maven-scm/1.0-beta-4/maven-scm-1.0-beta-4.pom
5K downloaded
Downloading: http://localhost:8081/nexus/content/groups/public/org/apache/maven/scm/maven-scm-manager-plexus/1.0-beta-4/maven-scm-manager-plexus-1.0-beta-4.pom
665b downloaded
Downloading: http://localhost:8081/nexus/content/groups/public/org/apache/maven/scm/maven-scm-managers/1.0-beta-4/maven-scm-managers-1.0-beta-4.pom
1K downloaded
Downloading: http://localhost:8081/nexus/content/groups/public/org/apache/maven/scm/maven-scm-test/1.0-beta-4/maven-scm-test-1.0-beta-4.pom
794b downloaded
Downloading: http://localhost:8081/nexus/content/groups/public/org/apache/maven/scm/maven-scm-provider-cvsexe/1.0-beta-4/maven-scm-provider-cvsexe-1.0-beta-4.pom
895b downloaded
Downloading: http://localhost:8081/nexus/content/groups/public/org/apache/maven/scm/maven-scm-providers-cvs/1.0-beta-4/maven-scm-providers-cvs-1.0-beta-4.pom
1K downloaded
Downloading: http://localhost:8081/nexus/content/groups/public/org/apache/maven/scm/maven-scm-providers/1.0-beta-4/maven-scm-providers-1.0-beta-4.pom
2K downloaded
Downloading: http://localhost:8081/nexus/content/groups/public/org/apache/maven/scm/maven-scm-provider-cvs-commons/1.0-beta-4/maven-scm-provider-cvs-commons-1.0-beta-4.pom
1K downloaded
Downloading: http://localhost:8081/nexus/content/groups/public/org/apache/maven/scm/maven-scm-provider-svnexe/1.0-beta-4/maven-scm-provider-svnexe-1.0-beta-4.pom
1K downloaded
Downloading: http://localhost:8081/nexus/content/groups/public/org/apache/maven/scm/maven-scm-providers-svn/1.0-beta-4/maven-scm-providers-svn-1.0-beta-4.pom
1K downloaded
Downloading: http://localhost:8081/nexus/content/groups/public/org/apache/maven/scm/maven-scm-provider-svn-commons/1.0-beta-4/maven-scm-provider-svn-commons-1.0-beta-4.pom
1K downloaded
Downloading: http://localhost:8081/nexus/content/groups/public/org/apache/maven/scm/maven-scm-api/1.0-beta-4/maven-scm-api-1.0-beta-4.jar
71K downloaded
[INFO] [compiler:compile]
[INFO] Compiling 1 source file to http://ci.sonatype.org/job/Maven-2.0.x-ITs/ws/maven-core-its/target/it-working-folder/it0112-extensionsThatDragDependencies/test-extension/target/classes

[INFO] [resources:testResources]
[INFO] Using default encoding to copy filtered resources.
Downloading: http://localhost:8081/nexus/content/groups/public/org/apache/maven/scm/maven-scm-manager-plexus/1.0-beta-4/maven-scm-manager-plexus-1.0-beta-4.jar
9K downloaded
Downloading: http://localhost:8081/nexus/content/groups/public/org/apache/maven/scm/maven-scm-test/1.0-beta-4/maven-scm-test-1.0-beta-4.jar
34K downloaded
Downloading: http://localhost:8081/nexus/content/groups/public/org/apache/maven/scm/maven-scm-provider-cvsexe/1.0-beta-4/maven-scm-provider-cvsexe-1.0-beta-4.jar
29K downloaded
Downloading: http://localhost:8081/nexus/content/groups/public/org/apache/maven/scm/maven-scm-provider-cvs-commons/1.0-beta-4/maven-scm-provider-cvs-commons-1.0-beta-4.jar
50K downloaded
Downloading: http://localhost:8081/nexus/content/groups/public/org/apache/maven/scm/maven-scm-provider-svnexe/1.0-beta-4/maven-scm-provider-svnexe-1.0-beta-4.jar
49K downloaded
Downloading: http://localhost:8081/nexus/content/groups/public/org/apache/maven/scm/maven-scm-provider-svn-commons/1.0-beta-4/maven-scm-provider-svn-commons-1.0-beta-4.jar
32K downloaded
[WARNING] *** CHECKSUM FAILED - Invalid checksum file - RETRYING
Downloading: http://localhost:8081/nexus/content/groups/public/org/apache/maven/scm/maven-scm-provider-svn-commons/1.0-beta-4/maven-scm-provider-svn-commons-1.0-beta-4.jar
32K downloaded
[WARNING] *** CHECKSUM FAILED - Invalid checksum file - IGNORING
[INFO] ------------------------------------------------------------------------
[ERROR] BUILD ERROR
[INFO] ------------------------------------------------------------------------
[INFO] Failed to resolve artifact.
Missing:
----------
1) org.apache.maven.scm:maven-scm-provider-svn-commons:jar:1.0-beta-4
  Try downloading the file manually from the project website.
  Then, install it using the command: 
      mvn install:install-file -DgroupId=org.apache.maven.scm -DartifactId=maven-scm-provider-svn-commons
-Dversion=1.0-beta-4 -Dpackaging=jar -Dfile=/path/to/file
  Alternatively, if you host your own repository you can deploy the file there: 
      mvn deploy:deploy-file -DgroupId=org.apache.maven.scm -DartifactId=maven-scm-provider-svn-commons
-Dversion=1.0-beta-4 -Dpackaging=jar -Dfile=/path/to/file -Durl=[url] -DrepositoryId=[id]
  Path to dependency: 
  	1) org.apache.maven.its.it0112:test-extension:jar:1.0-SNAPSHOT
  	2) org.apache.maven.scm:maven-scm-provider-svnexe:jar:1.0-beta-4
  	3) org.apache.maven.scm:maven-scm-provider-svn-commons:jar:1.0-beta-4
----------
1 required artifact is missing.
for artifact: 
  org.apache.maven.its.it0112:test-extension:jar:1.0-SNAPSHOT
from the specified remote repositories:
  Nexus (http://localhost:8081/nexus/content/groups/public)
[INFO] ------------------------------------------------------------------------
[INFO] Trace
org.apache.maven.lifecycle.LifecycleExecutionException: Missing:
----------
1) org.apache.maven.scm:maven-scm-provider-svn-commons:jar:1.0-beta-4
  Try downloading the file manually from the project website.
  Then, install it using the command: 
      mvn install:install-file -DgroupId=org.apache.maven.scm -DartifactId=maven-scm-provider-svn-commons
-Dversion=1.0-beta-4 -Dpackaging=jar -Dfile=/path/to/file
  Alternatively, if you host your own repository you can deploy the file there: 
      mvn deploy:deploy-file -DgroupId=org.apache.maven.scm -DartifactId=maven-scm-provider-svn-commons
-Dversion=1.0-beta-4 -Dpackaging=jar -Dfile=/path/to/file -Durl=[url] -DrepositoryId=[id]
  Path to dependency: 
  	1) org.apache.maven.its.it0112:test-extension:jar:1.0-SNAPSHOT
  	2) org.apache.maven.scm:maven-scm-provider-svnexe:jar:1.0-beta-4
  	3) org.apache.maven.scm:maven-scm-provider-svn-commons:jar:1.0-beta-4
----------
1 required artifact is missing.
for artifact: 
  org.apache.maven.its.it0112:test-extension:jar:1.0-SNAPSHOT
from the specified remote repositories:
  Nexus (http://localhost:8081/nexus/content/groups/public)
	at org.apache.maven.lifecycle.DefaultLifecycleExecutor.executeGoals(DefaultLifecycleExecutor.java:575)
	at org.apache.maven.lifecycle.DefaultLifecycleExecutor.executeGoalWithLifecycle(DefaultLifecycleExecutor.java:499)
	at org.apache.maven.lifecycle.DefaultLifecycleExecutor.executeGoal(DefaultLifecycleExecutor.java:478)
	at org.apache.maven.lifecycle.DefaultLifecycleExecutor.executeGoalAndHandleFailures(DefaultLifecycleExecutor.java:330)
	at org.apache.maven.lifecycle.DefaultLifecycleExecutor.executeTaskSegments(DefaultLifecycleExecutor.java:291)
	at org.apache.maven.lifecycle.DefaultLifecycleExecutor.execute(DefaultLifecycleExecutor.java:142)
	at org.apache.maven.DefaultMaven.doExecute(DefaultMaven.java:336)
	at org.apache.maven.DefaultMaven.execute(DefaultMaven.java:129)
	at org.apache.maven.cli.MavenCli.main(MavenCli.java:303)
	at sun.reflect.NativeMethodAccessorImpl.invoke0(Native Method)
	at sun.reflect.NativeMethodAccessorImpl.invoke(NativeMethodAccessorImpl.java:39)
	at sun.reflect.DelegatingMethodAccessorImpl.invoke(DelegatingMethodAccessorImpl.java:25)
	at java.lang.reflect.Method.invoke(Method.java:324)
	at org.codehaus.classworlds.Launcher.launchEnhanced(Launcher.java:315)
	at org.codehaus.classworlds.Launcher.launch(Launcher.java:255)
	at org.codehaus.classworlds.Launcher.mainWithExitCode(Launcher.java:430)
	at org.codehaus.classworlds.Launcher.main(Launcher.java:375)
Caused by: org.apache.maven.artifact.resolver.MultipleArtifactsNotFoundException: Missing:
----------
1) org.apache.maven.scm:maven-scm-provider-svn-commons:jar:1.0-beta-4
  Try downloading the file manually from the project website.
  Then, install it using the command: 
      mvn install:install-file -DgroupId=org.apache.maven.scm -DartifactId=maven-scm-provider-svn-commons
-Dversion=1.0-beta-4 -Dpackaging=jar -Dfile=/path/to/file
  Alternatively, if you host your own repository you can deploy the file there: 
      mvn deploy:deploy-file -DgroupId=org.apache.maven.scm -DartifactId=maven-scm-provider-svn-commons
-Dversion=1.0-beta-4 -Dpackaging=jar -Dfile=/path/to/file -Durl=[url] -DrepositoryId=[id]
  Path to dependency: 
  	1) org.apache.maven.its.it0112:test-extension:jar:1.0-SNAPSHOT
  	2) org.apache.maven.scm:maven-scm-provider-svnexe:jar:1.0-beta-4
  	3) org.apache.maven.scm:maven-scm-provider-svn-commons:jar:1.0-beta-4
----------
1 required artifact is missing.
for artifact: 
  org.apache.maven.its.it0112:test-extension:jar:1.0-SNAPSHOT
from the specified remote repositories:
  Nexus (http://localhost:8081/nexus/content/groups/public)
	at org.apache.maven.artifact.resolver.DefaultArtifactResolver.resolveTransitively(DefaultArtifactResolver.java:324)
	at org.apache.maven.artifact.resolver.DefaultArtifactResolver.resolveTransitively(DefaultArtifactResolver.java:288)
	at org.apache.maven.plugin.DefaultPluginManager.resolveTransitiveDependencies(DefaultPluginManager.java:1415)
	at org.apache.maven.plugin.DefaultPluginManager.executeMojo(DefaultPluginManager.java:405)
	at org.apache.maven.lifecycle.DefaultLifecycleExecutor.executeGoals(DefaultLifecycleExecutor.java:558)
	... 16 more
[INFO] ------------------------------------------------------------------------
[INFO] Total time: 4 seconds
[INFO] Finished at: Tue May 13 11:11:30 CDT 2008
[INFO] Final Memory: 6M/11M
[INFO] ------------------------------------------------------------------------
	at org.apache.maven.it.Verifier.executeGoals(Verifier.java:1039)
	at org.apache.maven.it.Verifier.executeGoal(Verifier.java:894)
	at org.apache.maven.it.Verifier.executeGoal(Verifier.java:888)
	at org.apache.maven.integrationtests.MavenIT0112ExtensionsThatDragDependencies.testit0112(MavenIT0112ExtensionsThatDragDependencies.java:44)
	at org.apache.maven.integrationtests.MavenIT0112ExtensionsThatDragDependencies.testit0112(MavenIT0112ExtensionsThatDragDependencies.java:44)
	at sun.reflect.NativeMethodAccessorImpl.invoke0(Native Method)
	at sun.reflect.NativeMethodAccessorImpl.invoke(NativeMethodAccessorImpl.java:39)
	at sun.reflect.DelegatingMethodAccessorImpl.invoke(DelegatingMethodAccessorImpl.java:25)
	at java.lang.reflect.Method.invoke(Method.java:324)
	at junit.framework.TestCase.runTest(TestCase.java:154)
	at org.apache.maven.integrationtests.AbstractMavenIntegrationTestCase.runTest(AbstractMavenIntegrationTestCase.java:100)
	at junit.framework.TestCase.runBare(TestCase.java:127)
	at junit.framework.TestResult$1.protect(TestResult.java:106)
	at junit.framework.TestResult.runProtected(TestResult.java:124)
	at junit.framework.TestResult.run(TestResult.java:109)
	at junit.framework.TestCase.run(TestCase.java:118)
	at junit.framework.TestSuite.runTest(TestSuite.java:208)
	at junit.framework.TestSuite.run(TestSuite.java:203)
	at junit.framework.TestSuite.runTest(TestSuite.java:208)
	at junit.framework.TestSuite.run(TestSuite.java:203)
	at sun.reflect.NativeMethodAccessorImpl.invoke0(Native Method)
	at sun.reflect.NativeMethodAccessorImpl.invoke(NativeMethodAccessorImpl.java:39)
	at sun.reflect.DelegatingMethodAccessorImpl.invoke(DelegatingMethodAccessorImpl.java:25)
	at java.lang.reflect.Method.invoke(Method.java:324)
	at org.apache.maven.surefire.junit.JUnitTestSet.execute(JUnitTestSet.java:213)
	at org.apache.maven.surefire.suite.AbstractDirectoryTestSuite.executeTestSet(AbstractDirectoryTestSuite.java:138)
	at org.apache.maven.surefire.suite.AbstractDirectoryTestSuite.execute(AbstractDirectoryTestSuite.java:125)
	at org.apache.maven.surefire.Surefire.run(Surefire.java:132)
	at sun.reflect.NativeMethodAccessorImpl.invoke0(Native Method)
	at sun.reflect.NativeMethodAccessorImpl.invoke(NativeMethodAccessorImpl.java:39)
	at sun.reflect.DelegatingMethodAccessorImpl.invoke(DelegatingMethodAccessorImpl.java:25)
	at java.lang.reflect.Method.invoke(Method.java:324)
	at org.apache.maven.surefire.booter.SurefireBooter.runSuitesInProcess(SurefireBooter.java:290)
	at org.apache.maven.surefire.booter.SurefireBooter.main(SurefireBooter.java:818)


Results :

Tests in error: 
  testitMNG3355(org.apache.maven.integrationtests.MavenITmng3355TranslatedPathInterpolationTest)
  testitMNG2339a(org.apache.maven.integrationtests.MavenITmng2339BadProjectInterpolationTest)
  testit0112(org.apache.maven.integrationtests.MavenIT0112ExtensionsThatDragDependencies)

Tests run: 145, Failures: 0, Errors: 3, Skipped: 0

[INFO] ------------------------------------------------------------------------
[ERROR] BUILD FAILURE
[INFO] ------------------------------------------------------------------------
[INFO] There are test failures.
[INFO] ------------------------------------------------------------------------
[INFO] Trace
org.apache.maven.BuildFailureException: There are test failures.
	at org.apache.maven.lifecycle.DefaultLifecycleExecutor.executeGoals(DefaultLifecycleExecutor.java:579)
	at org.apache.maven.lifecycle.DefaultLifecycleExecutor.executeGoalWithLifecycle(DefaultLifecycleExecutor.java:499)
	at org.apache.maven.lifecycle.DefaultLifecycleExecutor.executeGoal(DefaultLifecycleExecutor.java:478)
	at org.apache.maven.lifecycle.DefaultLifecycleExecutor.executeGoalAndHandleFailures(DefaultLifecycleExecutor.java:330)
	at org.apache.maven.lifecycle.DefaultLifecycleExecutor.executeTaskSegments(DefaultLifecycleExecutor.java:291)
	at org.apache.maven.lifecycle.DefaultLifecycleExecutor.execute(DefaultLifecycleExecutor.java:142)
	at org.apache.maven.DefaultMaven.doExecute(DefaultMaven.java:336)
	at org.apache.maven.DefaultMaven.execute(DefaultMaven.java:129)
	at org.apache.maven.cli.MavenCli.main(MavenCli.java:287)
	at sun.reflect.NativeMethodAccessorImpl.invoke0(Native Method)
	at sun.reflect.NativeMethodAccessorImpl.invoke(NativeMethodAccessorImpl.java:39)
	at sun.reflect.DelegatingMethodAccessorImpl.invoke(DelegatingMethodAccessorImpl.java:25)
	at java.lang.reflect.Method.invoke(Method.java:324)
	at org.codehaus.classworlds.Launcher.launchEnhanced(Launcher.java:315)
	at org.codehaus.classworlds.Launcher.launch(Launcher.java:255)
	at org.codehaus.classworlds.Launcher.mainWithExitCode(Launcher.java:430)
	at org.codehaus.classworlds.Launcher.main(Launcher.java:375)
Caused by: org.apache.maven.plugin.MojoFailureException: There are test failures.
	at org.apache.maven.plugin.surefire.SurefirePlugin.execute(SurefirePlugin.java:425)
	at org.apache.maven.plugin.DefaultPluginManager.executeMojo(DefaultPluginManager.java:451)
	at org.apache.maven.lifecycle.DefaultLifecycleExecutor.executeGoals(DefaultLifecycleExecutor.java:558)
	... 16 more
[INFO] ------------------------------------------------------------------------
[INFO] Total time: 18 minutes 6 seconds
[INFO] Finished at: Tue May 13 11:21:44 CDT 2008
[INFO] Final Memory: 18M/41M
[INFO] ------------------------------------------------------------------------


Mime
View raw message