maven-notifications mailing list archives

Site index · List index
Message view « Date » · « Thread »
Top « Date » · « Thread »
From Hudson <Hud...@sonatype.org>
Subject Build failed in Hudson: Maven-2.1.x #173
Date Sun, 29 Jun 2008 14:17:19 GMT
See http://ci.sonatype.org/job/Maven-2.1.x/173/changes

Changes:

[vsiveton] o merged r672624 (replaced logical tag to be more consistent)

[vsiveton] o merged r672622 (removed unnecessary CDATA in description tags)

------------------------------------------
[...truncated 816 lines...]
[INFO] outputDirectory: http://ci.sonatype.org/job/Maven-2.1.x/ws/maven-2.1.x/maven-model/target/generated-sources/modello

[INFO] Working on model: src/main/mdo/maven.mdo
[INFO] Generating current version: 4.0.0
[WARNING] DEPRECATED [model]: Use models instead
[INFO] [modello:xpp3-reader {execution: standard}]
[INFO] outputDirectory: http://ci.sonatype.org/job/Maven-2.1.x/ws/maven-2.1.x/maven-model/target/generated-sources/modello

[INFO] Working on model: src/main/mdo/maven.mdo
[INFO] Generating current version: 4.0.0
[WARNING] DEPRECATED [model]: Use models instead
[INFO] [modello:xpp3-writer {execution: standard}]
[INFO] outputDirectory: http://ci.sonatype.org/job/Maven-2.1.x/ws/maven-2.1.x/maven-model/target/generated-sources/modello

[INFO] Working on model: src/main/mdo/maven.mdo
[INFO] Generating current version: 4.0.0
[INFO] [remote-resources:process {execution: default}]
[INFO] [resources:resources]
[INFO] Using default encoding to copy filtered resources.
[INFO] [compiler:compile]
[INFO] Compiling 46 source files to http://ci.sonatype.org/job/Maven-2.1.x/ws/maven-2.1.x/maven-model/target/classes

[INFO] [resources:testResources]
[INFO] Using default encoding to copy filtered resources.
[INFO] [compiler:testCompile]
[INFO] No sources to compile
[INFO] [surefire:test]
[INFO] Surefire report directory: http://ci.sonatype.org/job/Maven-2.1.x/ws/maven-2.1.x/maven-model/target/surefire-reports


-------------------------------------------------------
 T E S T S
-------------------------------------------------------
There are no tests to run.

Results :

Tests run: 0, Failures: 0, Errors: 0, Skipped: 0

[INFO] [jar:jar]
[INFO] Building jar: http://ci.sonatype.org/job/Maven-2.1.x/ws/maven-2.1.x/maven-model/target/maven-model-2.1-SNAPSHOT.jar

[INFO] [install:install]
[INFO] Installing http://ci.sonatype.org/job/Maven-2.1.x/ws/maven-2.1.x/maven-model/target/maven-model-2.1-SNAPSHOT.jar
 to /home/j2ee-hudson/repos/Maven-2.1.x/org/apache/maven/maven-model/2.1-SNAPSHOT/maven-model-2.1-SNAPSHOT.jar
[INFO] [deploy:deploy]
altDeploymentRepository = null
[INFO] Retrieving previous build number from apache.snapshots
Uploading: http://localhost:8081/nexus/content/repositories/maven.snapshots/org/apache/maven/maven-model/2.1-SNAPSHOT/maven-model-2.1-20080629.141702-192.jar
90K uploaded
[INFO] Retrieving previous metadata from apache.snapshots
[INFO] Uploading repository metadata for: 'artifact org.apache.maven:maven-model'
[INFO] Retrieving previous metadata from apache.snapshots
[INFO] Uploading repository metadata for: 'snapshot org.apache.maven:maven-model:2.1-SNAPSHOT'
[INFO] Uploading project information for maven-model 2.1-20080629.141702-192
[INFO] ------------------------------------------------------------------------
[INFO] Building Maven Profile Model
[INFO]    task-segment: [clean, deploy]
[INFO] ------------------------------------------------------------------------
[INFO] [clean:clean]
[INFO] Deleting directory http://ci.sonatype.org/job/Maven-2.1.x/ws/maven-2.1.x/maven-profile/target

[INFO] [enforcer:enforce {execution: enforce-jdk-15}]
[WARNING] DEPRECATED [model]: Use models instead
[INFO] [modello:java {execution: standard}]
[INFO] outputDirectory: http://ci.sonatype.org/job/Maven-2.1.x/ws/maven-2.1.x/maven-profile/target/generated-sources/modello

[INFO] Working on model: src/main/mdo/profiles.mdo
[INFO] Generating current version: 1.0.0
[WARNING] DEPRECATED [model]: Use models instead
[INFO] [modello:xpp3-reader {execution: standard}]
[INFO] outputDirectory: http://ci.sonatype.org/job/Maven-2.1.x/ws/maven-2.1.x/maven-profile/target/generated-sources/modello

[INFO] Working on model: src/main/mdo/profiles.mdo
[INFO] Generating current version: 1.0.0
[WARNING] DEPRECATED [model]: Use models instead
[INFO] [modello:xpp3-writer {execution: standard}]
[INFO] outputDirectory: http://ci.sonatype.org/job/Maven-2.1.x/ws/maven-2.1.x/maven-profile/target/generated-sources/modello

[INFO] Working on model: src/main/mdo/profiles.mdo
[INFO] Generating current version: 1.0.0
[INFO] [remote-resources:process {execution: default}]
[INFO] [resources:resources]
[INFO] Using default encoding to copy filtered resources.
[INFO] [compiler:compile]
[INFO] Compiling 15 source files to http://ci.sonatype.org/job/Maven-2.1.x/ws/maven-2.1.x/maven-profile/target/classes

[INFO] [resources:testResources]
[INFO] Using default encoding to copy filtered resources.
[INFO] [compiler:testCompile]
[INFO] No sources to compile
[INFO] [surefire:test]
[INFO] Surefire report directory: http://ci.sonatype.org/job/Maven-2.1.x/ws/maven-2.1.x/maven-profile/target/surefire-reports


-------------------------------------------------------
 T E S T S
-------------------------------------------------------
There are no tests to run.

Results :

Tests run: 0, Failures: 0, Errors: 0, Skipped: 0

[INFO] [jar:jar]
[INFO] Building jar: http://ci.sonatype.org/job/Maven-2.1.x/ws/maven-2.1.x/maven-profile/target/maven-profile-2.1-SNAPSHOT.jar

[INFO] [install:install]
[INFO] Installing http://ci.sonatype.org/job/Maven-2.1.x/ws/maven-2.1.x/maven-profile/target/maven-profile-2.1-SNAPSHOT.jar
 to /home/j2ee-hudson/repos/Maven-2.1.x/org/apache/maven/maven-profile/2.1-SNAPSHOT/maven-profile-2.1-SNAPSHOT.jar
[INFO] [deploy:deploy]
altDeploymentRepository = null
[INFO] Retrieving previous build number from apache.snapshots
Uploading: http://localhost:8081/nexus/content/repositories/maven.snapshots/org/apache/maven/maven-profile/2.1-SNAPSHOT/maven-profile-2.1-20080629.141702-189.jar
34K uploaded
[INFO] Retrieving previous metadata from apache.snapshots
[INFO] Uploading repository metadata for: 'snapshot org.apache.maven:maven-profile:2.1-SNAPSHOT'
[INFO] Uploading project information for maven-profile 2.1-20080629.141702-189
[INFO] Retrieving previous metadata from apache.snapshots
[INFO] Uploading repository metadata for: 'artifact org.apache.maven:maven-profile'
[INFO] ------------------------------------------------------------------------
[INFO] Building Maven Plugin API
[INFO]    task-segment: [clean, deploy]
[INFO] ------------------------------------------------------------------------
[INFO] [clean:clean]
[INFO] Deleting directory http://ci.sonatype.org/job/Maven-2.1.x/ws/maven-2.1.x/maven-plugin-api/target

[INFO] snapshot org.apache.maven.artifact:maven-artifact:3.0-SNAPSHOT: checking for updates
from central
[INFO] snapshot org.apache.maven.artifact:maven-artifact:3.0-SNAPSHOT: checking for updates
from codehaus.snapshots
[INFO] snapshot org.apache.maven.artifact:maven-artifact:3.0-SNAPSHOT: checking for updates
from apache.snapshots
Downloading: http://localhost:8081/nexus/content/groups/public/org/apache/maven/artifact/maven-artifact/3.0-SNAPSHOT/maven-artifact-3.0-20080627.174652-98.pom
5K downloaded
Downloading: http://localhost:8081/nexus/content/groups/public/org/apache/maven/wagon/wagon-provider-api/1.0-beta-3/wagon-provider-api-1.0-beta-3.pom
906b downloaded
Downloading: http://localhost:8081/nexus/content/groups/public/org/apache/maven/wagon/wagon/1.0-beta-3/wagon-1.0-beta-3.pom
8K downloaded
Downloading: http://localhost:8081/nexus/content/groups/public/org/apache/maven/artifact/maven-artifact/3.0-SNAPSHOT/maven-artifact-3.0-20080627.174652-98.jar
211K downloaded
Downloading: http://localhost:8081/nexus/content/groups/public/org/apache/maven/wagon/wagon-provider-api/1.0-beta-3/wagon-provider-api-1.0-beta-3.jar
50K downloaded
[INFO] [enforcer:enforce {execution: enforce-jdk-15}]
[WARNING] DEPRECATED [model]: Use models instead
[INFO] [modello:java {execution: standard}]
[INFO] outputDirectory: http://ci.sonatype.org/job/Maven-2.1.x/ws/maven-2.1.x/maven-plugin-api/target/generated-sources/modello

[INFO] Working on model: src/main/mdo/lifecycle.mdo
[INFO] Generating current version: 1.0.0
[WARNING] DEPRECATED [model]: Use models instead
[INFO] [modello:xpp3-reader {execution: standard}]
[INFO] outputDirectory: http://ci.sonatype.org/job/Maven-2.1.x/ws/maven-2.1.x/maven-plugin-api/target/generated-sources/modello

[INFO] Working on model: src/main/mdo/lifecycle.mdo
[INFO] Generating current version: 1.0.0
[WARNING] DEPRECATED [model]: Use models instead
[INFO] [modello:xpp3-writer {execution: standard}]
[INFO] outputDirectory: http://ci.sonatype.org/job/Maven-2.1.x/ws/maven-2.1.x/maven-plugin-api/target/generated-sources/modello

[INFO] Working on model: src/main/mdo/lifecycle.mdo
[INFO] Generating current version: 1.0.0
[INFO] [remote-resources:process {execution: default}]
[INFO] [resources:resources]
[INFO] Using default encoding to copy filtered resources.
[INFO] [compiler:compile]
[INFO] Compiling 23 source files to http://ci.sonatype.org/job/Maven-2.1.x/ws/maven-2.1.x/maven-plugin-api/target/classes

[INFO] [resources:testResources]
[INFO] Using default encoding to copy filtered resources.
[INFO] [compiler:testCompile]
[INFO] Compiling 1 source file to http://ci.sonatype.org/job/Maven-2.1.x/ws/maven-2.1.x/maven-plugin-api/target/test-classes

[INFO] [surefire:test]
[INFO] Surefire report directory: http://ci.sonatype.org/job/Maven-2.1.x/ws/maven-2.1.x/maven-plugin-api/target/surefire-reports


-------------------------------------------------------
 T E S T S
-------------------------------------------------------
Running org.apache.maven.plugin.lifecycle.LifecycleXpp3ReaderTest
Tests run: 1, Failures: 0, Errors: 0, Skipped: 0, Time elapsed: 0.066 sec

Results :

Tests run: 1, Failures: 0, Errors: 0, Skipped: 0

[INFO] [jar:jar]
[INFO] Building jar: http://ci.sonatype.org/job/Maven-2.1.x/ws/maven-2.1.x/maven-plugin-api/target/maven-plugin-api-2.1-SNAPSHOT.jar

[INFO] [install:install]
[INFO] Installing http://ci.sonatype.org/job/Maven-2.1.x/ws/maven-2.1.x/maven-plugin-api/target/maven-plugin-api-2.1-SNAPSHOT.jar
 to /home/j2ee-hudson/repos/Maven-2.1.x/org/apache/maven/maven-plugin-api/2.1-SNAPSHOT/maven-plugin-api-2.1-SNAPSHOT.jar
[INFO] [deploy:deploy]
altDeploymentRepository = null
[INFO] Retrieving previous build number from apache.snapshots
Uploading: http://localhost:8081/nexus/content/repositories/maven.snapshots/org/apache/maven/maven-plugin-api/2.1-SNAPSHOT/maven-plugin-api-2.1-20080629.141702-186.jar
42K uploaded
[INFO] Retrieving previous metadata from apache.snapshots
[INFO] Uploading repository metadata for: 'artifact org.apache.maven:maven-plugin-api'
[INFO] Retrieving previous metadata from apache.snapshots
[INFO] Uploading repository metadata for: 'snapshot org.apache.maven:maven-plugin-api:2.1-SNAPSHOT'
[INFO] Uploading project information for maven-plugin-api 2.1-20080629.141702-186
[INFO] ------------------------------------------------------------------------
[INFO] Building Maven Project Builder
[INFO]    task-segment: [clean, deploy]
[INFO] ------------------------------------------------------------------------
Downloading: http://localhost:8081/nexus/content/groups/public/org/codehaus/mojo/aspectj-maven-plugin/1.0-beta-2/aspectj-maven-plugin-1.0-beta-2.pom
4K downloaded
Downloading: http://localhost:8081/nexus/content/groups/public/org/codehaus/mojo/mojo/12/mojo-12.pom
7K downloaded
Downloading: http://localhost:8081/nexus/content/groups/public/org/codehaus/mojo/aspectj-maven-plugin/1.0-beta-2/aspectj-maven-plugin-1.0-beta-2.jar
26K downloaded
[INFO] [clean:clean]
[INFO] Deleting directory http://ci.sonatype.org/job/Maven-2.1.x/ws/maven-2.1.x/maven-project/target

Downloading: http://localhost:8081/nexus/content/groups/public/org/codehaus/plexus/plexus-interpolation/1.0/plexus-interpolation-1.0.pom
1K downloaded
Downloading: http://localhost:8081/nexus/content/groups/public/org/apache/maven/wagon/wagon-file/1.0-beta-3/wagon-file-1.0-beta-3.pom
575b downloaded
Downloading: http://localhost:8081/nexus/content/groups/public/org/apache/maven/wagon/wagon-providers/1.0-beta-3/wagon-providers-1.0-beta-3.pom
1K downloaded
Downloading: http://localhost:8081/nexus/content/groups/public/org/codehaus/plexus/plexus-interpolation/1.0/plexus-interpolation-1.0.jar
33K downloaded
Downloading: http://localhost:8081/nexus/content/groups/public/org/apache/maven/wagon/wagon-file/1.0-beta-3/wagon-file-1.0-beta-3.jar
9K downloaded
[INFO] [enforcer:enforce {execution: enforce-jdk-15}]
[INFO] [remote-resources:process {execution: default}]
[INFO] [resources:resources]
[INFO] Using default encoding to copy filtered resources.
[INFO] [compiler:compile]
[INFO] Compiling 74 source files to http://ci.sonatype.org/job/Maven-2.1.x/ws/maven-2.1.x/maven-project/target/classes

[INFO] ------------------------------------------------------------------------
[ERROR] BUILD FAILURE
[INFO] ------------------------------------------------------------------------
[INFO] Compilation failure

http://ci.sonatype.org/job/Maven-2.1.x/ws/maven-2.1.x/maven-project/src/main/java/org/apache/maven/profiles/injection/DefaultProfileInjector.java
:[362,50] cannot find symbol
symbol  : method getDistributionManagement()
location: class org.apache.maven.model.Profile

http://ci.sonatype.org/job/Maven-2.1.x/ws/maven-2.1.x/maven-project/src/main/java/org/apache/maven/project/ModelUtils.java
:[619,16] cannot find symbol
symbol  : method getDistributionManagement()
location: class org.apache.maven.model.Profile


[INFO] ------------------------------------------------------------------------
[INFO] Trace
org.apache.maven.BuildFailureException: Compilation failure
	at org.apache.maven.lifecycle.DefaultLifecycleExecutor.executeGoals(DefaultLifecycleExecutor.java:579)
	at org.apache.maven.lifecycle.DefaultLifecycleExecutor.executeGoalWithLifecycle(DefaultLifecycleExecutor.java:499)
	at org.apache.maven.lifecycle.DefaultLifecycleExecutor.executeGoal(DefaultLifecycleExecutor.java:478)
	at org.apache.maven.lifecycle.DefaultLifecycleExecutor.executeGoalAndHandleFailures(DefaultLifecycleExecutor.java:330)
	at org.apache.maven.lifecycle.DefaultLifecycleExecutor.executeTaskSegments(DefaultLifecycleExecutor.java:291)
	at org.apache.maven.lifecycle.DefaultLifecycleExecutor.execute(DefaultLifecycleExecutor.java:142)
	at org.apache.maven.DefaultMaven.doExecute(DefaultMaven.java:336)
	at org.apache.maven.DefaultMaven.execute(DefaultMaven.java:129)
	at org.apache.maven.cli.MavenCli.main(MavenCli.java:287)
	at sun.reflect.NativeMethodAccessorImpl.invoke0(Native Method)
	at sun.reflect.NativeMethodAccessorImpl.invoke(NativeMethodAccessorImpl.java:39)
	at sun.reflect.DelegatingMethodAccessorImpl.invoke(DelegatingMethodAccessorImpl.java:25)
	at java.lang.reflect.Method.invoke(Method.java:585)
	at org.codehaus.classworlds.Launcher.launchEnhanced(Launcher.java:315)
	at org.codehaus.classworlds.Launcher.launch(Launcher.java:255)
	at org.codehaus.classworlds.Launcher.mainWithExitCode(Launcher.java:430)
	at org.codehaus.classworlds.Launcher.main(Launcher.java:375)
Caused by: org.apache.maven.plugin.CompilationFailureException: Compilation failure
	at org.apache.maven.plugin.AbstractCompilerMojo.execute(AbstractCompilerMojo.java:516)
	at org.apache.maven.plugin.CompilerMojo.execute(CompilerMojo.java:114)
	at org.apache.maven.plugin.DefaultPluginManager.executeMojo(DefaultPluginManager.java:451)
	at org.apache.maven.lifecycle.DefaultLifecycleExecutor.executeGoals(DefaultLifecycleExecutor.java:558)
	... 16 more
[INFO] ------------------------------------------------------------------------
[INFO] Total time: 24 seconds
[INFO] Finished at: Sun Jun 29 09:17:18 CDT 2008
[INFO] Final Memory: 51M/423M
[INFO] ------------------------------------------------------------------------


Mime
View raw message