maven-notifications mailing list archives

Site index · List index
Message view « Date » · « Thread »
Top « Date » · « Thread »
From Hudson <Hud...@sonatype.org>
Subject Build failed in Hudson: Maven-2.0.x » Maven Project Builder #134
Date Sun, 29 Jun 2008 14:02:14 GMT
See http://ci.sonatype.org/job/Maven-2.0.x/org.apache.maven$maven-project/134/changes

------------------------------------------
[INFO] ------------------------------------------------------------------------
[INFO] Building Maven Project Builder
[INFO]    task-segment: [clean, install]
[INFO] ------------------------------------------------------------------------
[INFO] [clean:clean]
[INFO] Deleting directory http://ci.sonatype.org/job/Maven-2.0.x/org.apache.maven$maven-project/ws/target

[INFO] Deleting directory http://ci.sonatype.org/job/Maven-2.0.x/org.apache.maven$maven-project/ws/target/classes

[INFO] Deleting directory http://ci.sonatype.org/job/Maven-2.0.x/org.apache.maven$maven-project/ws/target/test-classes

[INFO] Deleting directory http://ci.sonatype.org/job/Maven-2.0.x/org.apache.maven$maven-project/ws/target/site

Downloading: http://localhost:8081/nexus/content/groups/public/org/codehaus/plexus/plexus-interpolation/1.0/plexus-interpolation-1.0.pom
1K downloaded
Downloading: http://localhost:8081/nexus/content/groups/public/org/codehaus/plexus/plexus-interpolation/1.0/plexus-interpolation-1.0.jar
33K downloaded
[INFO] [remote-resources:process {execution: default}]
[INFO] [resources:resources]
[INFO] Using default encoding to copy filtered resources.
[INFO] [compiler:compile]
[INFO] Compiling 46 source files to http://ci.sonatype.org/job/Maven-2.0.x/org.apache.maven$maven-project/ws/target/classes

[HUDSON] Archiving http://ci.sonatype.org/job/Maven-2.0.x/org.apache.maven$maven-project/ws/pom.xml
 to /home/j2ee-hudson/.hudson/jobs/Maven-2.0.x/modules/org.apache.maven$maven-project/builds/2008-06-29_09-01-26/archive/org.apache.maven/maven-project/2.0.10-SNAPSHOT/pom.xml
[INFO] ------------------------------------------------------------------------
[ERROR] BUILD FAILURE
[INFO] ------------------------------------------------------------------------
[INFO] Compilation failure

http://ci.sonatype.org/job/Maven-2.0.x/org.apache.maven$maven-project/ws/src/main/java/org/apache/maven/project/injection/DefaultProfileInjector.java
:[362,50] cannot find symbol
symbol  : method getDistributionManagement()
location: class org.apache.maven.model.Profile

http://ci.sonatype.org/job/Maven-2.0.x/org.apache.maven$maven-project/ws/src/main/java/org/apache/maven/project/ModelUtils.java
:[630,16] cannot find symbol
symbol  : method getDistributionManagement()
location: class org.apache.maven.model.Profile


[INFO] ------------------------------------------------------------------------
[INFO] Trace
org.apache.maven.BuildFailureException: Compilation failure
	at org.apache.maven.lifecycle.DefaultLifecycleExecutor.executeGoals(DefaultLifecycleExecutor.java:579)
	at org.apache.maven.lifecycle.DefaultLifecycleExecutor.executeGoalWithLifecycle(DefaultLifecycleExecutor.java:499)
	at org.apache.maven.lifecycle.DefaultLifecycleExecutor.executeGoal(DefaultLifecycleExecutor.java:478)
	at org.apache.maven.lifecycle.DefaultLifecycleExecutor.executeGoalAndHandleFailures(DefaultLifecycleExecutor.java:330)
	at org.apache.maven.lifecycle.DefaultLifecycleExecutor.executeTaskSegments(DefaultLifecycleExecutor.java:291)
	at org.apache.maven.lifecycle.DefaultLifecycleExecutor.execute(DefaultLifecycleExecutor.java:142)
	at org.apache.maven.lifecycle.LifecycleExecutorInterceptor.execute(LifecycleExecutorInterceptor.java:42)
	at org.apache.maven.DefaultMaven.doExecute(DefaultMaven.java:336)
	at org.apache.maven.DefaultMaven.execute(DefaultMaven.java:129)
	at org.apache.maven.cli.MavenCli.main(MavenCli.java:287)
	at sun.reflect.NativeMethodAccessorImpl.invoke0(Native Method)
	at sun.reflect.NativeMethodAccessorImpl.invoke(NativeMethodAccessorImpl.java:39)
	at sun.reflect.DelegatingMethodAccessorImpl.invoke(DelegatingMethodAccessorImpl.java:25)
	at java.lang.reflect.Method.invoke(Method.java:597)
	at org.codehaus.classworlds.Launcher.launchEnhanced(Launcher.java:315)
	at org.codehaus.classworlds.Launcher.launch(Launcher.java:255)
	at hudson.maven.agent.Main.launch(Main.java:111)
	at hudson.maven.MavenBuilder.call(MavenBuilder.java:129)
	at hudson.maven.MavenModuleSetBuild$Builder.call(MavenModuleSetBuild.java:522)
	at hudson.maven.MavenModuleSetBuild$Builder.call(MavenModuleSetBuild.java:468)
	at hudson.remoting.UserRequest.perform(UserRequest.java:69)
	at hudson.remoting.UserRequest.perform(UserRequest.java:23)
	at hudson.remoting.Request$2.run(Request.java:200)
	at java.util.concurrent.Executors$RunnableAdapter.call(Executors.java:441)
	at java.util.concurrent.FutureTask$Sync.innerRun(FutureTask.java:303)
	at java.util.concurrent.FutureTask.run(FutureTask.java:138)
	at java.util.concurrent.ThreadPoolExecutor$Worker.runTask(ThreadPoolExecutor.java:885)
	at java.util.concurrent.ThreadPoolExecutor$Worker.run(ThreadPoolExecutor.java:907)
	at java.lang.Thread.run(Thread.java:619)
Caused by: org.apache.maven.plugin.CompilationFailureException: Compilation failure
	at org.apache.maven.plugin.AbstractCompilerMojo.execute(AbstractCompilerMojo.java:516)
	at org.apache.maven.plugin.CompilerMojo.execute(CompilerMojo.java:114)
	at org.apache.maven.plugin.DefaultPluginManager.executeMojo(DefaultPluginManager.java:451)
	at hudson.maven.agent.PluginManagerInterceptor.executeMojo(PluginManagerInterceptor.java:136)
	at org.apache.maven.lifecycle.DefaultLifecycleExecutor.executeGoals(DefaultLifecycleExecutor.java:558)
	... 28 more
[INFO] ------------------------------------------------------------------------
[INFO] Total time: 45 seconds
[INFO] Finished at: Sun Jun 29 09:02:13 CDT 2008
[INFO] Final Memory: 82M/416M
[INFO] ------------------------------------------------------------------------


Mime
View raw message