maven-notifications mailing list archives

Site index · List index
Message view « Date » · « Thread »
Top « Date » · « Thread »
From Hudson <Hud...@sonatype.org>
Subject Build failed in Hudson: Maven-2.1.x #165
Date Thu, 26 Jun 2008 17:17:20 GMT
See http://ci.sonatype.org/job/Maven-2.1.x/165/changes

Changes:

[John Casey] Adding -V|--show-version, and cleaning up interpolation to correspond with recent
refactoriing in 2.0.x branch. Also, changing super-POM to use basedir/build.directory expressions
in build paths, to enable paths to respond to changes in other, more basic paths (like outputDirectory
responding to a change in build.directory). This is in preparation for merging over the dynamicBuild
behavior.

------------------------------------------
started
Updating https://svn.apache.org/repos/asf/maven/components/trunk
U         maven-core/src/main/java/org/apache/maven/execution/DefaultMavenExecutionRequest.java
U         maven-core/src/main/java/org/apache/maven/execution/MavenSession.java
U         maven-core/src/main/java/org/apache/maven/extension/DefaultBuildExtensionScanner.java
U         maven-project/src/test/java/org/apache/maven/project/interpolation/RegexBasedModelInterpolatorTest.java
U         maven-project/src/main/java/org/apache/maven/project/ProjectBuilderConfiguration.java
AU        maven-project/src/main/java/org/apache/maven/project/interpolation/BuildTimestampValueSource.java
U         maven-project/src/main/java/org/apache/maven/project/interpolation/PathTranslatingValueSource.java
U         maven-project/src/main/java/org/apache/maven/project/interpolation/ModelInterpolator.java
U         maven-project/src/main/java/org/apache/maven/project/interpolation/RegexBasedModelInterpolator.java
U         maven-project/src/main/java/org/apache/maven/project/DefaultMavenProjectBuilder.java
U         maven-project/src/main/java/org/apache/maven/project/DefaultProjectBuilderConfiguration.java
U         maven-project/src/main/resources/org/apache/maven/project/pom-4.0.0.xml
U         maven-embedder/src/main/java/org/apache/maven/cli/CLIManager.java
U         maven-embedder/src/main/java/org/apache/maven/cli/MavenCli.java
At revision 671953
[maven-2.1.x] $ /opt/maven/2.0/bin/mvn clean deploy -B -U -e -Dmaven.repo.local=/home/j2ee-hudson/repos/Maven-2.1.x
-Pstrict -Dsurefire.useFile=false
+ Error stacktraces are turned on.
[INFO] Scanning for projects...
Downloading: http://localhost:8081/nexus/content/groups/public/org/apache/maven/maven-parent/8/maven-parent-8.pom
23K downloaded
[WARNING] *** CHECKSUM FAILED - Invalid checksum file - RETRYING
Downloading: http://localhost:8081/nexus/content/groups/public/org/apache/maven/maven-parent/8/maven-parent-8.pom
23K downloaded
[WARNING] *** CHECKSUM FAILED - Invalid checksum file - IGNORING
Downloading: http://localhost:8081/nexus/content/groups/public/org/apache/maven/maven-parent/8/maven-parent-8.pom
23K downloaded
[WARNING] *** CHECKSUM FAILED - Invalid checksum file - RETRYING
Downloading: http://localhost:8081/nexus/content/groups/public/org/apache/maven/maven-parent/8/maven-parent-8.pom
23K downloaded
[WARNING] *** CHECKSUM FAILED - Invalid checksum file - IGNORING
Downloading: http://localhost:8081/nexus/content/groups/public/org/apache/maven/maven-parent/8/maven-parent-8.pom
23K downloaded
[WARNING] *** CHECKSUM FAILED - Invalid checksum file - RETRYING
Downloading: http://localhost:8081/nexus/content/groups/public/org/apache/maven/maven-parent/8/maven-parent-8.pom
23K downloaded
[WARNING] *** CHECKSUM FAILED - Invalid checksum file - IGNORING
[INFO] ------------------------------------------------------------------------
[ERROR] FATAL ERROR
[INFO] ------------------------------------------------------------------------
[INFO] Failed to resolve artifact.

GroupId: org.apache.maven
ArtifactId: maven-parent
Version: 8

Reason: Unable to download the artifact from any repository

  org.apache.maven:maven-parent:pom:8

from the specified remote repositories:
  Nexus (http://localhost:8081/nexus/content/groups/public)


[INFO] ------------------------------------------------------------------------
[INFO] Trace
org.apache.maven.reactor.MavenExecutionException: Cannot find parent: org.apache.maven:maven-parent
for project: null:maven:pom:2.1-SNAPSHOT for project null:maven:pom:2.1-SNAPSHOT
	at org.apache.maven.DefaultMaven.getProjects(DefaultMaven.java:378)
	at org.apache.maven.DefaultMaven.doExecute(DefaultMaven.java:292)
	at org.apache.maven.DefaultMaven.execute(DefaultMaven.java:129)
	at org.apache.maven.cli.MavenCli.main(MavenCli.java:287)
	at sun.reflect.NativeMethodAccessorImpl.invoke0(Native Method)
	at sun.reflect.NativeMethodAccessorImpl.invoke(NativeMethodAccessorImpl.java:39)
	at sun.reflect.DelegatingMethodAccessorImpl.invoke(DelegatingMethodAccessorImpl.java:25)
	at java.lang.reflect.Method.invoke(Method.java:585)
	at org.codehaus.classworlds.Launcher.launchEnhanced(Launcher.java:315)
	at org.codehaus.classworlds.Launcher.launch(Launcher.java:255)
	at org.codehaus.classworlds.Launcher.mainWithExitCode(Launcher.java:430)
	at org.codehaus.classworlds.Launcher.main(Launcher.java:375)
Caused by: org.apache.maven.project.ProjectBuildingException: Cannot find parent: org.apache.maven:maven-parent
for project: null:maven:pom:2.1-SNAPSHOT for project null:maven:pom:2.1-SNAPSHOT
	at org.apache.maven.project.DefaultMavenProjectBuilder.assembleLineage(DefaultMavenProjectBuilder.java:1370)
	at org.apache.maven.project.DefaultMavenProjectBuilder.buildInternal(DefaultMavenProjectBuilder.java:821)
	at org.apache.maven.project.DefaultMavenProjectBuilder.buildFromSourceFileInternal(DefaultMavenProjectBuilder.java:506)
	at org.apache.maven.project.DefaultMavenProjectBuilder.build(DefaultMavenProjectBuilder.java:198)
	at org.apache.maven.DefaultMaven.getProject(DefaultMaven.java:583)
	at org.apache.maven.DefaultMaven.collectProjects(DefaultMaven.java:461)
	at org.apache.maven.DefaultMaven.getProjects(DefaultMaven.java:365)
	... 11 more
Caused by: org.apache.maven.project.ProjectBuildingException: POM 'org.apache.maven:maven-parent'
not found in repository: Unable to download the artifact from any repository

  org.apache.maven:maven-parent:pom:8

from the specified remote repositories:
  Nexus (http://localhost:8081/nexus/content/groups/public)
 for project org.apache.maven:maven-parent
	at org.apache.maven.project.DefaultMavenProjectBuilder.findModelFromRepository(DefaultMavenProjectBuilder.java:603)
	at org.apache.maven.project.DefaultMavenProjectBuilder.assembleLineage(DefaultMavenProjectBuilder.java:1366)
	... 17 more
Caused by: org.apache.maven.artifact.resolver.ArtifactNotFoundException: Unable to download
the artifact from any repository

  org.apache.maven:maven-parent:pom:8

from the specified remote repositories:
  Nexus (http://localhost:8081/nexus/content/groups/public)

	at org.apache.maven.artifact.resolver.DefaultArtifactResolver.resolve(DefaultArtifactResolver.java:212)
	at org.apache.maven.artifact.resolver.DefaultArtifactResolver.resolve(DefaultArtifactResolver.java:74)
	at org.apache.maven.project.DefaultMavenProjectBuilder.findModelFromRepository(DefaultMavenProjectBuilder.java:556)
	... 18 more
Caused by: org.apache.maven.wagon.ResourceDoesNotExistException: Unable to download the artifact
from any repository
	at org.apache.maven.artifact.manager.DefaultWagonManager.getArtifact(DefaultWagonManager.java:331)
	at org.apache.maven.artifact.resolver.DefaultArtifactResolver.resolve(DefaultArtifactResolver.java:200)
	... 20 more
[INFO] ------------------------------------------------------------------------
[INFO] Total time: < 1 second
[INFO] Finished at: Thu Jun 26 12:17:20 CDT 2008
[INFO] Final Memory: 2M/134M
[INFO] ------------------------------------------------------------------------


Mime
View raw message