maven-notifications mailing list archives

Site index · List index
Message view « Date » · « Thread »
Top « Date » · « Thread »
From Hudson <Hud...@sonatype.org>
Subject Build failed in Hudson: Maven-2.1.x #169
Date Fri, 27 Jun 2008 17:49:01 GMT
See http://ci.sonatype.org/job/Maven-2.1.x/169/changes

------------------------------------------
[...truncated 2516 lines...]
[INFO] Executing: svn --non-interactive diff
[INFO] Working directory: http://ci.sonatype.org/job/Maven-2.1.x/ws/maven-2.1.x/maven-embedder/target/scm-plugin-from-embedder

[INFO] 
Tests run: 1, Failures: 0, Errors: 0, Skipped: 0, Time elapsed: 0.746 sec
Running org.apache.maven.cli.TestEmbedderLogger
Tests run: 0, Failures: 0, Errors: 0, Skipped: 0, Time elapsed: 0.003 sec
Running org.apache.maven.embedder.MavenEmbedderProjectWithExtensionReadingTest
[INFO] Scanning for projects...
[INFO] ------------------------------------------------------------------------
[INFO] Building Maven Quick Start Archetype
[INFO] 
[INFO] Id: org.apache.maven:embedder-test-project:jar:1.0-SNAPSHOT
[INFO] task-segment: [package]
[INFO] ------------------------------------------------------------------------
[INFO] [resources:resources]
[INFO] Using default encoding to copy filtered resources.
[INFO] [compiler:compile]
[INFO] Compiling 1 source file to http://ci.sonatype.org/job/Maven-2.1.x/ws/maven-2.1.x/maven-embedder/target/embedder-test-project0/home/j2ee-hudson/.hudson/jobs/Maven-2.1.x/workspace/maven-2.1.x/maven-embedder/target/embedder-test-project0/target/classes

[INFO] [resources:testResources]
[INFO] Using default encoding to copy filtered resources.
[INFO] [compiler:testCompile]
[INFO] Compiling 1 source file to http://ci.sonatype.org/job/Maven-2.1.x/ws/maven-2.1.x/maven-embedder/target/embedder-test-project0/home/j2ee-hudson/.hudson/jobs/Maven-2.1.x/workspace/maven-2.1.x/maven-embedder/target/embedder-test-project0/target/test-classes

[INFO] [surefire:test]
[INFO] Surefire report directory: http://ci.sonatype.org/job/Maven-2.1.x/ws/maven-2.1.x/maven-embedder/target/embedder-test-project0/target/surefire-reports


-------------------------------------------------------
 T E S T S
-------------------------------------------------------
Running org.apache.maven.AppTest
Tests run: 1, Failures: 0, Errors: 0, Skipped: 0, Time elapsed: 0.034 sec

Results :

Tests run: 1, Failures: 0, Errors: 0, Skipped: 0

[INFO] [jar:jar]
[INFO] Building jar: http://ci.sonatype.org/job/Maven-2.1.x/ws/maven-2.1.x/maven-embedder/target/embedder-test-project0/target/embedder-test-project-1.0-SNAPSHOT.jar

[INFO] Scanning for projects...
[INFO] ------------------------------------------------------------------------
[INFO] Building Maven Quick Start Archetype
[INFO] 
[INFO] Id: org.apache.maven:embedder-test-project:jar:1.0-SNAPSHOT
[INFO] task-segment: [package]
[INFO] ------------------------------------------------------------------------
[INFO] [resources:resources]
[INFO] Using default encoding to copy filtered resources.
[INFO] [compiler:compile]
[INFO] Compiling 1 source file to http://ci.sonatype.org/job/Maven-2.1.x/ws/maven-2.1.x/maven-embedder/target/embedder-test-project1/home/j2ee-hudson/.hudson/jobs/Maven-2.1.x/workspace/maven-2.1.x/maven-embedder/target/embedder-test-project1/target/classes

[INFO] [resources:testResources]
[INFO] Using default encoding to copy filtered resources.
[INFO] [compiler:testCompile]
[INFO] Compiling 1 source file to http://ci.sonatype.org/job/Maven-2.1.x/ws/maven-2.1.x/maven-embedder/target/embedder-test-project1/home/j2ee-hudson/.hudson/jobs/Maven-2.1.x/workspace/maven-2.1.x/maven-embedder/target/embedder-test-project1/target/test-classes

[INFO] [surefire:test]
[INFO] Surefire report directory: http://ci.sonatype.org/job/Maven-2.1.x/ws/maven-2.1.x/maven-embedder/target/embedder-test-project1/target/surefire-reports


-------------------------------------------------------
 T E S T S
-------------------------------------------------------
Running org.apache.maven.AppTest
Tests run: 1, Failures: 0, Errors: 0, Skipped: 0, Time elapsed: 0.033 sec

Results :

Tests run: 1, Failures: 0, Errors: 0, Skipped: 0

[INFO] [jar:jar]
[INFO] Building jar: http://ci.sonatype.org/job/Maven-2.1.x/ws/maven-2.1.x/maven-embedder/target/embedder-test-project1/target/embedder-test-project-1.0-SNAPSHOT.jar

[INFO] Scanning for projects...
[INFO] ------------------------------------------------------------------------
[INFO] Building Maven Quick Start Archetype
[INFO] 
[INFO] Id: org.apache.maven:embedder-test-project:jar:1.0-SNAPSHOT
[INFO] task-segment: [validate]
[INFO] ------------------------------------------------------------------------
[INFO] Scanning for projects...
[INFO] ------------------------------------------------------------------------
[INFO] Building Maven Quick Start Archetype
[INFO] 
[INFO] Id: org.apache.maven:embedder-test-project:jar:1.0-SNAPSHOT
[INFO] task-segment: [validate]
[INFO] ------------------------------------------------------------------------
[INFO] Scanning for projects...
[INFO] ------------------------------------------------------------------------
[INFO] Building Maven Quick Start Archetype
[INFO] 
[INFO] Id: org.apache.maven:embedder-test-project:jar:1.0-SNAPSHOT
[INFO] task-segment: [package]
[INFO] ------------------------------------------------------------------------
[INFO] [resources:resources]
[INFO] Using default encoding to copy filtered resources.
[INFO] [compiler:compile]
[INFO] Compiling 1 source file to http://ci.sonatype.org/job/Maven-2.1.x/ws/maven-2.1.x/maven-embedder/target/embedder-test-project-caching/home/j2ee-hudson/.hudson/jobs/Maven-2.1.x/workspace/maven-2.1.x/maven-embedder/target/embedder-test-project-caching/target/classes

[INFO] [resources:testResources]
[INFO] Using default encoding to copy filtered resources.
[INFO] [compiler:testCompile]
[INFO] Compiling 1 source file to http://ci.sonatype.org/job/Maven-2.1.x/ws/maven-2.1.x/maven-embedder/target/embedder-test-project-caching/home/j2ee-hudson/.hudson/jobs/Maven-2.1.x/workspace/maven-2.1.x/maven-embedder/target/embedder-test-project-caching/target/test-classes

[INFO] [surefire:test]
[INFO] Surefire report directory: http://ci.sonatype.org/job/Maven-2.1.x/ws/maven-2.1.x/maven-embedder/target/embedder-test-project-caching/target/surefire-reports


-------------------------------------------------------
 T E S T S
-------------------------------------------------------
Running org.apache.maven.AppTest
Tests run: 1, Failures: 0, Errors: 0, Skipped: 0, Time elapsed: 0.026 sec

Results :
Tests run: 1, Failures: 0, Errors: 0, Skipped: 0

[INFO] [jar:jar]
[INFO] Building jar: http://ci.sonatype.org/job/Maven-2.1.x/ws/maven-2.1.x/maven-embedder/target/embedder-test-project-caching/target/embedder-test-project-1.0-SNAPSHOT.jar

[INFO] Scanning for projects...
[INFO] ------------------------------------------------------------------------
[INFO] Building Maven Quick Start Archetype
[INFO] 
[INFO] Id: org.apache.maven:embedder-test-project:jar:1.0-SNAPSHOT
[INFO] task-segment: [package]
[INFO] ------------------------------------------------------------------------
[INFO] [resources:resources]
[INFO] Using default encoding to copy filtered resources.
[INFO] [compiler:compile]
[INFO] Nothing to compile - all classes are up to date
[INFO] [resources:testResources]
[INFO] Using default encoding to copy filtered resources.
[INFO] [compiler:testCompile]
[INFO] Nothing to compile - all classes are up to date
[INFO] [surefire:test]
[INFO] Surefire report directory: http://ci.sonatype.org/job/Maven-2.1.x/ws/maven-2.1.x/maven-embedder/target/embedder-test-project-caching/target/surefire-reports


-------------------------------------------------------
 T E S T S
-------------------------------------------------------
Running org.apache.maven.AppTest
Tests run: 1, Failures: 0, Errors: 0, Skipped: 0, Time elapsed: 0.028 sec

Results :

Tests run: 1, Failures: 0, Errors: 0, Skipped: 0

[INFO] [jar:jar]
Tests run: 16, Failures: 0, Errors: 0, Skipped: 0, Time elapsed: 8.191 sec
Running org.apache.maven.cli.MavenCliTest
Tests run: 1, Failures: 0, Errors: 0, Skipped: 0, Time elapsed: 0.029 sec
Running org.apache.maven.embedder.MavenEmbedderExampleTest
[INFO] Scanning for projects...
[INFO] ------------------------------------------------------------------------
[INFO] Building simple-project
[INFO] 
[INFO] Id: org.apache.maven.embedder:simple-project:jar:1.0-SNAPSHOT
[INFO] task-segment: [clean, install]
[INFO] ------------------------------------------------------------------------
[INFO] [clean:clean]
[INFO] Deleting directory http://ci.sonatype.org/job/Maven-2.1.x/ws/maven-2.1.x/maven-embedder/src/examples/simple-project/target

[INFO] Deleting directory http://ci.sonatype.org/job/Maven-2.1.x/ws/maven-2.1.x/maven-embedder/src/examples/simple-project/home/j2ee-hudson/.hudson/jobs/Maven-2.1.x/workspace/maven-2.1.x/maven-embedder/src/examples/simple-project/target/classes

[INFO] Deleting directory http://ci.sonatype.org/job/Maven-2.1.x/ws/maven-2.1.x/maven-embedder/src/examples/simple-project/home/j2ee-hudson/.hudson/jobs/Maven-2.1.x/workspace/maven-2.1.x/maven-embedder/src/examples/simple-project/target/test-classes

[INFO] [resources:resources]
[INFO] Using default encoding to copy filtered resources.
[INFO] [compiler:compile]
[INFO] Compiling 1 source file to http://ci.sonatype.org/job/Maven-2.1.x/ws/maven-2.1.x/maven-embedder/src/examples/simple-project/home/j2ee-hudson/.hudson/jobs/Maven-2.1.x/workspace/maven-2.1.x/maven-embedder/src/examples/simple-project/target/classes

[INFO] [resources:testResources]
[INFO] Using default encoding to copy filtered resources.
[INFO] [compiler:testCompile]
[INFO] Compiling 1 source file to http://ci.sonatype.org/job/Maven-2.1.x/ws/maven-2.1.x/maven-embedder/src/examples/simple-project/home/j2ee-hudson/.hudson/jobs/Maven-2.1.x/workspace/maven-2.1.x/maven-embedder/src/examples/simple-project/target/test-classes

[INFO] [surefire:test]
[INFO] Surefire report directory: http://ci.sonatype.org/job/Maven-2.1.x/ws/maven-2.1.x/maven-embedder/src/examples/simple-project/target/surefire-reports


-------------------------------------------------------
 T E S T S
-------------------------------------------------------
Running org.apache.maven.embedder.AppTest
Tests run: 1, Failures: 0, Errors: 0, Skipped: 0, Time elapsed: 0.034 sec

Results :

Tests run: 1, Failures: 0, Errors: 0, Skipped: 0

[INFO] [jar:jar]
[INFO] Building jar: http://ci.sonatype.org/job/Maven-2.1.x/ws/maven-2.1.x/maven-embedder/src/examples/simple-project/target/simple-project-1.0-SNAPSHOT.jar

[INFO] [install:install]
[INFO] Installing http://ci.sonatype.org/job/Maven-2.1.x/ws/maven-2.1.x/maven-embedder/src/examples/simple-project/target/simple-project-1.0-SNAPSHOT.jar
 to /home/j2ee-hudson/.m2/repository/org/apache/maven/embedder/simple-project/1.0-SNAPSHOT/simple-project-1.0-SNAPSHOT.jar
You are working in the 'development' environment!
Tests run: 3, Failures: 0, Errors: 0, Skipped: 0, Time elapsed: 2.578 sec
Running org.apache.maven.cli.CLIRequestUtilsTest
key=value
[]
Tests run: 2, Failures: 0, Errors: 0, Skipped: 0, Time elapsed: 0.143 sec
Running org.apache.maven.embedder.MavenEmbedderEventingTest
Test source dir: http://ci.sonatype.org/job/Maven-2.1.x/ws/maven-2.1.x/maven-embedder/src/test/eventing-projects/simple-read-project

Test temp dir: http://ci.sonatype.org/job/Maven-2.1.x/ws/maven-2.1.x/maven-embedder/target/eventing-projects/simple-read-project

Test source dir: http://ci.sonatype.org/job/Maven-2.1.x/ws/maven-2.1.x/maven-embedder/src/test/eventing-projects/read-with-deps

Test temp dir: http://ci.sonatype.org/job/Maven-2.1.x/ws/maven-2.1.x/maven-embedder/target/eventing-projects/read-with-deps

Test source dir: http://ci.sonatype.org/job/Maven-2.1.x/ws/maven-2.1.x/maven-embedder/src/test/eventing-projects/simple-read-project

Test temp dir: http://ci.sonatype.org/job/Maven-2.1.x/ws/maven-2.1.x/maven-embedder/target/eventing-projects/simple-read-project

[INFO] Scanning for projects...
[INFO] ------------------------------------------------------------------------
[INFO] Building Unnamed - testing:simple-read-project:jar:1
[INFO] 
[INFO] Id: testing:simple-read-project:jar:1
[INFO] task-segment: [clean]
[INFO] ------------------------------------------------------------------------
[INFO] [clean:clean]
Tests run: 4, Failures: 0, Errors: 0, Skipped: 0, Time elapsed: 0.59 sec

Results :

Failed tests: 
  testReportErrorInterpolatingModel_UsingModelInstance(org.apache.maven.error.ErrorReporterPointcutTest)

Tests run: 113, Failures: 1, Errors: 0, Skipped: 0

[INFO] ------------------------------------------------------------------------
[ERROR] BUILD FAILURE
[INFO] ------------------------------------------------------------------------
[INFO] There are test failures.

Please refer to http://ci.sonatype.org/job/Maven-2.1.x/ws/maven-2.1.x/maven-embedder/target/surefire-reports
 for the individual test results.
[INFO] ------------------------------------------------------------------------
[INFO] Trace
org.apache.maven.BuildFailureException: There are test failures.

Please refer to http://ci.sonatype.org/job/Maven-2.1.x/ws/maven-2.1.x/maven-embedder/target/surefire-reports
 for the individual test results.
	at org.apache.maven.lifecycle.DefaultLifecycleExecutor.executeGoals(DefaultLifecycleExecutor.java:579)
	at org.apache.maven.lifecycle.DefaultLifecycleExecutor.executeGoalWithLifecycle(DefaultLifecycleExecutor.java:499)
	at org.apache.maven.lifecycle.DefaultLifecycleExecutor.executeGoal(DefaultLifecycleExecutor.java:478)
	at org.apache.maven.lifecycle.DefaultLifecycleExecutor.executeGoalAndHandleFailures(DefaultLifecycleExecutor.java:330)
	at org.apache.maven.lifecycle.DefaultLifecycleExecutor.executeTaskSegments(DefaultLifecycleExecutor.java:291)
	at org.apache.maven.lifecycle.DefaultLifecycleExecutor.execute(DefaultLifecycleExecutor.java:142)
	at org.apache.maven.DefaultMaven.doExecute(DefaultMaven.java:336)
	at org.apache.maven.DefaultMaven.execute(DefaultMaven.java:129)
	at org.apache.maven.cli.MavenCli.main(MavenCli.java:287)
	at sun.reflect.NativeMethodAccessorImpl.invoke0(Native Method)
	at sun.reflect.NativeMethodAccessorImpl.invoke(NativeMethodAccessorImpl.java:39)
	at sun.reflect.DelegatingMethodAccessorImpl.invoke(DelegatingMethodAccessorImpl.java:25)
	at java.lang.reflect.Method.invoke(Method.java:585)
	at org.codehaus.classworlds.Launcher.launchEnhanced(Launcher.java:315)
	at org.codehaus.classworlds.Launcher.launch(Launcher.java:255)
	at org.codehaus.classworlds.Launcher.mainWithExitCode(Launcher.java:430)
	at org.codehaus.classworlds.Launcher.main(Launcher.java:375)
Caused by: org.apache.maven.plugin.MojoFailureException: There are test failures.

Please refer to http://ci.sonatype.org/job/Maven-2.1.x/ws/maven-2.1.x/maven-embedder/target/surefire-reports
 for the individual test results.
	at org.apache.maven.plugin.surefire.SurefirePlugin.execute(SurefirePlugin.java:530)
	at org.apache.maven.plugin.DefaultPluginManager.executeMojo(DefaultPluginManager.java:451)
	at org.apache.maven.lifecycle.DefaultLifecycleExecutor.executeGoals(DefaultLifecycleExecutor.java:558)
	... 16 more
[INFO] ------------------------------------------------------------------------
[INFO] Total time: 1 minute 55 seconds
[INFO] Finished at: Fri Jun 27 12:49:01 CDT 2008
[INFO] Final Memory: 66M/511M
[INFO] ------------------------------------------------------------------------


Mime
View raw message